{
    "population": 32906491.6,
    "contact": 10,
    "beds": 2.77,
    "demographics": [
        0.121,
        0.129,
        0.140,
        0.133,
        0.123,
        0.130,
        0.115,
        0.070,
        0.031,
        0.008]
}

    
