%YAML 1.1
%TAG !u! tag:unity3d.com,2011:
--- !u!1045 &1
EditorBuildSettings:
  m_ObjectHideFlags: 0
  serializedVersion: 2
  m_Scenes:
  - enabled: 1
    path: Assets/Scenes/MyMainMenu.unity
    guid: 65daa643e0703814a895f1bf44fe07ac
  - enabled: 1
    path: Assets/Scenes/MyGame.unity
    guid: 0da2d20a60200a34fb101f5572296d24
  - enabled: 1
    path: Assets/Scenes/GameOver.unity
    guid: be1d8942586dad04dbc938f5791ab053
  - enabled: 1
    path: Assets/Scenes/Instructions.unity
    guid: bd1e4b480bcc0a94988bfe81c60163ed
  - enabled: 1
    path: Assets/Scenes/Credits.unity
    guid: d9c30ced8200d6c4eb5e6ebba890684e
