uswdat001
uswdhcp001
USWACS002
uswsql303
uswswp001
uswswp001
uswVftp002
USWCTX551
uswiis302 
uswedi003
uswend002
usffls010
uswepm001
uswVobi003
uswctx500
USWVSUS1201 
uswctx527
uswscm801
uswVctx001
uswVepm003
uswvsql301
uswdhcp002
uswVacs001
uswVcan001
uswvsam001
uswcwi502
