dns	ip_eoc_failover	ip_woc_failover	type	Zone
mdmhealthcare	192.168.20.99	192.168.0.32	A	securitasinc.com
mdmnoca	192.168.20.99	192.168.0.32	A	securitasinc.com
mdmnocent	192.168.20.99	192.168.0.32	A	securitasinc.com
mdmparagon	192.168.20.99	192.168.0.32	A	securitasinc.com
mdmrkymtn	192.168.20.99	192.168.0.32	A	securitasinc.com
mdmmobile	192.168.20.99	192.168.0.32	A	securitasinc.com
mdmscg	192.168.20.99	192.168.0.32	A	securitasinc.com
mdmscis	192.168.20.99	192.168.0.32	A	securitasinc.com
mdmsocal	192.168.20.99	192.168.0.32	A	securitasinc.com
mdmsocent	192.168.20.99	192.168.0.32	A	securitasinc.com
mdmwoc	192.168.20.99	192.168.0.32	A	securitasinc.com
Fspddbwc2	10.1.64.209	10.1.19.121	A	us.pinkertons.com
Fspdwawc2	10.1.64.225	10.1.19.122	A	us.pinkertons.com
Hrpddbwc2	10.1.64.226	10.1.17.170	A	us.pinkertons.com
Hrpdwawc2	10.1.64.227	10.1.17.171	A	us.pinkertons.com
Vxpdwawc1	10.1.64.228	10.1.19.202	A	us.pinkertons.com
uswvsql320	10.1.64.237	10.1.16.124	A	us.pinkertons.com
uswvsql321	10.1.64.238	10.1.16.123	A	us.pinkertons.com
uswvsql322	10.1.64.239	10.1.16.125	A	us.pinkertons.com
uswvsql323	10.1.64.241	10.1.16.126	A	us.pinkertons.com
uswvsql324	10.1.64.242	10.1.16.127	A	us.pinkertons.com
uswvsql325	10.1.64.243	10.1.16.128	A	us.pinkertons.com
uswvsql326	10.1.64.244	10.1.16.129	A	us.pinkertons.com
Fspddbwc2	10.1.64.209	10.1.19.121	A	us.pinkertons.com
Fspdwawc2	10.1.64.225	10.1.19.122	A	us.pinkertons.com
Hrpddbwc2	10.1.64.226	10.1.17.170	A	us.pinkertons.com
Hrpdwawc2	10.1.64.227	10.1.17.171	A	us.pinkertons.com
Vxpdwawc1	10.1.64.228	10.1.19.202	A	us.pinkertons.com
uswvsql320	10.1.64.237	10.1.16.124	A	us.pinkertons.com
uswvsql321	10.1.64.238	10.1.16.123	A	us.pinkertons.com
uswvsql322	10.1.64.239	10.1.16.125	A	us.pinkertons.com
uswvsql323	10.1.64.241	10.1.16.126	A	us.pinkertons.com
uswvsql324	10.1.64.242	10.1.16.127	A	us.pinkertons.com
uswvsql325	10.1.64.243	10.1.16.128	A	us.pinkertons.com
uswvsql326	10.1.64.244	10.1.16.129	A	us.pinkertons.com
