#TYPE Selected.Microsoft.ActiveDirectory.Management.ADUser,
SamAccountName,HomeDirectory
SBarraga,\\napecfs01\DR_usr_home01\WOCUsers\SBarraga018
MBjorlin,\\napecfs01\DR_usr_home01\WOCUsers\MBjorlin
EInsley,\\napecfs01\DR_usr_home01\WOCUsers\einsley016
Asturge,\\napecfs01\DR_usr_home01\WOCUsers\aungaray010
DAronowi,\\napecfs01\DR_usr_home01\WOCUsers\daronowitz963
MChandle,\\napecfs01\DR_usr_home01\WOCUsers\mchandler017
CBeimfor,\\napecfs01\DR_usr_home01\WOCUsers\cbeimfor010
SCurry01,\\napecfs01\DR_usr_home01\WOCUsers\SCurry
LFRANCO,\\napecfs01\DR_usr_home01\WOCUsers\lfranco017
DArnone,\\napecfs01\DR_usr_home01\WOCUsers\DArnone
FHugo,\\napecfs01\DR_usr_home01\WOCUsers\fhugo
BMiddlet,\\napecfs01\DR_usr_home01\WOCUsers\bmiddlet013
Gkahn,\\napecfs01\DR_usr_home01\WOCUsers\gkahn
GAkuna,\\napecfs01\DR_usr_home01\WOCUsers\gakuna043
GLand,\\napecfs01\DR_usr_home01\WOCUsers\gland964
TMarceau,\\napecfs01\DR_usr_home01\WOCUsers\TMarceau018
EWilliam02,\\napecfs01\DR_usr_home01\WOCUsers\ewilliams041
RBell02,\\napecfs01\DR_usr_home01\WOCUsers\rbell089
JPark,\\napecfs01\DR_usr_home01\WOCUsers\jpark018
SHurns,\\napecfs01\DR_usr_home01\WOCUsers\shurns023
RSmith01,\\napecfs01\DR_usr_home01\WOCUsers\rsmith032
AUrness,\\napecfs01\DR_usr_home01\WOCUsers\AUrness023
SLianoz,\\napecfs01\DR_usr_home01\WOCUsers\slianoz018
bgaynor,\\napecfs01\DR_usr_home01\WOCUsers\bgaynor964
QMcRoden,\\napecfs01\DR_usr_home01\WOCUsers\qmcroden023
SGowder,\\napecfs01\DR_usr_home01\WOCUsers\sgowder025
LDhanuko,\\napecfs01\DR_usr_home01\WOCUsers\LDhanuko
MLUKE,\\napecfs01\DR_usr_home01\WOCUsers\mluke009
RHawkins,\\napecfs01\DR_usr_home01\WOCUsers\RHawkins
SPaul,\\napecfs01\DR_usr_home01\WOCUsers\spaul030
JPAREDES,\\napecfs01\DR_usr_home01\WOCUsers\jparedes089
MValenci,\\napecfs01\DR_usr_home01\WOCUsers\MValencia
KReedy,\\napecfs01\DR_usr_home01\WOCUsers\kreedy016
GOwen,\\napecfs01\DR_usr_home01\WOCUsers\gowen965
GFlores02,\\napecfs01\DR_usr_home01\WOCUsers\gflores02
JKatz01,\\napecfs01\DR_usr_home01\WOCUsers\jkatz965
MDeMello,\\napecfs01\DR_usr_home01\WOCUsers\MDeMello
CDoregio,\\napecfs01\DR_usr_home01\WOCUsers\cdoregios043
RRavindr,\\napecfs01\DR_usr_home01\WOCUsers\rravindr965
JWhitt,\\napecfs01\DR_usr_home01\WOCUsers\jwhitt
MEspino,\\napecfs01\DR_usr_home01\WOCUsers\mespino018
RHu,\\napecfs01\DR_usr_home01\WOCUsers\rhu964
MBradbur,\\napecfs01\DR_usr_home01\WOCUsers\mbradbury040
LAlamill,\\napecfs01\DR_usr_home01\WOCUsers\lalamillo043
MWahl,\\napecfs01\DR_usr_home01\WOCUsers\mwahl018
TScarbro,\\napecfs01\DR_usr_home01\WOCUsers\tscarbrough094d0
PJanard,\\napecfs01\DR_usr_home01\WOCUsers\gchandri960
ASepulve,\\napecfs01\DR_usr_home01\WOCUsers\asepulve018
DFautt,\\napecfs01\DR_usr_home01\WOCUsers\dfautt018
MLedbett,\\napecfs01\DR_usr_home01\WOCUsers\LMoats045
RCruz,\\napecfs01\DR_usr_home01\WOCUsers\rcruz017
MMccormi,\\napecfs01\DR_usr_home01\WOCUsers\MMccormi00430
LMorales,\\napecfs01\DR_usr_home01\WOCUsers\lmorales018
KMizumot,\\napecfs01\DR_usr_home01\WOCUsers\KMizumot089
IMILLS,\\napecfs01\DR_usr_home01\WOCUsers\imills017
Bhernand,\\napecfs01\DR_usr_home01\WOCUsers\bhernand
RVargas,\\napecfs01\DR_usr_home01\WOCUsers\rvargas043
DCollins,\\napecfs01\DR_usr_home01\WOCUsers\DCollins47167
jledbett,\\napecfs01\DR_usr_home01\WOCUsers\jledbett964
TFly,\\napecfs01\DR_usr_home01\WOCUsers\TFly
AMempin,\\napecfs01\DR_usr_home01\WOCUsers\amempin964
LActis,\\napecfs01\DR_usr_home01\WOCUsers\lactis60857
ATolenti,\\napecfs01\DR_usr_home01\WOCUsers\ATolenti
CAnderso,\\napecfs01\DR_usr_home01\WOCUsers\CAnderso
EOlson,\\napecfs01\DR_usr_home01\WOCUsers\EOlson
BBotwin,\\napecfs01\DR_usr_home01\WOCUsers\bklevs032
KIblings,\\napecfs01\DR_usr_home01\WOCUsers\kiblings045
SBuehner,\\napecfs01\DR_usr_home01\WOCUsers\sbuehner022
THornbac,\\napecfs01\DR_usr_home01\WOCUsers\THornback040
DLeef,\\napecfs01\DR_usr_home01\WOCUsers\dleef023
PWilliam,\\napecfs01\DR_usr_home01\WOCUsers\pwilliam983
OPanduro,\\napecfs01\DR_usr_home01\WOCUsers\opanduro030
JGarcia,\\napecfs01\DR_usr_home01\WOCUsers\jgarcia
AVillalt,\\napecfs01\DR_usr_home01\WOCUsers\avillalta018
rMyers,\\napecfs01\DR_usr_home01\WOCUsers\rmyers023
KRall,\\napecfs01\DR_usr_home01\WOCUsers\KRall
SRenteri,\\napecfs01\DR_usr_home01\WOCUsers\srenteri023
KRichard,\\napecfs01\DR_usr_home01\WOCUsers\krichard032
EQuach,\\napecfs01\DR_usr_home01\WOCUsers\equach097d
JSchneid,\\napecfs01\DR_usr_home01\WOCUsers\jschneid964
BMinnich,\\napecfs01\DR_usr_home01\WOCUsers\bminnich016
LIngram,\\napecfs01\DR_usr_home01\WOCUsers\LIngram
MPintar,\\napecfs01\DR_usr_home01\WOCUsers\mpintar018
TRizvi,\\napecfs01\DR_usr_home01\WOCUsers\trizvi964
MTurner01,\\napecfs01\DR_usr_home01\WOCUsers\mturner023
EFlores02,\\napecfs01\DR_usr_home01\WOCUsers\EFlores
NMetellu,\\napecfs01\DR_usr_home01\WOCUsers\NMetellus
ADelReal,\\napecfs01\DR_usr_home01\WOCUsers\adelreal030
KUsman,\\napecfs01\DR_usr_home01\WOCUsers\KBrenner47167
LMoats,\\napecfs01\DR_usr_home01\WOCUsers\LMoats045
MShafagh,\\napecfs01\DR_usr_home01\WOCUsers\MShafaghat018
MErpenba,\\napecfs01\DR_usr_home01\WOCUsers\merpenba965
JDeLaFue,\\napecfs01\DR_usr_home01\WOCUsers\jdelafue017
EBastian,\\napecfs01\DR_usr_home01\WOCUsers\EBastian018
ELIEN,\\napecfs01\DR_usr_home01\WOCUsers\elien964
FKetab,\\napecfs01\DR_usr_home01\WOCUsers\fketabfo041
SCopsey,\\napecfs01\DR_usr_home01\WOCUsers\scopsey965
CBeleno,\\napecfs01\DR_usr_home01\WOCUsers\CBeleno
HLlosa,\\napecfs01\DR_usr_home01\WOCUsers\hllosa040
VGill,\\napecfs01\DR_usr_home01\WOCUsers\vgill
JHopkins01,\\napecfs01\DR_usr_home01\WOCUsers\JHopkins
SNalband,\\napecfs01\DR_usr_home01\WOCUsers\snalband030
KOliver,\\napecfs01\DR_usr_home01\WOCUsers\KOliver
HHeryant,\\napecfs01\DR_usr_home01\WOCUsers\hheryant030
EPrater,\\napecfs01\DR_usr_home01\WOCUsers\eprater043
DPRICE,\\napecfs01\DR_usr_home01\WOCUsers\dprice965
SFayard,\\napecfs01\DR_usr_home01\WOCUsers\SFayard
GLiley,\\napecfs01\DR_usr_home01\WOCUsers\GLiley61350
EKim,\\napecfs01\DR_usr_home01\WOCUsers\ekim
JPantos,\\napecfs01\DR_usr_home01\WOCUsers\jpantos034
LMendoza,\\napecfs01\DR_usr_home01\WOCUsers\lmendoza018
CFreeman01,\\napecfs01\DR_usr_home01\WOCUsers\cfreeman023
CCastle,\\napecfs01\DR_usr_home01\WOCUsers\ccastle008
VAvetisy,\\napecfs01\DR_usr_home01\WOCUsers\vavetisy010
SESCOBAR,\\napecfs01\DR_usr_home01\WOCUsers\sescobar032
LLuker,\\napecfs01\DR_usr_home01\WOCUsers\lluker964
SAradhya,\\napecfs01\DR_usr_home01\WOCUsers\saradhya025
TRoszhar,\\napecfs01\DR_usr_home01\WOCUsers\troszhar022
BAbert,\\napecfs01\DR_usr_home01\WOCUsers\babert032
BBarrick,\\napecfs01\DR_usr_home01\WOCUsers\bbarrick013
LHall,\\napecfs01\DR_usr_home01\WOCUsers\lhall016
JGill,\\napecfs01\DR_usr_home01\WOCUsers\jgill964
SCelestre,\\napecfs01\DR_usr_home01\WOCUsers\scelestre018
SMCLAIN,\\napecfs01\DR_usr_home01\WOCUsers\smclain010
JLombard,\\napecfs01\DR_usr_home01\WOCUsers\jlombard008
MMayhue,\\napecfs01\DR_usr_home01\WOCUsers\mmayhue017
DBrokish,\\napecfs01\DR_usr_home01\WOCUsers\DBrokish
LVartape,\\napecfs01\DR_usr_home01\WOCUsers\lvartape032
PLiu,\\napecfs01\DR_usr_home01\WOCUsers\pliu964
RMoore01,\\napecfs01\DR_usr_home01\WOCUsers\rmoore032
RKoval,\\napecfs01\DR_usr_home01\WOCUsers\rgregory023
PChandru,\\napecfs01\DR_usr_home01\WOCUsers\pchandru210
FLondon,\\napecfs01\DR_usr_home01\WOCUsers\flondon041
DSchmidt,\\napecfs01\DR_usr_home01\WOCUsers\dschmidt040
PMyles,\\napecfs01\DR_usr_home01\WOCUsers\pmyles018
GWoods,\\napecfs01\DR_usr_home01\WOCUsers\gwoods
PMaher,\\napecfs01\DR_usr_home01\WOCUsers\pmaher034
BBartlet,\\napecfs01\DR_usr_home01\WOCUsers\bbartlet018
JRocha,\\napecfs01\DR_usr_home01\WOCUsers\jrocha041
DWelcome,\\napecfs01\DR_usr_home01\WOCUsers\dwelcome010
TPersson,\\napecfs01\DR_usr_home01\WOCUsers\tpersson041
AAgawin,\\napecfs01\DR_usr_home01\WOCUsers\aagawin040
SAllen,\\napecfs01\DR_usr_home01\WOCUsers\sallen049
JLara,\\napecfs01\DR_usr_home01\WOCUsers\jlara041
PInsley,\\napecfs01\DR_usr_home01\WOCUsers\pinsley016
VPatel,\\napecfs01\DR_usr_home01\WOCUsers\vpatel963
MRedmon,\\napecfs01\DR_usr_home01\WOCUsers\mredmon040
RPERISSI,\\napecfs01\DR_usr_home01\WOCUsers\rperissi040
JMatthew01,\\napecfs01\DR_usr_home01\WOCUsers\jkim041
SJacobs,\\napecfs01\DR_usr_home01\WOCUsers\SJacobs
Mkubiak,\\napecfs01\DR_usr_home01\WOCUsers\mkubiak089
CYanez,\\napecfs01\DR_usr_home01\WOCUsers\cyanez010
MRenyer,\\napecfs01\DR_usr_home01\WOCUsers\mrenyer041
NSeikaly,\\napecfs01\DR_usr_home01\WOCUsers\nsaikali010
TSecor,\\napecfs01\DR_usr_home01\WOCUsers\tsecor018
NKim,\\napecfs01\DR_usr_home01\WOCUsers\NKim
DMutt,\\napecfs01\DR_usr_home01\WOCUsers\dmutt
mvertefe,\\napecfs01\DR_usr_home01\WOCUsers\mvertefe008
GChandri,\\napecfs01\DR_usr_home01\WOCUsers\gchandri960
Zsnider,\\napecfs01\DR_usr_home01\WOCUsers\Zsnider
CTester1,\\napecfs01\DR_usr_home01\WOCUsers\CTester1
MAyala,\\napecfs01\DR_usr_home01\WOCUsers\MAyala089
PHuge,\\napecfs01\DR_usr_home01\WOCUsers\phuge041
LKELLNER,\\napecfs01\DR_usr_home01\WOCUsers\lkellner031
STasledH,\\napecfs01\DR_usr_home01\WOCUsers\stasledh983
RGanesh,\\napecfs01\DR_usr_home01\WOCUsers\rganesh
PKS01,\\napecfs01\DR_usr_home01\WOCUsers\PKS01
SKabbina,\\napecfs01\DR_usr_home01\WOCUsers\SKabbina
DBarstow,\\napecfs01\DR_usr_home01\WOCUsers\dbarstow041
DSchrobs,\\napecfs01\DR_usr_home01\WOCUsers\dschrobs089
JA,\\napecfs01\DR_usr_home01\WOCUsers\JA
JBRABANT,\\napecfs01\DR_usr_home01\WOCUsers\jbrabant010
KJinKalp,\\napecfs01\DR_usr_home01\WOCUsers\KJinKalp
RJonnala,\\napecfs01\DR_usr_home01\WOCUsers\rjonnala963
MPOPE,\\napecfs01\DR_usr_home01\WOCUsers\mpope041
LCoglian,\\napecfs01\DR_usr_home01\WOCUsers\lcoglian964
ALevkov,\\napecfs01\DR_usr_home01\WOCUsers\alevkov963
LCollet,\\napecfs01\DR_usr_home01\WOCUsers\lcollet041
LPolte,\\napecfs01\DR_usr_home01\WOCUsers\lsylvies041
AStevens,\\napecfs01\DR_usr_home01\WOCUsers\astevens032
AMcClure,\\napecfs01\DR_usr_home01\WOCUsers\AMcClure
ESTAFFOR,\\napecfs01\DR_usr_home01\WOCUsers\estaffor034
BPhillip,\\napecfs01\DR_usr_home01\WOCUsers\bphillip032
Asedlets,\\napecfs01\DR_usr_home01\WOCUsers\asedlets
MVelasqu,\\napecfs01\DR_usr_home01\WOCUsers\MVelasqu
rolivier,\\napecfs01\DR_usr_home01\WOCUsers\rolivier964
CDevared,\\napecfs01\DR_usr_home01\WOCUsers\cdevared
ACabral,\\napecfs01\DR_usr_home01\WOCUsers\acabral032
DCrawfor,\\napecfs01\DR_usr_home01\WOCUsers\dcrawfor041
PChen,\\napecfs01\DR_usr_home01\WOCUsers\pchen
VMiller,\\napecfs01\DR_usr_home01\WOCUsers\vmiller032
RHeatwol,\\napecfs01\DR_usr_home01\WOCUsers\rheatwol964
JFiguero01,\\napecfs01\DR_usr_home01\WOCUsers\jfiguero018
AKaczke,\\napecfs01\DR_usr_home01\WOCUsers\akaczke018
LAvila,\\napecfs01\DR_usr_home01\WOCUsers\lavila030
JMiwok,\\napecfs01\DR_usr_home01\WOCUsers\jmiwok030
RDowler,\\napecfs01\DR_usr_home01\WOCUsers\rsandova022
Vvonderg,\\napecfs01\DR_usr_home01\WOCUsers\VvonderGracht018
CBlair01,\\napecfs01\DR_usr_home01\WOCUsers\cblair964
DSun,\\napecfs01\DR_usr_home01\WOCUsers\dsun010
JBERGARA,\\napecfs01\DR_usr_home01\WOCUsers\jbergara022
JTALBOT,\\napecfs01\DR_usr_home01\WOCUsers\jtalbot041
CHueneke,\\napecfs01\DR_usr_home01\WOCUsers\chueneke041
JRodrigu,\\napecfs01\DR_usr_home01\WOCUsers\JRODRIGU965
LSong,\\napecfs01\DR_usr_home01\WOCUsers\lsong964
YAlcanta,\\napecfs01\DR_usr_home01\WOCUsers\YAlcantar
LKlionsk,\\napecfs01\DR_usr_home01\WOCUsers\lklionsk041
DGarza01,\\napecfs01\DR_usr_home01\WOCUsers\DGarza01
BGrimm,\\napecfs01\DR_usr_home01\WOCUsers\BGrimm
KChan,\\napecfs01\DR_usr_home01\WOCUsers\KChan
JStrenk,\\napecfs01\DR_usr_home01\WOCUsers\jstrenk
PMelende,\\napecfs01\DR_usr_home01\WOCUsers\pmelendez018
SDavis02,\\napecfs01\DR_usr_home01\WOCUsers\sdavis040
MVargoNa,\\napecfs01\DR_usr_home01\WOCUsers\mvargona040
Rsin,\\napecfs01\DR_usr_home01\WOCUsers\rsin
JRosal,\\napecfs01\DR_usr_home01\WOCUsers\jrosal010
OMenchac,\\napecfs01\DR_usr_home01\WOCUsers\omenchaca016
BDitzel,\\napecfs01\DR_usr_home01\WOCUsers\bditzel023
JCameron,\\napecfs01\DR_usr_home01\WOCUsers\JCameron
JVagle,\\napecfs01\DR_usr_home01\WOCUsers\JVagle090
FPrebble,\\napecfs01\DR_usr_home01\WOCUsers\fprebble016
JMorgan,\\napecfs01\DR_usr_home01\WOCUsers\jmorgan018
JSteiger,\\napecfs01\DR_usr_home01\WOCUsers\jsteiger041
EFlores,\\napecfs01\DR_usr_home01\WOCUsers\eflores018
JWhitake,\\napecfs01\DR_usr_home01\WOCUsers\jwhitake018
KMcCormi,\\napecfs01\DR_usr_home01\WOCUsers\KMcCormi
MHARPRIN,\\napecfs01\DR_usr_home01\WOCUsers\mharprin018
KChavez,\\napecfs01\DR_usr_home01\WOCUsers\kchavez043
GYousefp,\\napecfs01\DR_usr_home01\WOCUsers\gyousefp965
THutmach,\\napecfs01\DR_usr_home01\WOCUsers\thutmach018
TStone,\\napecfs01\DR_usr_home01\WOCUsers\tstone
GRHODES,\\napecfs01\DR_usr_home01\WOCUsers\grhodes018
CVANOSTR,\\napecfs01\DR_usr_home01\WOCUsers\cvanostr010
MGifford,\\napecfs01\DR_usr_home01\WOCUsers\mgifford016
EGomez,\\napecfs01\DR_usr_home01\WOCUsers\EGomez
DKatz,\\napecfs01\DR_usr_home01\WOCUsers\DKatz
RMusser,\\napecfs01\DR_usr_home01\WOCUsers\rmusser983
KChowdhu,\\napecfs01\DR_usr_home01\WOCUsers\kchowdhu
ABridges,\\napecfs01\DR_usr_home01\WOCUsers\abridges018
DGoerner,\\napecfs01\DR_usr_home01\WOCUsers\dgoerner021
GSTROTHE,\\napecfs01\DR_usr_home01\WOCUsers\gstrothe021
RBryan,\\napecfs01\DR_usr_home01\WOCUsers\RBryan
KAgarwal,\\napecfs01\DR_usr_home01\WOCUsers\rjonnala963
JCross,\\napecfs01\DR_usr_home01\WOCUsers\JCross
DRenyer,\\napecfs01\DR_usr_home01\WOCUsers\drenyer041
SHernand,\\napecfs01\DR_usr_home01\WOCUsers\shernand032
GDay,\\napecfs01\DR_usr_home01\WOCUsers\gday034
REllison,\\napecfs01\DR_usr_home01\WOCUsers\rellison023
NKeeney,\\napecfs01\DR_usr_home01\WOCUsers\NKeeney964
RTeufel,\\napecfs01\DR_usr_home01\WOCUsers\rteufel010
MKatzman,\\napecfs01\DR_usr_home01\WOCUsers\mkatzman018
MButler,\\napecfs01\DR_usr_home01\WOCUsers\mbutler021
JMunozVi,\\napecfs01\DR_usr_home01\WOCUsers\JMunozVi
lMendez,\\napecfs01\DR_usr_home01\WOCUsers\lmendez045
ORIDLEY,\\napecfs01\DR_usr_home01\WOCUsers\oridley034
EStoerme,\\napecfs01\DR_usr_home01\WOCUsers\estoerme025
DHolland,\\napecfs01\DR_usr_home01\WOCUsers\dholland965
RFerens,\\napecfs01\DR_usr_home01\WOCUsers\rferens041
CAdams01,\\napecfs01\DR_usr_home01\WOCUsers\cadams016
bkaler!,\\napecfs01\DR_usr_home01\WOCUsers\cadams016
