#TYPE Selected.Microsoft.ActiveDirectory.Management.ADComputer
"Name","OperatingSystem","OperatingSystemServicePack"
"USWPRNT01","Windows Server? 2008 Standard","Service Pack 2"
"USWSPT004","Windows Server? 2008 Enterprise","Service Pack 2"
"USWTRN001","Windows Server? 2008 Standard","Service Pack 1"
"USECTX530","Windows Server? 2008 Standard","Service Pack 2"
"CAMONDS3","Windows Server? 2008 Standard","Service Pack 2"
"USEFAS055","Windows Server? 2008 Standard","Service Pack 2"
"USECTX590","Windows Server? 2008 Enterprise","Service Pack 2"
"USECTX591","Windows Server? 2008 Enterprise","Service Pack 2"
"USECTX560","Windows Server? 2008 Standard","Service Pack 2"
"USWSPT007","Windows Server? 2008 Standard","Service Pack 2"
"USWSPT006","Windows Server? 2008 Enterprise","Service Pack 2"
"USWCTX560","Windows Server? 2008 Standard","Service Pack 1"
"USWCTX561","Windows Server? 2008 Standard","Service Pack 2"
"USEVOX001","Windows Server? 2008 Standard","Service Pack 2"
"USWCTX535","Windows Server? 2008 Standard","Service Pack 1"
"USWCTX534","Windows Server? 2008 Standard","Service Pack 1"
"USWCTX590","Windows Server? 2008 Enterprise","Service Pack 1"
"USWSPT008","Windows Server? 2008 Enterprise","Service Pack 2"
"USWTRN002","Windows Server? 2008 Standard","Service Pack 1"
"USWCTX591","Windows Server? 2008 Enterprise","Service Pack 1"
"USWCPM001","Windows Server? 2008 Standard","Service Pack 2"
"USEVOX002","Windows Server? 2008 Standard","Service Pack 2"
"USEVOX003","Windows Server? 2008 Standard","Service Pack 2"
"USWCTX562","Windows Server? 2008 Standard","Service Pack 1"
"USWCTX563","Windows Server? 2008 Standard","Service Pack 1"
"USWCTX565","Windows Server? 2008 Standard","Service Pack 1"
"USWCTX564","Windows Server? 2008 Standard","Service Pack 1"
"USWCTX566","Windows Server? 2008 Standard","Service Pack 1"
"USECTX564","Windows Server? 2008 Standard","Service Pack 2"
"USECTX565","Windows Server? 2008 Standard","Service Pack 2"
"USECTX566","Windows Server? 2008 Standard","Service Pack 2"
"USECTX561","Windows Server? 2008 Standard","Service Pack 2"
"USECTX562","Windows Server? 2008 Standard","Service Pack 2"
"USECTX563","Windows Server? 2008 Standard","Service Pack 2"
"USECTX567","Windows Server? 2008 Standard","Service Pack 2"
"USECTX568","Windows Server? 2008 Standard","Service Pack 2"
"USECTX569","Windows Server? 2008 Standard","Service Pack 2"
"USWCTX570","Windows Server? 2008 Standard","Service Pack 1"
"USWCTX569","Windows Server? 2008 Standard","Service Pack 1"
"USWCTX568","Windows Server? 2008 Standard","Service Pack 1"
"USWCTX567","Windows Server? 2008 Standard","Service Pack 1"
"USECTX570","Windows Server? 2008 Standard","Service Pack 2"
"USECTX571","Windows Server? 2008 Standard","Service Pack 2"
"USECTX572","Windows Server? 2008 Standard","Service Pack 2"
"USWCTX571","Windows Server? 2008 Standard","Service Pack 1"
"USWCTX572","Windows Server? 2008 Standard","Service Pack 1"
"USWCTX580","Windows Server? 2008 Standard","Service Pack 1"
"USWCTX581-0","Windows Server? 2008 Standard","Service Pack 1"
"USWCTX582","Windows Server? 2008 Standard","Service Pack 1"
"USWCTX583","Windows Server? 2008 Standard","Service Pack 1"
"USWCTX584","Windows Server? 2008 Standard","Service Pack 1"
"USECTX559B","Windows Server? 2008 Standard","Service Pack 2"
