{
  "Entries": [
    {
      "RequestUri": "https://seanmccprodca.blob.core.windows.net/test-container-7e92020c-5e71-1915-9e3b-ddeb264e3248?restype=container",
      "RequestMethod": "PUT",
      "RequestHeaders": {
        "Authorization": "Sanitized",
        "traceparent": "00-b3b9452a32532646ac077acf9e0145a0-2343b9de497f714c-00",
        "User-Agent": [
          "azsdk-net-Storage.Blobs/12.5.0-dev.20200727.1",
          "(.NET Core 4.6.29017.01; Microsoft Windows 10.0.18362 )"
        ],
        "x-ms-blob-public-access": "container",
        "x-ms-client-request-id": "31bce65b-6352-0361-d58e-f45f70048ae8",
        "x-ms-date": "Mon, 27 Jul 2020 17:49:59 GMT",
        "x-ms-return-client-request-id": "true",
        "x-ms-version": "2019-12-12"
      },
      "RequestBody": null,
      "StatusCode": 201,
      "ResponseHeaders": {
        "Content-Length": "0",
        "Date": "Mon, 27 Jul 2020 17:50:01 GMT",
        "ETag": "\u00220x8D832557C917A04\u0022",
        "Last-Modified": "Mon, 27 Jul 2020 17:50:01 GMT",
        "Server": [
          "Windows-Azure-Blob/1.0",
          "Microsoft-HTTPAPI/2.0"
        ],
        "x-ms-client-request-id": "31bce65b-6352-0361-d58e-f45f70048ae8",
        "x-ms-request-id": "e9fa9b38-401e-0062-1f3e-6453a5000000",
        "x-ms-version": "2019-12-12"
      },
      "ResponseBody": []
    },
    {
      "RequestUri": "https://seanmccprodca.blob.core.windows.net/test-container-7e92020c-5e71-1915-9e3b-ddeb264e3248/test-blob-95b9816f-3f06-2406-315e-305aa9eabf7e",
      "RequestMethod": "PUT",
      "RequestHeaders": {
        "Authorization": "Sanitized",
        "Content-Length": "0",
        "traceparent": "00-6ccc815aab8cdf408ae6bb7fe81f149c-91c967e8dde7d240-00",
        "User-Agent": [
          "azsdk-net-Storage.Blobs/12.5.0-dev.20200727.1",
          "(.NET Core 4.6.29017.01; Microsoft Windows 10.0.18362 )"
        ],
        "x-ms-blob-type": "AppendBlob",
        "x-ms-client-request-id": "d9bbcb8c-a166-1c5b-df98-fff4320759eb",
        "x-ms-date": "Mon, 27 Jul 2020 17:50:00 GMT",
        "x-ms-return-client-request-id": "true",
        "x-ms-version": "2019-12-12"
      },
      "RequestBody": null,
      "StatusCode": 201,
      "ResponseHeaders": {
        "Content-Length": "0",
        "Date": "Mon, 27 Jul 2020 17:50:01 GMT",
        "ETag": "\u00220x8D832557C9AC6A8\u0022",
        "Last-Modified": "Mon, 27 Jul 2020 17:50:01 GMT",
        "Server": [
          "Windows-Azure-Blob/1.0",
          "Microsoft-HTTPAPI/2.0"
        ],
        "x-ms-client-request-id": "d9bbcb8c-a166-1c5b-df98-fff4320759eb",
        "x-ms-request-id": "e9fa9b5b-401e-0062-3e3e-6453a5000000",
        "x-ms-request-server-encrypted": "true",
        "x-ms-version": "2019-12-12",
        "x-ms-version-id": "2020-07-27T17:50:01.7052328Z"
      },
      "ResponseBody": []
    },
    {
      "RequestUri": "https://seanmccprodca.blob.core.windows.net/test-container-7e92020c-5e71-1915-9e3b-ddeb264e3248/test-blob-95b9816f-3f06-2406-315e-305aa9eabf7e?comp=appendblock",
      "RequestMethod": "PUT",
      "RequestHeaders": {
        "Authorization": "Sanitized",
        "Content-Length": "1024",
        "traceparent": "00-2eac595af4ee3b4aa4a5375f42b9ae0b-031dd4e1721ffc4e-00",
        "User-Agent": [
          "azsdk-net-Storage.Blobs/12.5.0-dev.20200727.1",
          "(.NET Core 4.6.29017.01; Microsoft Windows 10.0.18362 )"
        ],
        "x-ms-client-request-id": "860f6fbd-b75d-c8e7-8405-dcc7f9270e93",
        "x-ms-date": "Mon, 27 Jul 2020 17:50:00 GMT",
        "x-ms-return-client-request-id": "true",
        "x-ms-version": "2019-12-12"
      },
      "RequestBody": "z3Va9XRKV2\u002BMLmgOq5kxwJvozd4v5RhjH3Ng\u002BQABWCWeqJ19F83TQnRLTTg4TXFFZj5YSjl7u\u002Blc9tYB6V1uitVDcAL8tKnNFIpp45jgKtICGpPBqA7rIu2zICD30lgW3cJi9dxuSbGVijWuEtdRfMwD/s/KrOLHV00VSZSJ1kIxUgbWfjX1lNHhLB3YPRAVYqRU89OJTDDgm52OWP8dC7TzfL/Rev2WDmr96IDE7xo9AOfvNeJupwbW9uOXZjvRxCBp5MBQROemveVpjGOwG6uDUVgYLdbShdS5\u002B4Qa/6guLCRfWwpZ7Lz/SXf9BBuiJdo3FBXjuZZKll7rlkljjL49OmA\u002BUMCgKWSbGORe1IC4F9Wq4\u002BuSS3KOFcSsblVznL25wMq7ZNUZluqwR6Gy68LeMn9zuajSqu/tsDv89LsOKHsmpBS2/bL/kEwA4gPR2ykCzjvV/\u002BMU5xbazrOZHaEuoR8li0atJzXMcyhb0cfsHNUR\u002BiaAOCmXEr3\u002B2y//ZnOr0kDkq0/jVKYGCIu7uBVO7rHeiCJ6rmj1jnmJr0wFzQ21sP\u002BHCHCFLqWAeS\u002Bd3Fmor\u002B19IN1QMCPX7h3WWaRaADt9BgcVx\u002BVBWVp9\u002BjQ5WLEf4f9eiK0wZIDcrxpTr9QBJXn0INZRkugHPMeD0zXunpVrtnik\u002B3eOTaGHORfL7amFfNS7RDfbzU4XV0zlrJFK7RGE6PlcXCoCZtM0ylnRO04d/ldgM1pdj\u002BgpjaQrqKAQPEsGRwWwKR\u002BquN5kpgP1RRv9yK466rq3JlgQMs6F1r0yJI0Ny/RJbNU3tXp7\u002BejkNEeJLuDx1lKRTiCtoPZRJeIgMoJ153oms1vZAjQ/Oy1vK/2G\u002B6fdQE47fHzTnMze5ZCYW8Zmb0zMY3uFGNMeURPzPXT5yik6Q/E0OWr\u002BUhaP\u002Bxyjp99mCbywuZgsWCh6HStp4F5X5BpmXRjVMjXhzhBk9Ry2eqkzjTS4SBGRDevIuRw/lXK3NxYBPUnHkNaGzuuHyGIMw6OBNVMqn5wJ1VAsDXgYojmdrL4FtDxga/xdMXklCUWIvPV5vV8fjZd6\u002BGj5moNebSyx6hujBg9mIclWzG0j48sKpFGDn\u002BTZfh8ni7zUZ9B4/8NNcx8p5bXmE5yVyMApVhSc7vYy2s5H2Gv8fHpSkbn43syq1m\u002Bs4L6bnIxIQ7Ve/TWoOHjaRiT1BZuzLWg7k4LinOr0f4Ck7w04lj5C/5W1nn9FqlhBHpintNDU\u002BLNVYAgKZabLan20A0hqoa/mswYG/Y/p9ekpoX5STMuw0Pda4jY1OJnu6jMBkKYQ1n3owQHKzvokbGof4MQoeB6yBDNREL95sXtsFxNb6GRDGMoAaYrJ5Q==",
      "StatusCode": 201,
      "ResponseHeaders": {
        "Content-Length": "0",
        "Date": "Mon, 27 Jul 2020 17:50:01 GMT",
        "ETag": "\u00220x8D832557CA41731\u0022",
        "Last-Modified": "Mon, 27 Jul 2020 17:50:01 GMT",
        "Server": [
          "Windows-Azure-Blob/1.0",
          "Microsoft-HTTPAPI/2.0"
        ],
        "x-ms-blob-append-offset": "0",
        "x-ms-blob-committed-block-count": "1",
        "x-ms-client-request-id": "860f6fbd-b75d-c8e7-8405-dcc7f9270e93",
        "x-ms-content-crc64": "aXIpJym1idc=",
        "x-ms-request-id": "e9fa9b6f-401e-0062-503e-6453a5000000",
        "x-ms-request-server-encrypted": "true",
        "x-ms-version": "2019-12-12"
      },
      "ResponseBody": []
    },
    {
      "RequestUri": "https://seanmccprodca.blob.core.windows.net/test-container-7e92020c-5e71-1915-9e3b-ddeb264e3248/test-blob-95b9816f-3f06-2406-315e-305aa9eabf7e",
      "RequestMethod": "HEAD",
      "RequestHeaders": {
        "Authorization": "Sanitized",
        "traceparent": "00-fbaece409fa71c41a0ad9bf2d04325af-36f36cec005d7840-00",
        "User-Agent": [
          "azsdk-net-Storage.Blobs/12.5.0-dev.20200727.1",
          "(.NET Core 4.6.29017.01; Microsoft Windows 10.0.18362 )"
        ],
        "x-ms-client-request-id": "3d30b8d5-f456-1575-96c9-aff9473b04ab",
        "x-ms-date": "Mon, 27 Jul 2020 17:50:00 GMT",
        "x-ms-return-client-request-id": "true",
        "x-ms-version": "2019-12-12"
      },
      "RequestBody": null,
      "StatusCode": 200,
      "ResponseHeaders": {
        "Accept-Ranges": "bytes",
        "Content-Length": "0",
        "Content-Type": "application/octet-stream",
        "Date": "Mon, 27 Jul 2020 17:50:01 GMT",
        "ETag": "\u00220x8D832557CA41731\u0022",
        "Last-Modified": "Mon, 27 Jul 2020 17:50:01 GMT",
        "Server": [
          "Windows-Azure-Blob/1.0",
          "Microsoft-HTTPAPI/2.0"
        ],
        "x-ms-blob-committed-block-count": "1",
        "x-ms-blob-type": "AppendBlob",
        "x-ms-client-request-id": "3d30b8d5-f456-1575-96c9-aff9473b04ab",
        "x-ms-creation-time": "Mon, 27 Jul 2020 17:50:01 GMT",
        "x-ms-is-current-version": "true",
        "x-ms-lease-state": "available",
        "x-ms-lease-status": "unlocked",
        "x-ms-request-id": "e9fa9b8c-401e-0062-6c3e-6453a5000000",
        "x-ms-server-encrypted": "true",
        "x-ms-version": "2019-12-12",
        "x-ms-version-id": "2020-07-27T17:50:01.7052328Z"
      },
      "ResponseBody": []
    },
    {
      "RequestUri": "https://seanmccprodca.blob.core.windows.net/test-container-7e92020c-5e71-1915-9e3b-ddeb264e3248/test-blob-95b9816f-3f06-2406-315e-305aa9eabf7e?comp=appendblock",
      "RequestMethod": "PUT",
      "RequestHeaders": {
        "Authorization": "Sanitized",
        "Content-Length": "1024",
        "If-Match": "\u00220x8D832557CA41731\u0022",
        "User-Agent": [
          "azsdk-net-Storage.Blobs/12.5.0-dev.20200727.1",
          "(.NET Core 4.6.29017.01; Microsoft Windows 10.0.18362 )"
        ],
        "x-ms-client-request-id": "65ab0514-e511-119b-5fba-766f70fa51fb",
        "x-ms-date": "Mon, 27 Jul 2020 17:50:00 GMT",
        "x-ms-return-client-request-id": "true",
        "x-ms-version": "2019-12-12"
      },
      "RequestBody": "6B4yVNpJrZsjl1ChRpnY0FoEQ/p7Q4hKFW3xxTmP259jgmVtQGrsdMFzYsZmRoLqLQtt9eQUGKSW5z9sV\u002BhilLuxPcQza4/vF884B\u002BHC487rB5gtIea6TmnA11gqfxzZEc0KtAi\u002BtsF7fd0U3BHD1ARwgFBPNHLV9u5ac5Q3xZiyX/UUty7FLVDWsqMIpXJY/QNUuf7Mid1aNb4aZEMtRLhFYnwbrxzVqlP/eYLOzFB7AXWQ4guZ5tUYuYFwq8gNqG3rw0P1PE7mfw6qzBBajGltnmLNnGGsrHunA/abZP6L8dAU4wkNhcQnqmP87hnFvS0YAw1mPwwLPhfITjlYShoPH9s/RqhfXxiepvL\u002BsL1i4kbJg2HxJLLECKTyRTeLzl9J7M4\u002BhXaEuKP1yJgaDY5ZZWzyj8e5Hvsoez0EbRrhEteStcPvI1zPRMq9/FwZqfoVmd/KmD\u002BXj87TFgk5f0qIFLXBh1jLaUIPI0r9\u002ByKeDtFC7tQ7FnqX\u002BiX1HA1SlcV/NeemWCKiSi\u002Bcu3T1mpSrNAc395B2Tf06KYwz1k01vI2FfcY6\u002BLavoKSlnlsFomCQSegGG540Cefpay\u002BVbnPiZ/7ncBzOcDxRiFbr0a6iNYYrooxlL6HuUHTeUIyGGTExwzdcHjJEwtistJJISDc5RzapacvnfDhc\u002BB\u002Bn7yCwym8lug53RRZT59\u002BzuXoPpgg8pQlV3a9lSUb\u002BACUTnNO4/OkjIo0pwQEgVYLsM8O\u002BTFIWakoWWu2/v3HIeUXxQEoM\u002Br2Q64N6E\u002BMINYgteRWCQLPT/DGJoqH8ZGMcYUi7LhQ34DkGLWDOm1dmDiVlkkVbRjiRHUMZglgblIcgXrKaTAZz9ZncexJTBGHaIpN7l9EdwBsPKhDQHl3g6pnZrj2lzMEe8Zysf8omPhniP2DEn/22Ap2WiiH1otc8\u002B5B4eVYjNFbSXKU1cUFQ6ez37d/8G0ucI6ufDkGfKU7FcIM6rsTCvgoJ8kJXgJFcRqE1/rT4P99F3FaqhCYVMjNWbwG9FjsoNC/U8ykIRKIaQsifaiuZzTCj9NFtGDnk9L8PARGQni9mDcmFI0y2PZe0kEJedcgIvKLQGiFpuhz18P5p\u002BUORiqOYOVxiFKnk7bc6uIj3hX/3BkRuv4QN/VKskDJNTERUIwWfxjtrpqj47CxqLgGU/Wt/cvL/IsoeijwJtYN3lqBy5pWCWL9Di2CbddNYo85RF5LHztpRVAA7gDv/YfAlgVWM90hsEqWrPOaSY632xuZtuJ7xsMjGIZGURtiDQylvdvN\u002By6uG5ATsG5L0v/FSRLlVkqlRNNGMxta218vNJ/i8Iu25ePo75tOZBJQ20WGgQQIeLrGAHUEi8Q==",
      "StatusCode": 201,
      "ResponseHeaders": {
        "Content-Length": "0",
        "Date": "Mon, 27 Jul 2020 17:50:01 GMT",
        "ETag": "\u00220x8D832557CB5A689\u0022",
        "Last-Modified": "Mon, 27 Jul 2020 17:50:01 GMT",
        "Server": [
          "Windows-Azure-Blob/1.0",
          "Microsoft-HTTPAPI/2.0"
        ],
        "x-ms-blob-append-offset": "1024",
        "x-ms-blob-committed-block-count": "2",
        "x-ms-client-request-id": "65ab0514-e511-119b-5fba-766f70fa51fb",
        "x-ms-content-crc64": "Szg9XXTwgvk=",
        "x-ms-request-id": "e9fa9b9c-401e-0062-7b3e-6453a5000000",
        "x-ms-request-server-encrypted": "true",
        "x-ms-version": "2019-12-12"
      },
      "ResponseBody": []
    },
    {
      "RequestUri": "https://seanmccprodca.blob.core.windows.net/test-container-7e92020c-5e71-1915-9e3b-ddeb264e3248/test-blob-95b9816f-3f06-2406-315e-305aa9eabf7e",
      "RequestMethod": "GET",
      "RequestHeaders": {
        "Authorization": "Sanitized",
        "traceparent": "00-d87df21cd481434497b6c5a171caae07-ce2bcb203e8f5b4f-00",
        "User-Agent": [
          "azsdk-net-Storage.Blobs/12.5.0-dev.20200727.1",
          "(.NET Core 4.6.29017.01; Microsoft Windows 10.0.18362 )"
        ],
        "x-ms-client-request-id": "42e44f93-9e90-b299-eae3-065b50f074a5",
        "x-ms-date": "Mon, 27 Jul 2020 17:50:00 GMT",
        "x-ms-range": "bytes=0-2047",
        "x-ms-return-client-request-id": "true",
        "x-ms-version": "2019-12-12"
      },
      "RequestBody": null,
      "StatusCode": 206,
      "ResponseHeaders": {
        "Accept-Ranges": "bytes",
        "Content-Length": "2048",
        "Content-Range": "bytes 0-2047/2048",
        "Content-Type": "application/octet-stream",
        "Date": "Mon, 27 Jul 2020 17:50:01 GMT",
        "ETag": "\u00220x8D832557CB5A689\u0022",
        "Last-Modified": "Mon, 27 Jul 2020 17:50:01 GMT",
        "Server": [
          "Windows-Azure-Blob/1.0",
          "Microsoft-HTTPAPI/2.0"
        ],
        "x-ms-blob-committed-block-count": "2",
        "x-ms-blob-type": "AppendBlob",
        "x-ms-client-request-id": "42e44f93-9e90-b299-eae3-065b50f074a5",
        "x-ms-creation-time": "Mon, 27 Jul 2020 17:50:01 GMT",
        "x-ms-is-current-version": "true",
        "x-ms-lease-state": "available",
        "x-ms-lease-status": "unlocked",
        "x-ms-request-id": "e9fa9bb4-401e-0062-133e-6453a5000000",
        "x-ms-server-encrypted": "true",
        "x-ms-version": "2019-12-12",
        "x-ms-version-id": "2020-07-27T17:50:01.7052328Z"
      },
      "ResponseBody": "z3Va9XRKV2\u002BMLmgOq5kxwJvozd4v5RhjH3Ng\u002BQABWCWeqJ19F83TQnRLTTg4TXFFZj5YSjl7u\u002Blc9tYB6V1uitVDcAL8tKnNFIpp45jgKtICGpPBqA7rIu2zICD30lgW3cJi9dxuSbGVijWuEtdRfMwD/s/KrOLHV00VSZSJ1kIxUgbWfjX1lNHhLB3YPRAVYqRU89OJTDDgm52OWP8dC7TzfL/Rev2WDmr96IDE7xo9AOfvNeJupwbW9uOXZjvRxCBp5MBQROemveVpjGOwG6uDUVgYLdbShdS5\u002B4Qa/6guLCRfWwpZ7Lz/SXf9BBuiJdo3FBXjuZZKll7rlkljjL49OmA\u002BUMCgKWSbGORe1IC4F9Wq4\u002BuSS3KOFcSsblVznL25wMq7ZNUZluqwR6Gy68LeMn9zuajSqu/tsDv89LsOKHsmpBS2/bL/kEwA4gPR2ykCzjvV/\u002BMU5xbazrOZHaEuoR8li0atJzXMcyhb0cfsHNUR\u002BiaAOCmXEr3\u002B2y//ZnOr0kDkq0/jVKYGCIu7uBVO7rHeiCJ6rmj1jnmJr0wFzQ21sP\u002BHCHCFLqWAeS\u002Bd3Fmor\u002B19IN1QMCPX7h3WWaRaADt9BgcVx\u002BVBWVp9\u002BjQ5WLEf4f9eiK0wZIDcrxpTr9QBJXn0INZRkugHPMeD0zXunpVrtnik\u002B3eOTaGHORfL7amFfNS7RDfbzU4XV0zlrJFK7RGE6PlcXCoCZtM0ylnRO04d/ldgM1pdj\u002BgpjaQrqKAQPEsGRwWwKR\u002BquN5kpgP1RRv9yK466rq3JlgQMs6F1r0yJI0Ny/RJbNU3tXp7\u002BejkNEeJLuDx1lKRTiCtoPZRJeIgMoJ153oms1vZAjQ/Oy1vK/2G\u002B6fdQE47fHzTnMze5ZCYW8Zmb0zMY3uFGNMeURPzPXT5yik6Q/E0OWr\u002BUhaP\u002Bxyjp99mCbywuZgsWCh6HStp4F5X5BpmXRjVMjXhzhBk9Ry2eqkzjTS4SBGRDevIuRw/lXK3NxYBPUnHkNaGzuuHyGIMw6OBNVMqn5wJ1VAsDXgYojmdrL4FtDxga/xdMXklCUWIvPV5vV8fjZd6\u002BGj5moNebSyx6hujBg9mIclWzG0j48sKpFGDn\u002BTZfh8ni7zUZ9B4/8NNcx8p5bXmE5yVyMApVhSc7vYy2s5H2Gv8fHpSkbn43syq1m\u002Bs4L6bnIxIQ7Ve/TWoOHjaRiT1BZuzLWg7k4LinOr0f4Ck7w04lj5C/5W1nn9FqlhBHpintNDU\u002BLNVYAgKZabLan20A0hqoa/mswYG/Y/p9ekpoX5STMuw0Pda4jY1OJnu6jMBkKYQ1n3owQHKzvokbGof4MQoeB6yBDNREL95sXtsFxNb6GRDGMoAaYrJ5egeMlTaSa2bI5dQoUaZ2NBaBEP6e0OIShVt8cU5j9ufY4JlbUBq7HTBc2LGZkaC6i0LbfXkFBikluc/bFfoYpS7sT3EM2uP7xfPOAfhwuPO6weYLSHmuk5pwNdYKn8c2RHNCrQIvrbBe33dFNwRw9QEcIBQTzRy1fbuWnOUN8WYsl/1FLcuxS1Q1rKjCKVyWP0DVLn\u002BzIndWjW\u002BGmRDLUS4RWJ8G68c1apT/3mCzsxQewF1kOILmebVGLmBcKvIDaht68ND9TxO5n8OqswQWoxpbZ5izZxhrKx7pwP2m2T\u002Bi/HQFOMJDYXEJ6pj/O4Zxb0tGAMNZj8MCz4XyE45WEoaDx/bP0aoX18Ynqby/rC9YuJGyYNh8SSyxAik8kU3i85fSezOPoV2hLij9ciYGg2OWWVs8o/HuR77KHs9BG0a4RLXkrXD7yNcz0TKvfxcGan6FZnfypg/l4/O0xYJOX9KiBS1wYdYy2lCDyNK/fsing7RQu7UOxZ6l/ol9RwNUpXFfzXnplgiokovnLt09ZqUqzQHN/eQdk39OimMM9ZNNbyNhX3GOvi2r6CkpZ5bBaJgkEnoBhueNAnn6WsvlW5z4mf\u002B53AcznA8UYhW69GuojWGK6KMZS\u002Bh7lB03lCMhhkxMcM3XB4yRMLYrLSSSEg3OUc2qWnL53w4XPgfp\u002B8gsMpvJboOd0UWU\u002Bffs7l6D6YIPKUJVd2vZUlG/gAlE5zTuPzpIyKNKcEBIFWC7DPDvkxSFmpKFlrtv79xyHlF8UBKDPq9kOuDehPjCDWILXkVgkCz0/wxiaKh/GRjHGFIuy4UN\u002BA5Bi1gzptXZg4lZZJFW0Y4kR1DGYJYG5SHIF6ymkwGc/WZ3HsSUwRh2iKTe5fRHcAbDyoQ0B5d4OqZ2a49pczBHvGcrH/KJj4Z4j9gxJ/9tgKdlooh9aLXPPuQeHlWIzRW0lylNXFBUOns9\u002B3f/BtLnCOrnw5BnylOxXCDOq7Ewr4KCfJCV4CRXEahNf60\u002BD/fRdxWqoQmFTIzVm8BvRY7KDQv1PMpCESiGkLIn2ormc0wo/TRbRg55PS/DwERkJ4vZg3JhSNMtj2XtJBCXnXICLyi0Bohaboc9fD\u002BaflDkYqjmDlcYhSp5O23OriI94V/9wZEbr\u002BEDf1SrJAyTUxEVCMFn8Y7a6ao\u002BOwsai4BlP1rf3Ly/yLKHoo8CbWDd5agcuaVgli/Q4tgm3XTWKPOUReSx87aUVQAO4A7/2HwJYFVjPdIbBKlqzzmkmOt9sbmbbie8bDIxiGRlEbYg0Mpb3bzfsurhuQE7BuS9L/xUkS5VZKpUTTRjMbWttfLzSf4vCLtuXj6O\u002BbTmQSUNtFhoEECHi6xgB1BIvE="
    },
    {
      "RequestUri": "https://seanmccprodca.blob.core.windows.net/test-container-7e92020c-5e71-1915-9e3b-ddeb264e3248?restype=container",
      "RequestMethod": "DELETE",
      "RequestHeaders": {
        "Authorization": "Sanitized",
        "traceparent": "00-c30c9fcb34089843ad49350ec3ac9cb5-416d61dc35a81548-00",
        "User-Agent": [
          "azsdk-net-Storage.Blobs/12.5.0-dev.20200727.1",
          "(.NET Core 4.6.29017.01; Microsoft Windows 10.0.18362 )"
        ],
        "x-ms-client-request-id": "20dc8942-0f16-f96b-bd4f-5ae7ac39be66",
        "x-ms-date": "Mon, 27 Jul 2020 17:50:00 GMT",
        "x-ms-return-client-request-id": "true",
        "x-ms-version": "2019-12-12"
      },
      "RequestBody": null,
      "StatusCode": 202,
      "ResponseHeaders": {
        "Content-Length": "0",
        "Date": "Mon, 27 Jul 2020 17:50:01 GMT",
        "Server": [
          "Windows-Azure-Blob/1.0",
          "Microsoft-HTTPAPI/2.0"
        ],
        "x-ms-client-request-id": "20dc8942-0f16-f96b-bd4f-5ae7ac39be66",
        "x-ms-request-id": "e9fa9bd0-401e-0062-2d3e-6453a5000000",
        "x-ms-version": "2019-12-12"
      },
      "ResponseBody": []
    }
  ],
  "Variables": {
    "RandomSeed": "693163747",
    "Storage_TestConfigDefault": "ProductionTenant\nseanmccprodca\nU2FuaXRpemVk\nhttps://seanmccprodca.blob.core.windows.net\nhttps://seanmccprodca.file.core.windows.net\nhttps://seanmccprodca.queue.core.windows.net\nhttps://seanmccprodca.table.core.windows.net\n\n\n\n\nhttps://seanmccprodca-secondary.blob.core.windows.net\nhttps://seanmccprodca-secondary.file.core.windows.net\nhttps://seanmccprodca-secondary.queue.core.windows.net\nhttps://seanmccprodca-secondary.table.core.windows.net\n\nSanitized\n\n\nCloud\nBlobEndpoint=https://seanmccprodca.blob.core.windows.net/;QueueEndpoint=https://seanmccprodca.queue.core.windows.net/;FileEndpoint=https://seanmccprodca.file.core.windows.net/;BlobSecondaryEndpoint=https://seanmccprodca-secondary.blob.core.windows.net/;QueueSecondaryEndpoint=https://seanmccprodca-secondary.queue.core.windows.net/;FileSecondaryEndpoint=https://seanmccprodca-secondary.file.core.windows.net/;AccountName=seanmccprodca;AccountKey=Kg==;\nseanscope1"
  }
}