{
  "Entries": [
    {
      "RequestUri": "https://azsdknet-test-ta.cognitiveservices.azure.com/text/analytics/v3.1-preview.1/entities/recognition/general?showStats=false",
      "RequestMethod": "POST",
      "RequestHeaders": {
        "Content-Length": "217",
        "Content-Type": "application/json",
        "Ocp-Apim-Subscription-Key": "Sanitized",
        "traceparent": "00-0b1d742ac4de6f43bce2f7eb777b73b3-9e2a79828673094b-00",
        "User-Agent": [
          "azsdk-net-AI.TextAnalytics/5.1.0-dev.20200820.1",
          "(.NET Core 4.6.29017.01; Microsoft Windows 10.0.18363 )"
        ],
        "x-ms-client-request-id": "3ff95858c19275f33d23070f9ab76ce8",
        "x-ms-return-client-request-id": "true"
      },
      "RequestBody": {
        "documents": [
          {
            "id": "0",
            "text": "Microsoft was founded by Bill Gates and Paul Allen.",
            "language": "en"
          },
          {
            "id": "1",
            "text": "",
            "language": "en"
          },
          {
            "id": "2",
            "text": "My cat might need to see a veterinarian.",
            "language": "en"
          }
        ]
      },
      "StatusCode": 200,
      "ResponseHeaders": {
        "apim-request-id": "e3240af6-0627-47c5-ac7e-8ce0b3fa2c6e",
        "Content-Type": "application/json; charset=utf-8",
        "csp-billing-usage": "CognitiveServices.TextAnalytics.BatchScoring=2",
        "Date": "Fri, 21 Aug 2020 02:45:02 GMT",
        "Strict-Transport-Security": "max-age=31536000; includeSubDomains; preload",
        "Transfer-Encoding": "chunked",
        "X-Content-Type-Options": "nosniff",
        "x-envoy-upstream-service-time": "74"
      },
      "ResponseBody": {
        "documents": [
          {
            "id": "0",
            "entities": [
              {
                "text": "Microsoft",
                "category": "Organization",
                "offset": 0,
                "length": 9,
                "confidenceScore": 0.83
              },
              {
                "text": "Bill Gates",
                "category": "Person",
                "offset": 25,
                "length": 10,
                "confidenceScore": 0.85
              },
              {
                "text": "Paul Allen",
                "category": "Person",
                "offset": 40,
                "length": 10,
                "confidenceScore": 0.9
              }
            ],
            "warnings": []
          },
          {
            "id": "2",
            "entities": [
              {
                "text": "veterinarian",
                "category": "PersonType",
                "offset": 27,
                "length": 12,
                "confidenceScore": 0.84
              }
            ],
            "warnings": []
          }
        ],
        "errors": [
          {
            "id": "1",
            "error": {
              "code": "InvalidArgument",
              "message": "Invalid document in request.",
              "innererror": {
                "code": "InvalidDocument",
                "message": "Document text is empty."
              }
            }
          }
        ],
        "modelVersion": "2020-04-01"
      }
    }
  ],
  "Variables": {
    "RandomSeed": "1784295012",
    "TEXT_ANALYTICS_API_KEY": "Sanitized",
    "TEXT_ANALYTICS_ENDPOINT": "https://azsdknet-test-ta.cognitiveservices.azure.com/"
  }
}