{
  "Entries": [
    {
      "RequestUri": "https://azsdknet-test-ta.cognitiveservices.azure.com/text/analytics/v3.1-preview.1/sentiment?showStats=false",
      "RequestMethod": "POST",
      "RequestHeaders": {
        "Content-Length": "54",
        "Content-Type": "application/json",
        "Ocp-Apim-Subscription-Key": "Sanitized",
        "traceparent": "00-66da10e34f23d24491779022ffd0ba0f-35cacc019a7d4849-00",
        "User-Agent": [
          "azsdk-net-AI.TextAnalytics/5.1.0-dev.20200818.1",
          "(.NET Core 4.6.29017.01; Microsoft Windows 10.0.18363 )"
        ],
        "x-ms-client-request-id": "f10ac49aef8ff66365ecb4f9e6429525",
        "x-ms-return-client-request-id": "true"
      },
      "RequestBody": {
        "documents": [
          {
            "id": "1",
            "text": null,
            "language": "en"
          }
        ]
      },
      "StatusCode": 200,
      "ResponseHeaders": {
        "apim-request-id": "eceb0f03-b8d8-4320-b814-b88df3a030f9",
        "Content-Type": "application/json; charset=utf-8",
        "Date": "Wed, 19 Aug 2020 03:21:02 GMT",
        "Strict-Transport-Security": "max-age=31536000; includeSubDomains; preload",
        "Transfer-Encoding": "chunked",
        "X-Content-Type-Options": "nosniff",
        "x-envoy-upstream-service-time": "4"
      },
      "ResponseBody": {
        "documents": [],
        "errors": [
          {
            "id": "1",
            "error": {
              "code": "InvalidArgument",
              "message": "Invalid document in request.",
              "innererror": {
                "code": "InvalidDocument",
                "message": "Document text is empty."
              }
            }
          }
        ],
        "modelVersion": "2020-04-01"
      }
    }
  ],
  "Variables": {
    "RandomSeed": "298076068",
    "TEXT_ANALYTICS_API_KEY": "Sanitized",
    "TEXT_ANALYTICS_ENDPOINT": "https://azsdknet-test-ta.cognitiveservices.azure.com/"
  }
}