{
  "Entries": [
    {
      "RequestUri": "http://seanstagetest.file.core.windows.net/test-share-2040a3bf-4a33-aee5-20dc-b8fe908f8cd5?restype=share",
      "RequestMethod": "PUT",
      "RequestHeaders": {
        "Authorization": "Sanitized",
        "traceparent": "00-c450162eb8ca284090b152a09c5a57a7-ba01dca90fdf1049-00",
        "User-Agent": [
          "azsdk-net-Storage.Files.Shares/12.2.0-dev.20200305.1",
          "(.NET Core 4.6.28325.01; Microsoft Windows 10.0.18363 )"
        ],
        "x-ms-client-request-id": "5dc1db8d-e339-67c1-c752-049c5caf70fc",
        "x-ms-date": "Thu, 05 Mar 2020 21:45:28 GMT",
        "x-ms-return-client-request-id": "true",
        "x-ms-version": "2019-12-12"
      },
      "RequestBody": null,
      "StatusCode": 201,
      "ResponseHeaders": {
        "Content-Length": "0",
        "Date": "Thu, 05 Mar 2020 21:45:28 GMT",
        "ETag": "\u00220x8D7C14E856C638A\u0022",
        "Last-Modified": "Thu, 05 Mar 2020 21:45:28 GMT",
        "Server": [
          "Windows-Azure-File/1.0",
          "Microsoft-HTTPAPI/2.0"
        ],
        "x-ms-client-request-id": "5dc1db8d-e339-67c1-c752-049c5caf70fc",
        "x-ms-request-id": "c9ef6817-f01a-0012-4f37-f3e9eb000000",
        "x-ms-version": "2019-12-12"
      },
      "ResponseBody": []
    },
    {
      "RequestUri": "http://seanstagetest.file.core.windows.net/test-share-2040a3bf-4a33-aee5-20dc-b8fe908f8cd5/test-directory-11631297-4e73-1ebe-18ec-637b940c2c0a?restype=directory",
      "RequestMethod": "PUT",
      "RequestHeaders": {
        "Authorization": "Sanitized",
        "traceparent": "00-d656ebaeaf6f4147afa6de0f3ca20353-f8abd6ba92a9724c-00",
        "User-Agent": [
          "azsdk-net-Storage.Files.Shares/12.2.0-dev.20200305.1",
          "(.NET Core 4.6.28325.01; Microsoft Windows 10.0.18363 )"
        ],
        "x-ms-client-request-id": "7041b948-2db2-3f14-1ca3-454d7f45d2bb",
        "x-ms-date": "Thu, 05 Mar 2020 21:45:28 GMT",
        "x-ms-file-attributes": "None",
        "x-ms-file-creation-time": "Now",
        "x-ms-file-last-write-time": "Now",
        "x-ms-file-permission": "Inherit",
        "x-ms-return-client-request-id": "true",
        "x-ms-version": "2019-12-12"
      },
      "RequestBody": null,
      "StatusCode": 201,
      "ResponseHeaders": {
        "Content-Length": "0",
        "Date": "Thu, 05 Mar 2020 21:45:28 GMT",
        "ETag": "\u00220x8D7C14E857A37E8\u0022",
        "Last-Modified": "Thu, 05 Mar 2020 21:45:28 GMT",
        "Server": [
          "Windows-Azure-File/1.0",
          "Microsoft-HTTPAPI/2.0"
        ],
        "x-ms-client-request-id": "7041b948-2db2-3f14-1ca3-454d7f45d2bb",
        "x-ms-file-attributes": "Directory",
        "x-ms-file-change-time": "2020-03-05T21:45:28.7203816Z",
        "x-ms-file-creation-time": "2020-03-05T21:45:28.7203816Z",
        "x-ms-file-id": "13835128424026341376",
        "x-ms-file-last-write-time": "2020-03-05T21:45:28.7203816Z",
        "x-ms-file-parent-id": "0",
        "x-ms-file-permission-key": "7855875120676328179*422928105932735866",
        "x-ms-request-id": "c9ef6819-f01a-0012-5037-f3e9eb000000",
        "x-ms-request-server-encrypted": "true",
        "x-ms-version": "2019-12-12"
      },
      "ResponseBody": []
    },
    {
      "RequestUri": "http://seanstagetest.file.core.windows.net/test-share-2040a3bf-4a33-aee5-20dc-b8fe908f8cd5/test-directory-11631297-4e73-1ebe-18ec-637b940c2c0a/test-file-2cfff926-ba3e-682e-761e-b7368fda8129",
      "RequestMethod": "PUT",
      "RequestHeaders": {
        "Authorization": "Sanitized",
        "traceparent": "00-cfaf7fd38d79f747b5759abdaebdd0d7-108c39c2a6d8844b-00",
        "User-Agent": [
          "azsdk-net-Storage.Files.Shares/12.2.0-dev.20200305.1",
          "(.NET Core 4.6.28325.01; Microsoft Windows 10.0.18363 )"
        ],
        "x-ms-client-request-id": "a2bc036a-cbef-8ecf-8ad8-f99376deaf41",
        "x-ms-content-length": "1024",
        "x-ms-date": "Thu, 05 Mar 2020 21:45:28 GMT",
        "x-ms-file-attributes": "None",
        "x-ms-file-creation-time": "Now",
        "x-ms-file-last-write-time": "Now",
        "x-ms-file-permission": "Inherit",
        "x-ms-return-client-request-id": "true",
        "x-ms-type": "file",
        "x-ms-version": "2019-12-12"
      },
      "RequestBody": null,
      "StatusCode": 201,
      "ResponseHeaders": {
        "Content-Length": "0",
        "Date": "Thu, 05 Mar 2020 21:45:28 GMT",
        "ETag": "\u00220x8D7C14E858868C4\u0022",
        "Last-Modified": "Thu, 05 Mar 2020 21:45:28 GMT",
        "Server": [
          "Windows-Azure-File/1.0",
          "Microsoft-HTTPAPI/2.0"
        ],
        "x-ms-client-request-id": "a2bc036a-cbef-8ecf-8ad8-f99376deaf41",
        "x-ms-file-attributes": "Archive",
        "x-ms-file-change-time": "2020-03-05T21:45:28.8133828Z",
        "x-ms-file-creation-time": "2020-03-05T21:45:28.8133828Z",
        "x-ms-file-id": "11529285414812647424",
        "x-ms-file-last-write-time": "2020-03-05T21:45:28.8133828Z",
        "x-ms-file-parent-id": "13835128424026341376",
        "x-ms-file-permission-key": "12501538048846835188*422928105932735866",
        "x-ms-request-id": "c9ef681a-f01a-0012-5137-f3e9eb000000",
        "x-ms-request-server-encrypted": "true",
        "x-ms-version": "2019-12-12"
      },
      "ResponseBody": []
    },
    {
      "RequestUri": "http://seanstagetest.file.core.windows.net/test-share-2040a3bf-4a33-aee5-20dc-b8fe908f8cd5/test-directory-11631297-4e73-1ebe-18ec-637b940c2c0a/test-file-2cfff926-ba3e-682e-761e-b7368fda8129?comp=lease",
      "RequestMethod": "PUT",
      "RequestHeaders": {
        "Authorization": "Sanitized",
        "traceparent": "00-1c9561629b5cb04cbce46209cfee7863-380d3eea6135484e-00",
        "User-Agent": [
          "azsdk-net-Storage.Files.Shares/12.2.0-dev.20200305.1",
          "(.NET Core 4.6.28325.01; Microsoft Windows 10.0.18363 )"
        ],
        "x-ms-client-request-id": "cd095681-9af6-7202-1351-015fbac26c86",
        "x-ms-date": "Thu, 05 Mar 2020 21:45:28 GMT",
        "x-ms-lease-action": "acquire",
        "x-ms-lease-duration": "-1",
        "x-ms-proposed-lease-id": "2a581b21-f712-6af0-a18f-100c21047f28",
        "x-ms-return-client-request-id": "true",
        "x-ms-version": "2019-12-12"
      },
      "RequestBody": null,
      "StatusCode": 201,
      "ResponseHeaders": {
        "Date": "Thu, 05 Mar 2020 21:45:28 GMT",
        "ETag": "\u00220x8D7C14E858868C4\u0022",
        "Last-Modified": "Thu, 05 Mar 2020 21:45:28 GMT",
        "Server": [
          "Windows-Azure-File/1.0",
          "Microsoft-HTTPAPI/2.0"
        ],
        "Transfer-Encoding": "chunked",
        "x-ms-client-request-id": "cd095681-9af6-7202-1351-015fbac26c86",
        "x-ms-lease-id": "2a581b21-f712-6af0-a18f-100c21047f28",
        "x-ms-request-id": "c9ef681b-f01a-0012-5237-f3e9eb000000",
        "x-ms-version": "2019-12-12"
      },
      "ResponseBody": []
    },
    {
      "RequestUri": "http://seanstagetest.file.core.windows.net/test-share-2040a3bf-4a33-aee5-20dc-b8fe908f8cd5/test-directory-11631297-4e73-1ebe-18ec-637b940c2c0a/test-file-2cfff926-ba3e-682e-761e-b7368fda8129",
      "RequestMethod": "HEAD",
      "RequestHeaders": {
        "Authorization": "Sanitized",
        "traceparent": "00-9f2e838a27eb7f48a4d7c2b54ec6787c-014fbcc48479aa41-00",
        "User-Agent": [
          "azsdk-net-Storage.Files.Shares/12.2.0-dev.20200305.1",
          "(.NET Core 4.6.28325.01; Microsoft Windows 10.0.18363 )"
        ],
        "x-ms-client-request-id": "ca8bd496-b1fb-c031-9f59-78ccdddb6fc3",
        "x-ms-date": "Thu, 05 Mar 2020 21:45:29 GMT",
        "x-ms-return-client-request-id": "true",
        "x-ms-version": "2019-12-12"
      },
      "RequestBody": null,
      "StatusCode": 200,
      "ResponseHeaders": {
        "Content-Length": "1024",
        "Content-Type": "application/octet-stream",
        "Date": "Thu, 05 Mar 2020 21:45:28 GMT",
        "ETag": "\u00220x8D7C14E858868C4\u0022",
        "Last-Modified": "Thu, 05 Mar 2020 21:45:28 GMT",
        "Server": [
          "Windows-Azure-File/1.0",
          "Microsoft-HTTPAPI/2.0"
        ],
        "Vary": "Origin",
        "x-ms-client-request-id": "ca8bd496-b1fb-c031-9f59-78ccdddb6fc3",
        "x-ms-file-attributes": "Archive",
        "x-ms-file-change-time": "2020-03-05T21:45:28.8133828Z",
        "x-ms-file-creation-time": "2020-03-05T21:45:28.8133828Z",
        "x-ms-file-id": "11529285414812647424",
        "x-ms-file-last-write-time": "2020-03-05T21:45:28.8133828Z",
        "x-ms-file-parent-id": "13835128424026341376",
        "x-ms-file-permission-key": "12501538048846835188*422928105932735866",
        "x-ms-lease-duration": "infinite",
        "x-ms-lease-state": "leased",
        "x-ms-lease-status": "locked",
        "x-ms-request-id": "c9ef681d-f01a-0012-5437-f3e9eb000000",
        "x-ms-server-encrypted": "true",
        "x-ms-type": "File",
        "x-ms-version": "2019-12-12"
      },
      "ResponseBody": []
    },
    {
      "RequestUri": "http://seanstagetest.file.core.windows.net/test-share-2040a3bf-4a33-aee5-20dc-b8fe908f8cd5?restype=share",
      "RequestMethod": "DELETE",
      "RequestHeaders": {
        "Authorization": "Sanitized",
        "traceparent": "00-fd13d17dd09a014faad7869bbc32f029-cba47e6782c8a343-00",
        "User-Agent": [
          "azsdk-net-Storage.Files.Shares/12.2.0-dev.20200305.1",
          "(.NET Core 4.6.28325.01; Microsoft Windows 10.0.18363 )"
        ],
        "x-ms-client-request-id": "e5c826a9-a137-a78a-9f78-34b9ab576504",
        "x-ms-date": "Thu, 05 Mar 2020 21:45:29 GMT",
        "x-ms-delete-snapshots": "include",
        "x-ms-return-client-request-id": "true",
        "x-ms-version": "2019-12-12"
      },
      "RequestBody": null,
      "StatusCode": 202,
      "ResponseHeaders": {
        "Content-Length": "0",
        "Date": "Thu, 05 Mar 2020 21:45:28 GMT",
        "Server": [
          "Windows-Azure-File/1.0",
          "Microsoft-HTTPAPI/2.0"
        ],
        "x-ms-client-request-id": "e5c826a9-a137-a78a-9f78-34b9ab576504",
        "x-ms-request-id": "c9ef681e-f01a-0012-5537-f3e9eb000000",
        "x-ms-version": "2019-12-12"
      },
      "ResponseBody": []
    }
  ],
  "Variables": {
    "RandomSeed": "162735323",
    "Storage_TestConfigDefault": "ProductionTenant\nseanstagetest\nU2FuaXRpemVk\nhttps://seanstagetest.blob.core.windows.net\nhttp://seanstagetest.file.core.windows.net\nhttp://seanstagetest.queue.core.windows.net\nhttp://seanstagetest.table.core.windows.net\n\n\n\n\nhttp://seanstagetest-secondary.blob.core.windows.net\nhttp://seanstagetest-secondary.file.core.windows.net\nhttp://seanstagetest-secondary.queue.core.windows.net\nhttp://seanstagetest-secondary.table.core.windows.net\n\nSanitized\n\n\nCloud\nBlobEndpoint=https://seanstagetest.blob.core.windows.net/;QueueEndpoint=http://seanstagetest.queue.core.windows.net/;FileEndpoint=http://seanstagetest.file.core.windows.net/;BlobSecondaryEndpoint=http://seanstagetest-secondary.blob.core.windows.net/;QueueSecondaryEndpoint=http://seanstagetest-secondary.queue.core.windows.net/;FileSecondaryEndpoint=http://seanstagetest-secondary.file.core.windows.net/;AccountName=seanstagetest;AccountKey=Sanitized\nseanscope1"
  }
}