{
  "Entries": [
    {
      "RequestUri": "https://azsdknet-test-ta.cognitiveservices.azure.com/text/analytics/v3.1-preview.1/keyPhrases?showStats=true",
      "RequestMethod": "POST",
      "RequestHeaders": {
        "Content-Length": "191",
        "Content-Type": "application/json",
        "Ocp-Apim-Subscription-Key": "Sanitized",
        "traceparent": "00-37a2503de53e3947ad1d14b6b87c8381-801950b06a8d6d4e-00",
        "User-Agent": [
          "azsdk-net-AI.TextAnalytics/5.1.0-dev.20200818.1",
          "(.NET Core 4.6.29017.01; Microsoft Windows 10.0.18363 )"
        ],
        "x-ms-client-request-id": "e310a04a0ad5f7d16b24d8670e7126df",
        "x-ms-return-client-request-id": "true"
      },
      "RequestBody": {
        "documents": [
          {
            "id": "0",
            "text": "Microsoft was founded by Bill Gates and Paul Allen.",
            "language": "en"
          },
          {
            "id": "1",
            "text": "My cat and my dog might need to see a veterinarian.",
            "language": "en"
          }
        ]
      },
      "StatusCode": 200,
      "ResponseHeaders": {
        "apim-request-id": "7dce13b4-573e-4432-8853-24bf6f005d6f",
        "Content-Type": "application/json; charset=utf-8",
        "csp-billing-usage": "CognitiveServices.TextAnalytics.BatchScoring=2",
        "Date": "Wed, 19 Aug 2020 02:51:22 GMT",
        "Strict-Transport-Security": "max-age=31536000; includeSubDomains; preload",
        "Transfer-Encoding": "chunked",
        "X-Content-Type-Options": "nosniff",
        "x-envoy-upstream-service-time": "11"
      },
      "ResponseBody": {
        "statistics": {
          "documentsCount": 2,
          "validDocumentsCount": 2,
          "erroneousDocumentsCount": 0,
          "transactionsCount": 2
        },
        "documents": [
          {
            "id": "0",
            "keyPhrases": [
              "Bill Gates",
              "Paul Allen",
              "Microsoft"
            ],
            "statistics": {
              "charactersCount": 51,
              "transactionsCount": 1
            },
            "warnings": []
          },
          {
            "id": "1",
            "keyPhrases": [
              "dog",
              "cat",
              "veterinarian"
            ],
            "statistics": {
              "charactersCount": 51,
              "transactionsCount": 1
            },
            "warnings": []
          }
        ],
        "errors": [],
        "modelVersion": "2020-07-01"
      }
    }
  ],
  "Variables": {
    "RandomSeed": "794914378",
    "TEXT_ANALYTICS_API_KEY": "Sanitized",
    "TEXT_ANALYTICS_ENDPOINT": "https://azsdknet-test-ta.cognitiveservices.azure.com/"
  }
}