{
  "Entries": [
    {
      "RequestUri": "https://azsdknet-test-ta.cognitiveservices.azure.com/text/analytics/v3.1-preview.1/sentiment?showStats=false",
      "RequestMethod": "POST",
      "RequestHeaders": {
        "Content-Length": "222",
        "Content-Type": "application/json",
        "Ocp-Apim-Subscription-Key": "Sanitized",
        "traceparent": "00-baa22c9a33d8ad4cb12e9e0089933dc1-a3881a4526291547-00",
        "User-Agent": [
          "azsdk-net-AI.TextAnalytics/5.1.0-dev.20200818.1",
          "(.NET Core 4.6.29017.01; Microsoft Windows 10.0.18363 )"
        ],
        "x-ms-client-request-id": "6eb17a3f40f82287bc25b805aa025836",
        "x-ms-return-client-request-id": "true"
      },
      "RequestBody": {
        "documents": [
          {
            "id": "0",
            "text": "That was the best day of my life!. I had a lot of fun at the park.",
            "language": "en"
          },
          {
            "id": "1",
            "text": "I\u0027m not sure how I feel about this product. It is complicated.",
            "language": "en"
          }
        ]
      },
      "StatusCode": 200,
      "ResponseHeaders": {
        "apim-request-id": "535d4f3f-65f5-4ab1-bcb8-598024b1d5b6",
        "Content-Type": "application/json; charset=utf-8",
        "csp-billing-usage": "CognitiveServices.TextAnalytics.BatchScoring=2",
        "Date": "Wed, 19 Aug 2020 03:21:02 GMT",
        "Strict-Transport-Security": "max-age=31536000; includeSubDomains; preload",
        "Transfer-Encoding": "chunked",
        "X-Content-Type-Options": "nosniff",
        "x-envoy-upstream-service-time": "82"
      },
      "ResponseBody": {
        "documents": [
          {
            "id": "0",
            "sentiment": "positive",
            "confidenceScores": {
              "positive": 1.0,
              "neutral": 0.0,
              "negative": 0.0
            },
            "sentences": [
              {
                "sentiment": "positive",
                "confidenceScores": {
                  "positive": 1.0,
                  "neutral": 0.0,
                  "negative": 0.0
                },
                "offset": 0,
                "length": 34,
                "text": "That was the best day of my life!."
              },
              {
                "sentiment": "positive",
                "confidenceScores": {
                  "positive": 1.0,
                  "neutral": 0.0,
                  "negative": 0.0
                },
                "offset": 35,
                "length": 31,
                "text": "I had a lot of fun at the park."
              }
            ],
            "warnings": []
          },
          {
            "id": "1",
            "sentiment": "negative",
            "confidenceScores": {
              "positive": 0.0,
              "neutral": 0.0,
              "negative": 1.0
            },
            "sentences": [
              {
                "sentiment": "neutral",
                "confidenceScores": {
                  "positive": 0.02,
                  "neutral": 0.85,
                  "negative": 0.13
                },
                "offset": 0,
                "length": 43,
                "text": "I\u0027m not sure how I feel about this product."
              },
              {
                "sentiment": "negative",
                "confidenceScores": {
                  "positive": 0.0,
                  "neutral": 0.0,
                  "negative": 1.0
                },
                "offset": 44,
                "length": 18,
                "text": "It is complicated."
              }
            ],
            "warnings": []
          }
        ],
        "errors": [],
        "modelVersion": "2020-04-01"
      }
    }
  ],
  "Variables": {
    "RandomSeed": "606518118",
    "TEXT_ANALYTICS_API_KEY": "Sanitized",
    "TEXT_ANALYTICS_ENDPOINT": "https://azsdknet-test-ta.cognitiveservices.azure.com/"
  }
}