{
  "Entries": [
    {
      "RequestUri": "https://FakeHost.net/statistics/service?api-version=2020-03-13",
      "RequestMethod": "GET",
      "RequestHeaders": {
        "Authorization": "Sanitized",
        "User-Agent": [
          "azsdk-net-Iot.Hub.Service/1.0.0-dev.20200819.1",
          "(.NET Core 4.6.28516.03; Microsoft Windows 10.0.18363 )"
        ],
        "x-ms-client-request-id": "e2363b7f0eaf047ade6a876edf206e01",
        "x-ms-return-client-request-id": "true"
      },
      "RequestBody": null,
      "StatusCode": 200,
      "ResponseHeaders": {
        "Content-Length": "26",
        "Content-Type": "application/json; charset=utf-8",
        "Date": "Wed, 19 Aug 2020 20:09:51 GMT",
        "Server": "Microsoft-HTTPAPI/2.0",
        "Vary": "Origin",
        "x-ms-request-id": "e9f72005-9d76-4c59-ba5d-9e6cd9e48bec"
      },
      "ResponseBody": {
        "connectedDeviceCount": 0
      }
    }
  ],
  "Variables": {
    "IOT_HUB_CONNECTION_STRING": "HostName=FakeHost.net;SharedAccessKeyName=iothubowner;SharedAccessKey=Kg==",
    "RandomSeed": "1985716035"
  }
}