{
  "Entries": [
    {
      "RequestUri": "http://seansoftdeletecanary.file.core.windows.net/test-share-fcb77254-09e6-e109-51fb-5251a41e8ef8?restype=share",
      "RequestMethod": "PUT",
      "RequestHeaders": {
        "Authorization": "Sanitized",
        "traceparent": "00-62cd9495d7280a40baaa33a01ad0e3b5-5c628f8bdf235e42-00",
        "User-Agent": [
          "azsdk-net-Storage.Files.Shares/12.3.0-dev.20200412.1",
          "(.NET Core 4.6.28325.01; Microsoft Windows 10.0.18362 )"
        ],
        "x-ms-client-request-id": "eca993b7-59aa-8a1d-5543-32ac840369b4",
        "x-ms-date": "Sun, 12 Apr 2020 20:48:30 GMT",
        "x-ms-return-client-request-id": "true",
        "x-ms-version": "2019-12-12"
      },
      "RequestBody": null,
      "StatusCode": 201,
      "ResponseHeaders": {
        "Content-Length": "0",
        "Date": "Sun, 12 Apr 2020 20:48:28 GMT",
        "ETag": "\u00220x8D7DF22DADDFA61\u0022",
        "Last-Modified": "Sun, 12 Apr 2020 20:48:29 GMT",
        "Server": [
          "Windows-Azure-File/1.0",
          "Microsoft-HTTPAPI/2.0"
        ],
        "x-ms-client-request-id": "eca993b7-59aa-8a1d-5543-32ac840369b4",
        "x-ms-request-id": "43ecb943-f01a-00e6-080b-114607000000",
        "x-ms-version": "2019-12-12"
      },
      "ResponseBody": []
    },
    {
      "RequestUri": "http://seansoftdeletecanary.file.core.windows.net/test-share-fcb77254-09e6-e109-51fb-5251a41e8ef8?restype=share",
      "RequestMethod": "DELETE",
      "RequestHeaders": {
        "Authorization": "Sanitized",
        "traceparent": "00-ec582e9b2a4ebf4e8c95d87b82dd4670-c09bb09c5486c848-00",
        "User-Agent": [
          "azsdk-net-Storage.Files.Shares/12.3.0-dev.20200412.1",
          "(.NET Core 4.6.28325.01; Microsoft Windows 10.0.18362 )"
        ],
        "x-ms-client-request-id": "109a9d33-a175-194e-d5bf-0fa05aac15f9",
        "x-ms-date": "Sun, 12 Apr 2020 20:48:30 GMT",
        "x-ms-delete-snapshots": "include",
        "x-ms-return-client-request-id": "true",
        "x-ms-version": "2019-12-12"
      },
      "RequestBody": null,
      "StatusCode": 202,
      "ResponseHeaders": {
        "Content-Length": "0",
        "Date": "Sun, 12 Apr 2020 20:48:28 GMT",
        "Server": [
          "Windows-Azure-File/1.0",
          "Microsoft-HTTPAPI/2.0"
        ],
        "x-ms-client-request-id": "109a9d33-a175-194e-d5bf-0fa05aac15f9",
        "x-ms-request-id": "43ecb947-f01a-00e6-090b-114607000000",
        "x-ms-version": "2019-12-12"
      },
      "ResponseBody": []
    },
    {
      "RequestUri": "http://seansoftdeletecanary.file.core.windows.net/?comp=list\u0026include=deleted",
      "RequestMethod": "GET",
      "RequestHeaders": {
        "Authorization": "Sanitized",
        "User-Agent": [
          "azsdk-net-Storage.Files.Shares/12.3.0-dev.20200412.1",
          "(.NET Core 4.6.28325.01; Microsoft Windows 10.0.18362 )"
        ],
        "x-ms-client-request-id": "e77982c3-5968-1c3f-62a6-996984996d6c",
        "x-ms-date": "Sun, 12 Apr 2020 20:48:30 GMT",
        "x-ms-return-client-request-id": "true",
        "x-ms-version": "2019-12-12"
      },
      "RequestBody": null,
      "StatusCode": 200,
      "ResponseHeaders": {
        "Content-Type": "application/xml",
        "Date": "Sun, 12 Apr 2020 20:48:28 GMT",
        "Server": [
          "Windows-Azure-File/1.0",
          "Microsoft-HTTPAPI/2.0"
        ],
        "Transfer-Encoding": "chunked",
        "x-ms-client-request-id": "e77982c3-5968-1c3f-62a6-996984996d6c",
        "x-ms-request-id": "43ecb949-f01a-00e6-0a0b-114607000000",
        "x-ms-version": "2019-12-12"
      },
      "ResponseBody": "\uFEFF\u003C?xml version=\u00221.0\u0022 encoding=\u0022utf-8\u0022?\u003E\u003CEnumerationResults ServiceEndpoint=\u0022http://seansoftdeletecanary.file.core.windows.net/\u0022\u003E\u003CShares\u003E\u003CShare\u003E\u003CName\u003Etest-share-04423526-abc3-44c9-aa2e-540f6eecac0d\u003C/Name\u003E\u003CProperties\u003E\u003CLast-Modified\u003ESun, 12 Apr 2020 18:42:18 GMT\u003C/Last-Modified\u003E\u003CEtag\u003E\u00220x8D7DF113AB0D452\u0022\u003C/Etag\u003E\u003CQuota\u003E5120\u003C/Quota\u003E\u003CDefaultEncryptionScope\u003E$account-encryption-key\u003C/DefaultEncryptionScope\u003E\u003CDenyEncryptionScopeOverride\u003Efalse\u003C/DenyEncryptionScopeOverride\u003E\u003C/Properties\u003E\u003C/Share\u003E\u003CShare\u003E\u003CName\u003Etest-share-213a0932-7bde-4a6d-b090-3acff985441a\u003C/Name\u003E\u003CDeleted\u003Etrue\u003C/Deleted\u003E\u003CVersion\u003E01D610FA6C8EAA3B\u003C/Version\u003E\u003CProperties\u003E\u003CLast-Modified\u003ESun, 12 Apr 2020 18:44:40 GMT\u003C/Last-Modified\u003E\u003CEtag\u003E\u00220x8D7DF118F056A70\u0022\u003C/Etag\u003E\u003CQuota\u003E5120\u003C/Quota\u003E\u003CDefaultEncryptionScope\u003E$account-encryption-key\u003C/DefaultEncryptionScope\u003E\u003CDenyEncryptionScopeOverride\u003Efalse\u003C/DenyEncryptionScopeOverride\u003E\u003CDeletedTime\u003ESun, 12 Apr 2020 18:44:40 GMT\u003C/DeletedTime\u003E\u003CRemainingRetentionDays\u003E0\u003C/RemainingRetentionDays\u003E\u003C/Properties\u003E\u003C/Share\u003E\u003CShare\u003E\u003CName\u003Etest-share-2c71e637-34cd-4894-8576-2514d5138978\u003C/Name\u003E\u003CDeleted\u003Etrue\u003C/Deleted\u003E\u003CVersion\u003E01D610FA3A993E22\u003C/Version\u003E\u003CProperties\u003E\u003CLast-Modified\u003ESun, 12 Apr 2020 18:43:16 GMT\u003C/Last-Modified\u003E\u003CEtag\u003E\u00220x8D7DF115D0FFF1B\u0022\u003C/Etag\u003E\u003CQuota\u003E5120\u003C/Quota\u003E\u003CDefaultEncryptionScope\u003E$account-encryption-key\u003C/DefaultEncryptionScope\u003E\u003CDenyEncryptionScopeOverride\u003Efalse\u003C/DenyEncryptionScopeOverride\u003E\u003CDeletedTime\u003ESun, 12 Apr 2020 18:43:16 GMT\u003C/DeletedTime\u003E\u003CRemainingRetentionDays\u003E0\u003C/RemainingRetentionDays\u003E\u003C/Properties\u003E\u003C/Share\u003E\u003CShare\u003E\u003CName\u003Etest-share-2d2b6ec8-d9c5-4e83-8e51-8aadd437067e\u003C/Name\u003E\u003CDeleted\u003Etrue\u003C/Deleted\u003E\u003CVersion\u003E01D610EFC09C33F1\u003C/Version\u003E\u003CProperties\u003E\u003CLast-Modified\u003ESun, 12 Apr 2020 17:28:16 GMT\u003C/Last-Modified\u003E\u003CEtag\u003E\u00220x8D7DF06E312DCA9\u0022\u003C/Etag\u003E\u003CQuota\u003E5120\u003C/Quota\u003E\u003CDefaultEncryptionScope\u003E$account-encryption-key\u003C/DefaultEncryptionScope\u003E\u003CDenyEncryptionScopeOverride\u003Efalse\u003C/DenyEncryptionScopeOverride\u003E\u003CDeletedTime\u003ESun, 12 Apr 2020 17:28:16 GMT\u003C/DeletedTime\u003E\u003CRemainingRetentionDays\u003E0\u003C/RemainingRetentionDays\u003E\u003C/Properties\u003E\u003C/Share\u003E\u003CShare\u003E\u003CName\u003Etest-share-3754bd7d-b2e4-4079-a97e-a3b9afc1648c\u003C/Name\u003E\u003CProperties\u003E\u003CLast-Modified\u003ESat, 11 Apr 2020 17:58:03 GMT\u003C/Last-Modified\u003E\u003CEtag\u003E\u00220x8D7DE41E1D75DB4\u0022\u003C/Etag\u003E\u003CQuota\u003E5120\u003C/Quota\u003E\u003CDefaultEncryptionScope\u003E$account-encryption-key\u003C/DefaultEncryptionScope\u003E\u003CDenyEncryptionScopeOverride\u003Efalse\u003C/DenyEncryptionScopeOverride\u003E\u003C/Properties\u003E\u003C/Share\u003E\u003CShare\u003E\u003CName\u003Etest-share-483e0c6a-7953-470b-826a-273f81ec1641\u003C/Name\u003E\u003CDeleted\u003Etrue\u003C/Deleted\u003E\u003CVersion\u003E01D610F239E59062\u003C/Version\u003E\u003CProperties\u003E\u003CLast-Modified\u003ESun, 12 Apr 2020 17:45:59 GMT\u003C/Last-Modified\u003E\u003CEtag\u003E\u00220x8D7DF095C5C3C46\u0022\u003C/Etag\u003E\u003CQuota\u003E5120\u003C/Quota\u003E\u003CDefaultEncryptionScope\u003E$account-encryption-key\u003C/DefaultEncryptionScope\u003E\u003CDenyEncryptionScopeOverride\u003Efalse\u003C/DenyEncryptionScopeOverride\u003E\u003CDeletedTime\u003ESun, 12 Apr 2020 17:45:59 GMT\u003C/DeletedTime\u003E\u003CRemainingRetentionDays\u003E0\u003C/RemainingRetentionDays\u003E\u003C/Properties\u003E\u003C/Share\u003E\u003CShare\u003E\u003CName\u003Etest-share-5789f41d-aa8d-4fa6-b1b6-ca87428d2b13\u003C/Name\u003E\u003CDeleted\u003Etrue\u003C/Deleted\u003E\u003CVersion\u003E01D610F239A914E4\u003C/Version\u003E\u003CProperties\u003E\u003CLast-Modified\u003ESun, 12 Apr 2020 17:45:58 GMT\u003C/Last-Modified\u003E\u003CEtag\u003E\u00220x8D7DF095C1FC0F3\u0022\u003C/Etag\u003E\u003CQuota\u003E5120\u003C/Quota\u003E\u003CDefaultEncryptionScope\u003E$account-encryption-key\u003C/DefaultEncryptionScope\u003E\u003CDenyEncryptionScopeOverride\u003Efalse\u003C/DenyEncryptionScopeOverride\u003E\u003CDeletedTime\u003ESun, 12 Apr 2020 17:45:59 GMT\u003C/DeletedTime\u003E\u003CRemainingRetentionDays\u003E0\u003C/RemainingRetentionDays\u003E\u003C/Properties\u003E\u003C/Share\u003E\u003CShare\u003E\u003CName\u003Etest-share-612a3124-89b7-424e-a4f3-d603bb892983\u003C/Name\u003E\u003CDeleted\u003Etrue\u003C/Deleted\u003E\u003CVersion\u003E01D610F2569C4F34\u003C/Version\u003E\u003CProperties\u003E\u003CLast-Modified\u003ESun, 12 Apr 2020 17:46:47 GMT\u003C/Last-Modified\u003E\u003CEtag\u003E\u00220x8D7DF0979132077\u0022\u003C/Etag\u003E\u003CQuota\u003E5120\u003C/Quota\u003E\u003CDefaultEncryptionScope\u003E$account-encryption-key\u003C/DefaultEncryptionScope\u003E\u003CDenyEncryptionScopeOverride\u003Efalse\u003C/DenyEncryptionScopeOverride\u003E\u003CDeletedTime\u003ESun, 12 Apr 2020 17:46:47 GMT\u003C/DeletedTime\u003E\u003CRemainingRetentionDays\u003E0\u003C/RemainingRetentionDays\u003E\u003C/Properties\u003E\u003C/Share\u003E\u003CShare\u003E\u003CName\u003Etest-share-6214a335-a4b0-498c-9995-1e50b6bb50a2\u003C/Name\u003E\u003CProperties\u003E\u003CLast-Modified\u003ESat, 11 Apr 2020 17:57:43 GMT\u003C/Last-Modified\u003E\u003CEtag\u003E\u00220x8D7DE41D5B0D211\u0022\u003C/Etag\u003E\u003CQuota\u003E5120\u003C/Quota\u003E\u003CDefaultEncryptionScope\u003E$account-encryption-key\u003C/DefaultEncryptionScope\u003E\u003CDenyEncryptionScopeOverride\u003Efalse\u003C/DenyEncryptionScopeOverride\u003E\u003C/Properties\u003E\u003C/Share\u003E\u003CShare\u003E\u003CName\u003Etest-share-63a36258-327f-42ea-8c04-24b0660761fe\u003C/Name\u003E\u003CDeleted\u003Etrue\u003C/Deleted\u003E\u003CVersion\u003E01D610F256268D71\u003C/Version\u003E\u003CProperties\u003E\u003CLast-Modified\u003ESun, 12 Apr 2020 17:46:46 GMT\u003C/Last-Modified\u003E\u003CEtag\u003E\u00220x8D7DF09789D3774\u0022\u003C/Etag\u003E\u003CQuota\u003E5120\u003C/Quota\u003E\u003CDefaultEncryptionScope\u003E$account-encryption-key\u003C/DefaultEncryptionScope\u003E\u003CDenyEncryptionScopeOverride\u003Efalse\u003C/DenyEncryptionScopeOverride\u003E\u003CDeletedTime\u003ESun, 12 Apr 2020 17:46:47 GMT\u003C/DeletedTime\u003E\u003CRemainingRetentionDays\u003E0\u003C/RemainingRetentionDays\u003E\u003C/Properties\u003E\u003C/Share\u003E\u003CShare\u003E\u003CName\u003Etest-share-659cd252-38f3-43aa-8092-750973358be5\u003C/Name\u003E\u003CProperties\u003E\u003CLast-Modified\u003ESun, 12 Apr 2020 18:14:14 GMT\u003C/Last-Modified\u003E\u003CEtag\u003E\u00220x8D7DF0D4EBB62F2\u0022\u003C/Etag\u003E\u003CQuota\u003E5120\u003C/Quota\u003E\u003CDefaultEncryptionScope\u003E$account-encryption-key\u003C/DefaultEncryptionScope\u003E\u003CDenyEncryptionScopeOverride\u003Efalse\u003C/DenyEncryptionScopeOverride\u003E\u003C/Properties\u003E\u003C/Share\u003E\u003CShare\u003E\u003CName\u003Etest-share-6d528e3f-219f-44f9-b80b-3d2248cce9f3\u003C/Name\u003E\u003CProperties\u003E\u003CLast-Modified\u003ESat, 11 Apr 2020 17:58:24 GMT\u003C/Last-Modified\u003E\u003CEtag\u003E\u00220x8D7DE41EDFB7785\u0022\u003C/Etag\u003E\u003CQuota\u003E5120\u003C/Quota\u003E\u003CDefaultEncryptionScope\u003E$account-encryption-key\u003C/DefaultEncryptionScope\u003E\u003CDenyEncryptionScopeOverride\u003Efalse\u003C/DenyEncryptionScopeOverride\u003E\u003C/Properties\u003E\u003C/Share\u003E\u003CShare\u003E\u003CName\u003Etest-share-6fe76ac5-709b-4678-b55e-47e717c1d943\u003C/Name\u003E\u003CProperties\u003E\u003CLast-Modified\u003ESun, 12 Apr 2020 18:24:45 GMT\u003C/Last-Modified\u003E\u003CEtag\u003E\u00220x8D7DF0EC69BCDD4\u0022\u003C/Etag\u003E\u003CQuota\u003E5120\u003C/Quota\u003E\u003CDefaultEncryptionScope\u003E$account-encryption-key\u003C/DefaultEncryptionScope\u003E\u003CDenyEncryptionScopeOverride\u003Efalse\u003C/DenyEncryptionScopeOverride\u003E\u003C/Properties\u003E\u003C/Share\u003E\u003CShare\u003E\u003CName\u003Etest-share-718d0589-e845-4dad-a87f-69c29d28b58f\u003C/Name\u003E\u003CDeleted\u003Etrue\u003C/Deleted\u003E\u003CVersion\u003E01D610EFC6C41AC1\u003C/Version\u003E\u003CProperties\u003E\u003CLast-Modified\u003ESun, 12 Apr 2020 17:28:27 GMT\u003C/Last-Modified\u003E\u003CEtag\u003E\u00220x8D7DF06E93AC63E\u0022\u003C/Etag\u003E\u003CQuota\u003E5120\u003C/Quota\u003E\u003CDefaultEncryptionScope\u003E$account-encryption-key\u003C/DefaultEncryptionScope\u003E\u003CDenyEncryptionScopeOverride\u003Efalse\u003C/DenyEncryptionScopeOverride\u003E\u003CDeletedTime\u003ESun, 12 Apr 2020 17:28:27 GMT\u003C/DeletedTime\u003E\u003CRemainingRetentionDays\u003E0\u003C/RemainingRetentionDays\u003E\u003C/Properties\u003E\u003C/Share\u003E\u003CShare\u003E\u003CName\u003Etest-share-745c2b22-c95a-4019-a1cf-df95f0cb7db9\u003C/Name\u003E\u003CProperties\u003E\u003CLast-Modified\u003ESun, 12 Apr 2020 18:42:49 GMT\u003C/Last-Modified\u003E\u003CEtag\u003E\u00220x8D7DF114CDCA126\u0022\u003C/Etag\u003E\u003CQuota\u003E5120\u003C/Quota\u003E\u003CDefaultEncryptionScope\u003E$account-encryption-key\u003C/DefaultEncryptionScope\u003E\u003CDenyEncryptionScopeOverride\u003Efalse\u003C/DenyEncryptionScopeOverride\u003E\u003C/Properties\u003E\u003C/Share\u003E\u003CShare\u003E\u003CName\u003Etest-share-7488dac2-152f-4f94-904d-c855fd6741c5\u003C/Name\u003E\u003CDeleted\u003Etrue\u003C/Deleted\u003E\u003CVersion\u003E01D610F23A22CF60\u003C/Version\u003E\u003CProperties\u003E\u003CLast-Modified\u003ESun, 12 Apr 2020 17:45:59 GMT\u003C/Last-Modified\u003E\u003CEtag\u003E\u00220x8D7DF095C99A231\u0022\u003C/Etag\u003E\u003CQuota\u003E5120\u003C/Quota\u003E\u003CDefaultEncryptionScope\u003E$account-encryption-key\u003C/DefaultEncryptionScope\u003E\u003CDenyEncryptionScopeOverride\u003Efalse\u003C/DenyEncryptionScopeOverride\u003E\u003CDeletedTime\u003ESun, 12 Apr 2020 17:45:59 GMT\u003C/DeletedTime\u003E\u003CRemainingRetentionDays\u003E0\u003C/RemainingRetentionDays\u003E\u003C/Properties\u003E\u003C/Share\u003E\u003CShare\u003E\u003CName\u003Etest-share-76a9a8ad-e070-484d-8b29-9eecbf08d6d9\u003C/Name\u003E\u003CDeleted\u003Etrue\u003C/Deleted\u003E\u003CVersion\u003E01D610EFBA6A5FAE\u003C/Version\u003E\u003CProperties\u003E\u003CLast-Modified\u003ESun, 12 Apr 2020 17:28:06 GMT\u003C/Last-Modified\u003E\u003CEtag\u003E\u00220x8D7DF06DCE0CB2C\u0022\u003C/Etag\u003E\u003CQuota\u003E5120\u003C/Quota\u003E\u003CDefaultEncryptionScope\u003E$account-encryption-key\u003C/DefaultEncryptionScope\u003E\u003CDenyEncryptionScopeOverride\u003Efalse\u003C/DenyEncryptionScopeOverride\u003E\u003CDeletedTime\u003ESun, 12 Apr 2020 17:28:06 GMT\u003C/DeletedTime\u003E\u003CRemainingRetentionDays\u003E0\u003C/RemainingRetentionDays\u003E\u003C/Properties\u003E\u003C/Share\u003E\u003CShare\u003E\u003CName\u003Etest-share-77e97ce0-4f36-4fb8-9b7d-bb5664aab864\u003C/Name\u003E\u003CDeleted\u003Etrue\u003C/Deleted\u003E\u003CVersion\u003E01D610EFB437EEFD\u003C/Version\u003E\u003CProperties\u003E\u003CLast-Modified\u003ESun, 12 Apr 2020 17:27:56 GMT\u003C/Last-Modified\u003E\u003CEtag\u003E\u00220x8D7DF06D6AE8309\u0022\u003C/Etag\u003E\u003CQuota\u003E5120\u003C/Quota\u003E\u003CDefaultEncryptionScope\u003E$account-encryption-key\u003C/DefaultEncryptionScope\u003E\u003CDenyEncryptionScopeOverride\u003Efalse\u003C/DenyEncryptionScopeOverride\u003E\u003CDeletedTime\u003ESun, 12 Apr 2020 17:27:56 GMT\u003C/DeletedTime\u003E\u003CRemainingRetentionDays\u003E0\u003C/RemainingRetentionDays\u003E\u003C/Properties\u003E\u003C/Share\u003E\u003CShare\u003E\u003CName\u003Etest-share-7e386df5-7d6b-4fcf-b23d-9e7dd2c13a2b\u003C/Name\u003E\u003CProperties\u003E\u003CLast-Modified\u003ESun, 12 Apr 2020 18:23:37 GMT\u003C/Last-Modified\u003E\u003CEtag\u003E\u00220x8D7DF0E9E44C712\u0022\u003C/Etag\u003E\u003CQuota\u003E5120\u003C/Quota\u003E\u003CDefaultEncryptionScope\u003E$account-encryption-key\u003C/DefaultEncryptionScope\u003E\u003CDenyEncryptionScopeOverride\u003Efalse\u003C/DenyEncryptionScopeOverride\u003E\u003C/Properties\u003E\u003C/Share\u003E\u003CShare\u003E\u003CName\u003Etest-share-93210600-6d3f-49e4-8e87-7e6947c23b8b\u003C/Name\u003E\u003CProperties\u003E\u003CLast-Modified\u003ESat, 11 Apr 2020 17:57:33 GMT\u003C/Last-Modified\u003E\u003CEtag\u003E\u00220x8D7DE41CF6BC1E8\u0022\u003C/Etag\u003E\u003CQuota\u003E5120\u003C/Quota\u003E\u003CDefaultEncryptionScope\u003E$account-encryption-key\u003C/DefaultEncryptionScope\u003E\u003CDenyEncryptionScopeOverride\u003Efalse\u003C/DenyEncryptionScopeOverride\u003E\u003C/Properties\u003E\u003C/Share\u003E\u003CShare\u003E\u003CName\u003Etest-share-ba5d06e0-c1d4-41b7-8876-7aef01d366a7\u003C/Name\u003E\u003CProperties\u003E\u003CLast-Modified\u003ESat, 11 Apr 2020 17:57:53 GMT\u003C/Last-Modified\u003E\u003CEtag\u003E\u00220x8D7DE41DBC30637\u0022\u003C/Etag\u003E\u003CQuota\u003E5120\u003C/Quota\u003E\u003CDefaultEncryptionScope\u003E$account-encryption-key\u003C/DefaultEncryptionScope\u003E\u003CDenyEncryptionScopeOverride\u003Efalse\u003C/DenyEncryptionScopeOverride\u003E\u003C/Properties\u003E\u003C/Share\u003E\u003CShare\u003E\u003CName\u003Etest-share-bade4256-0b94-49d5-9e92-8f8ff7cf03c7\u003C/Name\u003E\u003CDeleted\u003Etrue\u003C/Deleted\u003E\u003CVersion\u003E01D610F23969B280\u003C/Version\u003E\u003CProperties\u003E\u003CLast-Modified\u003ESun, 12 Apr 2020 17:45:58 GMT\u003C/Last-Modified\u003E\u003CEtag\u003E\u00220x8D7DF095BE085D7\u0022\u003C/Etag\u003E\u003CQuota\u003E5120\u003C/Quota\u003E\u003CDefaultEncryptionScope\u003E$account-encryption-key\u003C/DefaultEncryptionScope\u003E\u003CDenyEncryptionScopeOverride\u003Efalse\u003C/DenyEncryptionScopeOverride\u003E\u003CDeletedTime\u003ESun, 12 Apr 2020 17:45:58 GMT\u003C/DeletedTime\u003E\u003CRemainingRetentionDays\u003E0\u003C/RemainingRetentionDays\u003E\u003C/Properties\u003E\u003C/Share\u003E\u003CShare\u003E\u003CName\u003Etest-share-bffb30c0-47cc-4cd0-b3b4-6c560832c136\u003C/Name\u003E\u003CProperties\u003E\u003CLast-Modified\u003ESun, 12 Apr 2020 18:44:28 GMT\u003C/Last-Modified\u003E\u003CEtag\u003E\u00220x8D7DF11881FBCE1\u0022\u003C/Etag\u003E\u003CQuota\u003E5120\u003C/Quota\u003E\u003CDefaultEncryptionScope\u003E$account-encryption-key\u003C/DefaultEncryptionScope\u003E\u003CDenyEncryptionScopeOverride\u003Efalse\u003C/DenyEncryptionScopeOverride\u003E\u003C/Properties\u003E\u003C/Share\u003E\u003CShare\u003E\u003CName\u003Etest-share-c30113d1-5076-45d0-9a4d-30c7be3478fc\u003C/Name\u003E\u003CDeleted\u003Etrue\u003C/Deleted\u003E\u003CVersion\u003E01D610FABA9CE7F0\u003C/Version\u003E\u003CProperties\u003E\u003CLast-Modified\u003ESun, 12 Apr 2020 18:46:51 GMT\u003C/Last-Modified\u003E\u003CEtag\u003E\u00220x8D7DF11DD13E607\u0022\u003C/Etag\u003E\u003CQuota\u003E5120\u003C/Quota\u003E\u003CDefaultEncryptionScope\u003E$account-encryption-key\u003C/DefaultEncryptionScope\u003E\u003CDenyEncryptionScopeOverride\u003Efalse\u003C/DenyEncryptionScopeOverride\u003E\u003CDeletedTime\u003ESun, 12 Apr 2020 18:46:51 GMT\u003C/DeletedTime\u003E\u003CRemainingRetentionDays\u003E0\u003C/RemainingRetentionDays\u003E\u003C/Properties\u003E\u003C/Share\u003E\u003CShare\u003E\u003CName\u003Etest-share-c4bc9443-43c9-46ce-84f9-62ff1135c41d\u003C/Name\u003E\u003CDeleted\u003Etrue\u003C/Deleted\u003E\u003CVersion\u003E01D610FACCE1E72E\u003C/Version\u003E\u003CProperties\u003E\u003CLast-Modified\u003ESun, 12 Apr 2020 18:47:21 GMT\u003C/Last-Modified\u003E\u003CEtag\u003E\u00220x8D7DF11EF58E655\u0022\u003C/Etag\u003E\u003CQuota\u003E5120\u003C/Quota\u003E\u003CDefaultEncryptionScope\u003E$account-encryption-key\u003C/DefaultEncryptionScope\u003E\u003CDenyEncryptionScopeOverride\u003Efalse\u003C/DenyEncryptionScopeOverride\u003E\u003CDeletedTime\u003ESun, 12 Apr 2020 18:47:22 GMT\u003C/DeletedTime\u003E\u003CRemainingRetentionDays\u003E0\u003C/RemainingRetentionDays\u003E\u003C/Properties\u003E\u003C/Share\u003E\u003CShare\u003E\u003CName\u003Etest-share-ce14a14c-6463-4bad-bedc-bedf7388d692\u003C/Name\u003E\u003CProperties\u003E\u003CLast-Modified\u003ESat, 11 Apr 2020 17:58:14 GMT\u003C/Last-Modified\u003E\u003CEtag\u003E\u00220x8D7DE41E7E8F550\u0022\u003C/Etag\u003E\u003CQuota\u003E5120\u003C/Quota\u003E\u003CDefaultEncryptionScope\u003E$account-encryption-key\u003C/DefaultEncryptionScope\u003E\u003CDenyEncryptionScopeOverride\u003Efalse\u003C/DenyEncryptionScopeOverride\u003E\u003C/Properties\u003E\u003C/Share\u003E\u003CShare\u003E\u003CName\u003Etest-share-cf6688fa-4959-483c-b961-a06fea201a66\u003C/Name\u003E\u003CDeleted\u003Etrue\u003C/Deleted\u003E\u003CVersion\u003E01D610F5F894BCE7\u003C/Version\u003E\u003CProperties\u003E\u003CLast-Modified\u003ESun, 12 Apr 2020 18:12:47 GMT\u003C/Last-Modified\u003E\u003CEtag\u003E\u00220x8D7DF0D1B0B5E1B\u0022\u003C/Etag\u003E\u003CQuota\u003E5120\u003C/Quota\u003E\u003CDefaultEncryptionScope\u003E$account-encryption-key\u003C/DefaultEncryptionScope\u003E\u003CDenyEncryptionScopeOverride\u003Efalse\u003C/DenyEncryptionScopeOverride\u003E\u003CDeletedTime\u003ESun, 12 Apr 2020 18:12:47 GMT\u003C/DeletedTime\u003E\u003CRemainingRetentionDays\u003E0\u003C/RemainingRetentionDays\u003E\u003C/Properties\u003E\u003C/Share\u003E\u003CShare\u003E\u003CName\u003Etest-share-dc8bba3d-2347-4b7a-9b9b-319dbf7b2b64\u003C/Name\u003E\u003CDeleted\u003Etrue\u003C/Deleted\u003E\u003CVersion\u003E01D610F5F7FDAF48\u003C/Version\u003E\u003CProperties\u003E\u003CLast-Modified\u003ESun, 12 Apr 2020 18:12:46 GMT\u003C/Last-Modified\u003E\u003CEtag\u003E\u00220x8D7DF0D1A695145\u0022\u003C/Etag\u003E\u003CQuota\u003E5120\u003C/Quota\u003E\u003CDefaultEncryptionScope\u003E$account-encryption-key\u003C/DefaultEncryptionScope\u003E\u003CDenyEncryptionScopeOverride\u003Efalse\u003C/DenyEncryptionScopeOverride\u003E\u003CDeletedTime\u003ESun, 12 Apr 2020 18:12:47 GMT\u003C/DeletedTime\u003E\u003CRemainingRetentionDays\u003E0\u003C/RemainingRetentionDays\u003E\u003C/Properties\u003E\u003C/Share\u003E\u003CShare\u003E\u003CName\u003Etest-share-e21b1b2a-eaa6-4f88-928f-449387ef5cb9\u003C/Name\u003E\u003CProperties\u003E\u003CLast-Modified\u003ESun, 12 Apr 2020 18:13:43 GMT\u003C/Last-Modified\u003E\u003CEtag\u003E\u00220x8D7DF0D3C81621C\u0022\u003C/Etag\u003E\u003CQuota\u003E5120\u003C/Quota\u003E\u003CDefaultEncryptionScope\u003E$account-encryption-key\u003C/DefaultEncryptionScope\u003E\u003CDenyEncryptionScopeOverride\u003Efalse\u003C/DenyEncryptionScopeOverride\u003E\u003C/Properties\u003E\u003C/Share\u003E\u003CShare\u003E\u003CName\u003Etest-share-f19e7043-2a35-4438-8d6d-5af280fc9231\u003C/Name\u003E\u003CDeleted\u003Etrue\u003C/Deleted\u003E\u003CVersion\u003E01D610EFAE013791\u003C/Version\u003E\u003CProperties\u003E\u003CLast-Modified\u003ESun, 12 Apr 2020 17:27:45 GMT\u003C/Last-Modified\u003E\u003CEtag\u003E\u00220x8D7DF06D0777ECD\u0022\u003C/Etag\u003E\u003CQuota\u003E5120\u003C/Quota\u003E\u003CDefaultEncryptionScope\u003E$account-encryption-key\u003C/DefaultEncryptionScope\u003E\u003CDenyEncryptionScopeOverride\u003Efalse\u003C/DenyEncryptionScopeOverride\u003E\u003CDeletedTime\u003ESun, 12 Apr 2020 17:27:45 GMT\u003C/DeletedTime\u003E\u003CRemainingRetentionDays\u003E0\u003C/RemainingRetentionDays\u003E\u003C/Properties\u003E\u003C/Share\u003E\u003CShare\u003E\u003CName\u003Etest-share-f399ae8f-3f00-43a0-9d2c-a9164d03b7ef\u003C/Name\u003E\u003CDeleted\u003Etrue\u003C/Deleted\u003E\u003CVersion\u003E01D610EFCCEAC8BC\u003C/Version\u003E\u003CProperties\u003E\u003CLast-Modified\u003ESun, 12 Apr 2020 17:28:37 GMT\u003C/Last-Modified\u003E\u003CEtag\u003E\u00220x8D7DF06EF6199EF\u0022\u003C/Etag\u003E\u003CQuota\u003E5120\u003C/Quota\u003E\u003CDefaultEncryptionScope\u003E$account-encryption-key\u003C/DefaultEncryptionScope\u003E\u003CDenyEncryptionScopeOverride\u003Efalse\u003C/DenyEncryptionScopeOverride\u003E\u003CDeletedTime\u003ESun, 12 Apr 2020 17:28:37 GMT\u003C/DeletedTime\u003E\u003CRemainingRetentionDays\u003E0\u003C/RemainingRetentionDays\u003E\u003C/Properties\u003E\u003C/Share\u003E\u003CShare\u003E\u003CName\u003Etest-share-fcb77254-09e6-e109-51fb-5251a41e8ef8\u003C/Name\u003E\u003CDeleted\u003Etrue\u003C/Deleted\u003E\u003CVersion\u003E01D6110BB8678499\u003C/Version\u003E\u003CProperties\u003E\u003CLast-Modified\u003ESun, 12 Apr 2020 20:48:29 GMT\u003C/Last-Modified\u003E\u003CEtag\u003E\u00220x8D7DF22DADDFA61\u0022\u003C/Etag\u003E\u003CQuota\u003E5120\u003C/Quota\u003E\u003CDefaultEncryptionScope\u003E$account-encryption-key\u003C/DefaultEncryptionScope\u003E\u003CDenyEncryptionScopeOverride\u003Efalse\u003C/DenyEncryptionScopeOverride\u003E\u003CDeletedTime\u003ESun, 12 Apr 2020 20:48:29 GMT\u003C/DeletedTime\u003E\u003CRemainingRetentionDays\u003E1\u003C/RemainingRetentionDays\u003E\u003C/Properties\u003E\u003C/Share\u003E\u003C/Shares\u003E\u003CNextMarker /\u003E\u003C/EnumerationResults\u003E"
    }
  ],
  "Variables": {
    "RandomSeed": "773984127",
    "Storage_TestConfigSoftDelete": "SoftDeleteTenant\nseansoftdeletecanary\nU2FuaXRpemVk\nhttp://seansoftdeletecanary.blob.core.windows.net\nhttp://seansoftdeletecanary.file.core.windows.net\nhttp://seansoftdeletecanary.queue.core.windows.net\nhttp://seansoftdeletecanary.table.core.windows.net\n\n\n\n\nhttp://seansoftdeletecanary-secondary.blob.core.windows.net\nhttp://seansoftdeletecanary-secondary.file.core.windows.net\nhttp://seansoftdeletecanary-secondary.queue.core.windows.net\nhttp://seansoftdeletecanary-secondary.table.core.windows.net\n\nSanitized\n\n\nCloud\nBlobEndpoint=http://seansoftdeletecanary.blob.core.windows.net/;QueueEndpoint=http://seansoftdeletecanary.queue.core.windows.net/;FileEndpoint=http://seansoftdeletecanary.file.core.windows.net/;BlobSecondaryEndpoint=http://seansoftdeletecanary-secondary.blob.core.windows.net/;QueueSecondaryEndpoint=http://seansoftdeletecanary-secondary.queue.core.windows.net/;FileSecondaryEndpoint=http://seansoftdeletecanary-secondary.file.core.windows.net/;AccountName=seansoftdeletecanary;AccountKey=Sanitized\n"
  }
}