{
  "Entries": [
    {
      "RequestUri": "https://FakeHost.net/devices/IdentityLifecycleDevice733449647?api-version=2020-03-13",
      "RequestMethod": "PUT",
      "RequestHeaders": {
        "Authorization": "Sanitized",
        "Content-Length": "47",
        "Content-Type": "application/json",
        "If-Match": "\u0022\u0022",
        "User-Agent": [
          "azsdk-net-Iot.Hub.Service/1.0.0-dev.20200820.1",
          "(.NET Core 4.6.28516.03; Microsoft Windows 10.0.18363 )"
        ],
        "x-ms-client-request-id": "33161b07c718b68aa86cba719a3dd302",
        "x-ms-return-client-request-id": "true"
      },
      "RequestBody": {
        "deviceId": "IdentityLifecycleDevice733449647"
      },
      "StatusCode": 200,
      "ResponseHeaders": {
        "Content-Length": "564",
        "Content-Type": "application/json; charset=utf-8",
        "Date": "Thu, 20 Aug 2020 21:44:52 GMT",
        "ETag": "\u0022NDA0NTM1MTM=\u0022",
        "Server": "Microsoft-HTTPAPI/2.0",
        "Vary": "Origin",
        "x-ms-request-id": "3336d7c0-0dc6-4b4b-8c08-9240a0aef09b"
      },
      "ResponseBody": {
        "deviceId": "IdentityLifecycleDevice733449647",
        "generationId": "637335566929441755",
        "etag": "NDA0NTM1MTM=",
        "connectionState": "Disconnected",
        "status": "enabled",
        "statusReason": null,
        "connectionStateUpdatedTime": "0001-01-01T00:00:00",
        "statusUpdatedTime": "0001-01-01T00:00:00",
        "lastActivityTime": "0001-01-01T00:00:00",
        "cloudToDeviceMessageCount": 0,
        "authentication": {
          "symmetricKey": {
            "primaryKey": "Sanitized",
            "secondaryKey": "Sanitized"
          },
          "x509Thumbprint": {
            "primaryThumbprint": null,
            "secondaryThumbprint": null
          },
          "type": "sas"
        },
        "capabilities": {
          "iotEdge": false
        },
        "parentScopes": []
      }
    },
    {
      "RequestUri": "https://FakeHost.net/devices/IdentityLifecycleDevice733449647/modules/IdentityLifecycleModule258468012?api-version=2020-03-13",
      "RequestMethod": "PUT",
      "RequestHeaders": {
        "Authorization": "Sanitized",
        "Content-Length": "93",
        "Content-Type": "application/json",
        "If-Match": "\u0022\u0022",
        "User-Agent": [
          "azsdk-net-Iot.Hub.Service/1.0.0-dev.20200820.1",
          "(.NET Core 4.6.28516.03; Microsoft Windows 10.0.18363 )"
        ],
        "x-ms-client-request-id": "0c8a7ae4ed2b249acf5b3495691d1cbc",
        "x-ms-return-client-request-id": "true"
      },
      "RequestBody": {
        "moduleId": "IdentityLifecycleModule258468012",
        "deviceId": "IdentityLifecycleDevice733449647"
      },
      "StatusCode": 200,
      "ResponseHeaders": {
        "Content-Length": "495",
        "Content-Type": "application/json; charset=utf-8",
        "Date": "Thu, 20 Aug 2020 21:44:52 GMT",
        "Server": "Microsoft-HTTPAPI/2.0",
        "Vary": "Origin",
        "x-ms-request-id": "82c08394-dccd-47a7-9c88-59c452e1c278"
      },
      "ResponseBody": {
        "moduleId": "IdentityLifecycleModule258468012",
        "managedBy": null,
        "deviceId": "IdentityLifecycleDevice733449647",
        "generationId": "637335566930041762",
        "etag": "NDU5NjA5NTUw",
        "connectionState": "Disconnected",
        "connectionStateUpdatedTime": "0001-01-01T00:00:00",
        "lastActivityTime": "0001-01-01T00:00:00",
        "cloudToDeviceMessageCount": 0,
        "authentication": {
          "symmetricKey": {
            "primaryKey": "Sanitized",
            "secondaryKey": "Sanitized"
          },
          "x509Thumbprint": {
            "primaryThumbprint": null,
            "secondaryThumbprint": null
          },
          "type": "sas"
        }
      }
    },
    {
      "RequestUri": "https://FakeHost.net/devices/IdentityLifecycleDevice733449647/modules/IdentityLifecycleModule258468012?api-version=2020-03-13",
      "RequestMethod": "GET",
      "RequestHeaders": {
        "Authorization": "Sanitized",
        "User-Agent": [
          "azsdk-net-Iot.Hub.Service/1.0.0-dev.20200820.1",
          "(.NET Core 4.6.28516.03; Microsoft Windows 10.0.18363 )"
        ],
        "x-ms-client-request-id": "5470ce20cb11326141096ccc183de0fc",
        "x-ms-return-client-request-id": "true"
      },
      "RequestBody": null,
      "StatusCode": 200,
      "ResponseHeaders": {
        "Content-Length": "497",
        "Content-Type": "application/json; charset=utf-8",
        "Date": "Thu, 20 Aug 2020 21:44:52 GMT",
        "Server": "Microsoft-HTTPAPI/2.0",
        "Vary": "Origin",
        "x-ms-request-id": "b1400216-fadd-4c9c-a137-6d8b471c1107"
      },
      "ResponseBody": {
        "moduleId": "IdentityLifecycleModule258468012",
        "managedBy": null,
        "deviceId": "IdentityLifecycleDevice733449647",
        "generationId": "637335566930041762",
        "etag": "NDU5NjA5NTUw",
        "connectionState": "Disconnected",
        "connectionStateUpdatedTime": "0001-01-01T00:00:00Z",
        "lastActivityTime": "0001-01-01T00:00:00Z",
        "cloudToDeviceMessageCount": 0,
        "authentication": {
          "symmetricKey": {
            "primaryKey": "Sanitized",
            "secondaryKey": "Sanitized"
          },
          "x509Thumbprint": {
            "primaryThumbprint": null,
            "secondaryThumbprint": null
          },
          "type": "sas"
        }
      }
    },
    {
      "RequestUri": "https://FakeHost.net/devices/IdentityLifecycleDevice733449647/modules/IdentityLifecycleModule258468012?api-version=2020-03-13",
      "RequestMethod": "PUT",
      "RequestHeaders": {
        "Authorization": "Sanitized",
        "Content-Length": "460",
        "Content-Type": "application/json",
        "If-Match": "*",
        "User-Agent": [
          "azsdk-net-Iot.Hub.Service/1.0.0-dev.20200820.1",
          "(.NET Core 4.6.28516.03; Microsoft Windows 10.0.18363 )"
        ],
        "x-ms-client-request-id": "44c2c1a4a2ef198080f263bd92f54d8a",
        "x-ms-return-client-request-id": "true"
      },
      "RequestBody": {
        "moduleId": "IdentityLifecycleModule258468012",
        "managedBy": "SomeChangedValue",
        "deviceId": "IdentityLifecycleDevice733449647",
        "generationId": "637335566930041762",
        "etag": "NDU5NjA5NTUw",
        "connectionState": "Disconnected",
        "connectionStateUpdatedTime": "0001-01-01T00:00:00Z",
        "lastActivityTime": "0001-01-01T00:00:00Z",
        "cloudToDeviceMessageCount": 0,
        "authentication": {
          "symmetricKey": {
            "primaryKey": "Sanitized",
            "secondaryKey": "Sanitized"
          },
          "x509Thumbprint": {},
          "type": "sas"
        }
      },
      "StatusCode": 200,
      "ResponseHeaders": {
        "Content-Length": "511",
        "Content-Type": "application/json; charset=utf-8",
        "Date": "Thu, 20 Aug 2020 21:44:52 GMT",
        "Server": "Microsoft-HTTPAPI/2.0",
        "Vary": "Origin",
        "x-ms-request-id": "593d4554-4d56-467d-8b5f-c79038a918c8"
      },
      "ResponseBody": {
        "moduleId": "IdentityLifecycleModule258468012",
        "managedBy": "SomeChangedValue",
        "deviceId": "IdentityLifecycleDevice733449647",
        "generationId": "637335566930041762",
        "etag": "NDU5NjA5NTUx",
        "connectionState": "Disconnected",
        "connectionStateUpdatedTime": "0001-01-01T00:00:00Z",
        "lastActivityTime": "0001-01-01T00:00:00Z",
        "cloudToDeviceMessageCount": 0,
        "authentication": {
          "symmetricKey": {
            "primaryKey": "Sanitized",
            "secondaryKey": "Sanitized"
          },
          "x509Thumbprint": {
            "primaryThumbprint": null,
            "secondaryThumbprint": null
          },
          "type": "sas"
        }
      }
    },
    {
      "RequestUri": "https://FakeHost.net/devices/IdentityLifecycleDevice733449647?api-version=2020-03-13",
      "RequestMethod": "DELETE",
      "RequestHeaders": {
        "Authorization": "Sanitized",
        "If-Match": "*",
        "User-Agent": [
          "azsdk-net-Iot.Hub.Service/1.0.0-dev.20200820.1",
          "(.NET Core 4.6.28516.03; Microsoft Windows 10.0.18363 )"
        ],
        "x-ms-client-request-id": "cc50fd4f7fcd18f11858ca2180ce0b92",
        "x-ms-return-client-request-id": "true"
      },
      "RequestBody": null,
      "StatusCode": 204,
      "ResponseHeaders": {
        "Content-Length": "0",
        "Date": "Thu, 20 Aug 2020 21:44:52 GMT",
        "Server": "Microsoft-HTTPAPI/2.0",
        "Vary": "Origin",
        "x-ms-request-id": "b4b5cf92-30ab-4f97-9514-376dce6c4608"
      },
      "ResponseBody": []
    }
  ],
  "Variables": {
    "IOT_HUB_CONNECTION_STRING": "HostName=FakeHost.net;SharedAccessKeyName=iothubowner;SharedAccessKey=Kg==",
    "RandomSeed": "53265435"
  }
}