{
  "Entries": [
    {
      "RequestUri": "https://azsdknet-test-ta.cognitiveservices.azure.com/text/analytics/v3.1-preview.1/entities/recognition/general?showStats=false",
      "RequestMethod": "POST",
      "RequestHeaders": {
        "Content-Length": "64",
        "Content-Type": "application/json",
        "Ocp-Apim-Subscription-Key": "Sanitized",
        "traceparent": "00-83624fdf1894a243ba2dce97bb4cb7f1-bcc60a048a32324c-00",
        "User-Agent": [
          "azsdk-net-AI.TextAnalytics/5.1.0-dev.20200820.1",
          "(.NET Core 4.6.29017.01; Microsoft Windows 10.0.18363 )"
        ],
        "x-ms-client-request-id": "1cfd92bfb8a8fc0c725b043491155b6d",
        "x-ms-return-client-request-id": "true"
      },
      "RequestBody": {
        "documents": [
          {
            "id": null,
            "text": "Hello world",
            "language": "en"
          }
        ]
      },
      "StatusCode": 400,
      "ResponseHeaders": {
        "apim-request-id": "f2de408c-2b3a-4a5b-9171-ebdb041ae07d",
        "Content-Type": "application/json; charset=utf-8",
        "Date": "Fri, 21 Aug 2020 02:54:07 GMT",
        "Strict-Transport-Security": "max-age=31536000; includeSubDomains; preload",
        "Transfer-Encoding": "chunked",
        "X-Content-Type-Options": "nosniff",
        "x-envoy-upstream-service-time": "6"
      },
      "ResponseBody": {
        "error": {
          "code": "InvalidRequest",
          "message": "Invalid document in request.",
          "innererror": {
            "code": "InvalidDocument",
            "message": "At least one document is missing an Id attribute."
          }
        }
      }
    }
  ],
  "Variables": {
    "RandomSeed": "511886477",
    "TEXT_ANALYTICS_API_KEY": "Sanitized",
    "TEXT_ANALYTICS_ENDPOINT": "https://azsdknet-test-ta.cognitiveservices.azure.com/"
  }
}