{
  "Entries": [
    {
      "RequestUri": "https://seanmccprodca.blob.core.windows.net/test-container-715c2983-3cba-2037-ea14-b0de10fe0b00?restype=container",
      "RequestMethod": "PUT",
      "RequestHeaders": {
        "Authorization": "Sanitized",
        "traceparent": "00-dbaefa722ac54742964d070d4ad62829-9feaf3d9b845b349-00",
        "User-Agent": [
          "azsdk-net-Storage.Blobs/12.5.0-dev.20200727.1",
          "(.NET Core 4.6.29017.01; Microsoft Windows 10.0.18362 )"
        ],
        "x-ms-blob-public-access": "container",
        "x-ms-client-request-id": "f7051cf2-55fe-ad49-19e1-3266e0530a66",
        "x-ms-date": "Mon, 27 Jul 2020 17:50:00 GMT",
        "x-ms-return-client-request-id": "true",
        "x-ms-version": "2019-12-12"
      },
      "RequestBody": null,
      "StatusCode": 201,
      "ResponseHeaders": {
        "Content-Length": "0",
        "Date": "Mon, 27 Jul 2020 17:50:02 GMT",
        "ETag": "\u00220x8D832557D102478\u0022",
        "Last-Modified": "Mon, 27 Jul 2020 17:50:02 GMT",
        "Server": [
          "Windows-Azure-Blob/1.0",
          "Microsoft-HTTPAPI/2.0"
        ],
        "x-ms-client-request-id": "f7051cf2-55fe-ad49-19e1-3266e0530a66",
        "x-ms-request-id": "f0517dad-401e-0010-453e-6454ea000000",
        "x-ms-version": "2019-12-12"
      },
      "ResponseBody": []
    },
    {
      "RequestUri": "https://seanmccprodca.blob.core.windows.net/test-container-715c2983-3cba-2037-ea14-b0de10fe0b00/test-blob-d08f73ce-b2a1-0b49-592f-51a3e7f4c9c4",
      "RequestMethod": "PUT",
      "RequestHeaders": {
        "Authorization": "Sanitized",
        "Content-Length": "0",
        "traceparent": "00-02e3f435f277c8469eab808b0fccfce4-669d1b76a27e1842-00",
        "User-Agent": [
          "azsdk-net-Storage.Blobs/12.5.0-dev.20200727.1",
          "(.NET Core 4.6.29017.01; Microsoft Windows 10.0.18362 )"
        ],
        "x-ms-blob-type": "AppendBlob",
        "x-ms-client-request-id": "e374ee0c-9896-4025-d2fa-9ecf04a5c625",
        "x-ms-date": "Mon, 27 Jul 2020 17:50:00 GMT",
        "x-ms-return-client-request-id": "true",
        "x-ms-version": "2019-12-12"
      },
      "RequestBody": null,
      "StatusCode": 201,
      "ResponseHeaders": {
        "Content-Length": "0",
        "Date": "Mon, 27 Jul 2020 17:50:02 GMT",
        "ETag": "\u00220x8D832557D195C8B\u0022",
        "Last-Modified": "Mon, 27 Jul 2020 17:50:02 GMT",
        "Server": [
          "Windows-Azure-Blob/1.0",
          "Microsoft-HTTPAPI/2.0"
        ],
        "x-ms-client-request-id": "e374ee0c-9896-4025-d2fa-9ecf04a5c625",
        "x-ms-request-id": "f0517dc3-401e-0010-593e-6454ea000000",
        "x-ms-request-server-encrypted": "true",
        "x-ms-version": "2019-12-12",
        "x-ms-version-id": "2020-07-27T17:50:02.5348235Z"
      },
      "ResponseBody": []
    },
    {
      "RequestUri": "https://seanmccprodca.blob.core.windows.net/test-container-715c2983-3cba-2037-ea14-b0de10fe0b00/test-blob-d08f73ce-b2a1-0b49-592f-51a3e7f4c9c4",
      "RequestMethod": "HEAD",
      "RequestHeaders": {
        "Authorization": "Sanitized",
        "traceparent": "00-03ae90e285d3d1498a45f47f8422d45e-8959cf9364920842-00",
        "User-Agent": [
          "azsdk-net-Storage.Blobs/12.5.0-dev.20200727.1",
          "(.NET Core 4.6.29017.01; Microsoft Windows 10.0.18362 )"
        ],
        "x-ms-client-request-id": "a8f8963d-68ae-7875-639a-fa690193b1e2",
        "x-ms-date": "Mon, 27 Jul 2020 17:50:00 GMT",
        "x-ms-return-client-request-id": "true",
        "x-ms-version": "2019-12-12"
      },
      "RequestBody": null,
      "StatusCode": 200,
      "ResponseHeaders": {
        "Accept-Ranges": "bytes",
        "Content-Length": "0",
        "Content-Type": "application/octet-stream",
        "Date": "Mon, 27 Jul 2020 17:50:02 GMT",
        "ETag": "\u00220x8D832557D195C8B\u0022",
        "Last-Modified": "Mon, 27 Jul 2020 17:50:02 GMT",
        "Server": [
          "Windows-Azure-Blob/1.0",
          "Microsoft-HTTPAPI/2.0"
        ],
        "x-ms-blob-committed-block-count": "0",
        "x-ms-blob-type": "AppendBlob",
        "x-ms-client-request-id": "a8f8963d-68ae-7875-639a-fa690193b1e2",
        "x-ms-creation-time": "Mon, 27 Jul 2020 17:50:02 GMT",
        "x-ms-is-current-version": "true",
        "x-ms-lease-state": "available",
        "x-ms-lease-status": "unlocked",
        "x-ms-request-id": "f0517dd6-401e-0010-6b3e-6454ea000000",
        "x-ms-server-encrypted": "true",
        "x-ms-version": "2019-12-12",
        "x-ms-version-id": "2020-07-27T17:50:02.5348235Z"
      },
      "ResponseBody": []
    },
    {
      "RequestUri": "https://seanmccprodca.blob.core.windows.net/test-container-715c2983-3cba-2037-ea14-b0de10fe0b00/test-blob-d08f73ce-b2a1-0b49-592f-51a3e7f4c9c4?comp=appendblock",
      "RequestMethod": "PUT",
      "RequestHeaders": {
        "Authorization": "Sanitized",
        "Content-Length": "1024",
        "traceparent": "00-cf0055a1ddbd1f44b40c953dcb725392-e80e9d68a72fff47-00",
        "User-Agent": [
          "azsdk-net-Storage.Blobs/12.5.0-dev.20200727.1",
          "(.NET Core 4.6.29017.01; Microsoft Windows 10.0.18362 )"
        ],
        "x-ms-client-request-id": "34b9dc2a-0a70-0e9d-e63c-8cd50da4def1",
        "x-ms-date": "Mon, 27 Jul 2020 17:50:00 GMT",
        "x-ms-return-client-request-id": "true",
        "x-ms-version": "2019-12-12"
      },
      "RequestBody": "GG6692gWbrtxuNwjv8DG7\u002BOElvh/5S0Uw6sh/nUy0k63zXDXrlRk9YC5cd27AYASNK7rgA/OpjJApjS89XBFP\u002BaObPJQ7kCPIKB4xXRPWMEqD8rGR1I\u002B6SY\u002BlwgfpwAQdDL3LJWNwUVuXF9uVeC98E1zkuamf/eUT4LLElc4b3igaFFBWCwrnE2EWOry0JNGgKa6qxUZafU6YtwTwq/uNuznzu2PfJchSPWYISYNoX/vhZKxfcRihv5cB/ZPGNqeliH\u002BCgKltgMOmGMfgUjOLcBdIzwcPLgohEfvM3Wh0TAb\u002BosFD5Z9Sc6OouVhQwW2jtk18vSdgVlp1Ya6toOObMYyBIa8yB4p39pujprTx0FCOKWbbN87fnkxmzkQwpJL/zUeLj5\u002B\u002BcW6CxIZLvO\u002Blg5FeH3e8wDn9oYNii3lGRxIIo5ktJkCwz/g4GHMIk\u002BGcgUry0oUbQw1Nze4cW6X1fH20QxkWuF0QrQ\u002B/RKeGtQ3hxcnuU3SM7WBLn1iSlLQSAtv1lBDIRgjtomW1W/6lxxigOpWcBujI55W4itkEvdibrUHL0SD9GX/BAPEO11Gh5dh/8loedjvy7Ky7D7svqORM2e58mjX3oyEV2sY3\u002BdAEFqUAxMt\u002BvXdGGOS0QcmEkVfMwj2jJQviSA94yFs1uzKctzkWLuQYzly3NoERQ2FXUQmuavfSYTFZHny8BbTcEF3x18rQrqJzs/OhK\u002B6KkQTuIbdRhxA6ihYHvNCnXMjnmuYjX2tWRuKnOrcEcXUCzk13zeQ9iokNtw20iTGRzFbq\u002BVEIZ3GZV5qUqkyZNljhBK5DL07kqhAc1agd4b2xFW5gGbfj\u002Bmcb3rZJaOB8tID004RDDpzHxg8A61GJe7Xc41UeONyhPQoHZ1DYm0EvoGEnaM35bgaRmFOoow8VUmLAbEWLXrukU9a6O6dL72qN0UswohKn47VOTKCJOFn7MhTt2C77pEGlQtU3f3JfRako2pHD5LBQWEjQPRHbGxt8vslSXhc7km0JSx89sKQDLwc3oF3IN01knb/mK6cvymf5uoBozSeR7Qhk\u002BlmRUqekjQ3K47r9tIe77YBXVaaF2YC3A/Yj2iIfpbMVY3zz00rYAZ5ZZSbs/AX4rN9nOpehnuDY2g7xgLLr633HqBEKyBo1vxPIbLRZykfwKy0CuGrbs8Rb2vl8JkDrbXno5RP07eTFMbuDmXJsvw\u002BGwVWF6XLTLDRMru0g\u002BViTHP86cOU0O30IfUavV9qR71vptWUrZYPHFfkfaD83pHhi8Lxzcg4qkoXYfWvsI5RZ\u002Br9RNwQzp7c7M1rsFNM90JjOTKceHr1NvyKfEuhYGvJkhW2/5q10LwkFeD6zfr3y2mySw==",
      "StatusCode": 201,
      "ResponseHeaders": {
        "Content-Length": "0",
        "Date": "Mon, 27 Jul 2020 17:50:02 GMT",
        "ETag": "\u00220x8D832557D2B6134\u0022",
        "Last-Modified": "Mon, 27 Jul 2020 17:50:02 GMT",
        "Server": [
          "Windows-Azure-Blob/1.0",
          "Microsoft-HTTPAPI/2.0"
        ],
        "x-ms-blob-append-offset": "0",
        "x-ms-blob-committed-block-count": "1",
        "x-ms-client-request-id": "34b9dc2a-0a70-0e9d-e63c-8cd50da4def1",
        "x-ms-content-crc64": "bicuTI4f1aA=",
        "x-ms-request-id": "f0517deb-401e-0010-7e3e-6454ea000000",
        "x-ms-request-server-encrypted": "true",
        "x-ms-version": "2019-12-12"
      },
      "ResponseBody": []
    },
    {
      "RequestUri": "https://seanmccprodca.blob.core.windows.net/test-container-715c2983-3cba-2037-ea14-b0de10fe0b00/test-blob-d08f73ce-b2a1-0b49-592f-51a3e7f4c9c4?comp=appendblock",
      "RequestMethod": "PUT",
      "RequestHeaders": {
        "Authorization": "Sanitized",
        "Content-Length": "1024",
        "If-Match": "\u00220x8D832557D195C8B\u0022",
        "User-Agent": [
          "azsdk-net-Storage.Blobs/12.5.0-dev.20200727.1",
          "(.NET Core 4.6.29017.01; Microsoft Windows 10.0.18362 )"
        ],
        "x-ms-client-request-id": "243e6247-7cd9-e471-76e6-86a19a71e9e8",
        "x-ms-date": "Mon, 27 Jul 2020 17:50:01 GMT",
        "x-ms-return-client-request-id": "true",
        "x-ms-version": "2019-12-12"
      },
      "RequestBody": "GG6692gWbrtxuNwjv8DG7\u002BOElvh/5S0Uw6sh/nUy0k63zXDXrlRk9YC5cd27AYASNK7rgA/OpjJApjS89XBFP\u002BaObPJQ7kCPIKB4xXRPWMEqD8rGR1I\u002B6SY\u002BlwgfpwAQdDL3LJWNwUVuXF9uVeC98E1zkuamf/eUT4LLElc4b3igaFFBWCwrnE2EWOry0JNGgKa6qxUZafU6YtwTwq/uNuznzu2PfJchSPWYISYNoX/vhZKxfcRihv5cB/ZPGNqeliH\u002BCgKltgMOmGMfgUjOLcBdIzwcPLgohEfvM3Wh0TAb\u002BosFD5Z9Sc6OouVhQwW2jtk18vSdgVlp1Ya6toOObMYyBIa8yB4p39pujprTx0FCOKWbbN87fnkxmzkQwpJL/zUeLj5\u002B\u002BcW6CxIZLvO\u002Blg5FeH3e8wDn9oYNii3lGRxIIo5ktJkCwz/g4GHMIk\u002BGcgUry0oUbQw1Nze4cW6X1fH20QxkWuF0QrQ\u002B/RKeGtQ3hxcnuU3SM7WBLn1iSlLQSAtv1lBDIRgjtomW1W/6lxxigOpWcBujI55W4itkEvdibrUHL0SD9GX/BAPEO11Gh5dh/8loedjvy7Ky7D7svqORM2e58mjX3oyEV2sY3\u002BdAEFqUAxMt\u002BvXdGGOS0QcmEkVfMwj2jJQviSA94yFs1uzKctzkWLuQYzly3NoERQ2FXUQmuavfSYTFZHny8BbTcEF3x18rQrqJzs/OhK\u002B6KkQTuIbdRhxA6ihYHvNCnXMjnmuYjX2tWRuKnOrcEcXUCzk13zeQ9iokNtw20iTGRzFbq\u002BVEIZ3GZV5qUqkyZNljhBK5DL07kqhAc1agd4b2xFW5gGbfj\u002Bmcb3rZJaOB8tID004RDDpzHxg8A61GJe7Xc41UeONyhPQoHZ1DYm0EvoGEnaM35bgaRmFOoow8VUmLAbEWLXrukU9a6O6dL72qN0UswohKn47VOTKCJOFn7MhTt2C77pEGlQtU3f3JfRako2pHD5LBQWEjQPRHbGxt8vslSXhc7km0JSx89sKQDLwc3oF3IN01knb/mK6cvymf5uoBozSeR7Qhk\u002BlmRUqekjQ3K47r9tIe77YBXVaaF2YC3A/Yj2iIfpbMVY3zz00rYAZ5ZZSbs/AX4rN9nOpehnuDY2g7xgLLr633HqBEKyBo1vxPIbLRZykfwKy0CuGrbs8Rb2vl8JkDrbXno5RP07eTFMbuDmXJsvw\u002BGwVWF6XLTLDRMru0g\u002BViTHP86cOU0O30IfUavV9qR71vptWUrZYPHFfkfaD83pHhi8Lxzcg4qkoXYfWvsI5RZ\u002Br9RNwQzp7c7M1rsFNM90JjOTKceHr1NvyKfEuhYGvJkhW2/5q10LwkFeD6zfr3y2mySw==",
      "StatusCode": 412,
      "ResponseHeaders": {
        "Content-Length": "252",
        "Content-Type": "application/xml",
        "Date": "Mon, 27 Jul 2020 17:50:02 GMT",
        "Server": [
          "Windows-Azure-Blob/1.0",
          "Microsoft-HTTPAPI/2.0"
        ],
        "x-ms-client-request-id": "243e6247-7cd9-e471-76e6-86a19a71e9e8",
        "x-ms-error-code": "ConditionNotMet",
        "x-ms-request-id": "f0517dff-401e-0010-123e-6454ea000000",
        "x-ms-version": "2019-12-12"
      },
      "ResponseBody": [
        "\uFEFF\u003C?xml version=\u00221.0\u0022 encoding=\u0022utf-8\u0022?\u003E\u003CError\u003E\u003CCode\u003EConditionNotMet\u003C/Code\u003E\u003CMessage\u003EThe condition specified using HTTP conditional header(s) is not met.\n",
        "RequestId:f0517dff-401e-0010-123e-6454ea000000\n",
        "Time:2020-07-27T17:50:02.7125755Z\u003C/Message\u003E\u003C/Error\u003E"
      ]
    },
    {
      "RequestUri": "https://seanmccprodca.blob.core.windows.net/test-container-715c2983-3cba-2037-ea14-b0de10fe0b00?restype=container",
      "RequestMethod": "DELETE",
      "RequestHeaders": {
        "Authorization": "Sanitized",
        "traceparent": "00-9466a011587dea44ab0d39b2132b7670-e0fc4431e651764f-00",
        "User-Agent": [
          "azsdk-net-Storage.Blobs/12.5.0-dev.20200727.1",
          "(.NET Core 4.6.29017.01; Microsoft Windows 10.0.18362 )"
        ],
        "x-ms-client-request-id": "aa8d0294-ba65-2217-ff68-0288ae9f7cde",
        "x-ms-date": "Mon, 27 Jul 2020 17:50:01 GMT",
        "x-ms-return-client-request-id": "true",
        "x-ms-version": "2019-12-12"
      },
      "RequestBody": null,
      "StatusCode": 202,
      "ResponseHeaders": {
        "Content-Length": "0",
        "Date": "Mon, 27 Jul 2020 17:50:02 GMT",
        "Server": [
          "Windows-Azure-Blob/1.0",
          "Microsoft-HTTPAPI/2.0"
        ],
        "x-ms-client-request-id": "aa8d0294-ba65-2217-ff68-0288ae9f7cde",
        "x-ms-request-id": "f0517e12-401e-0010-253e-6454ea000000",
        "x-ms-version": "2019-12-12"
      },
      "ResponseBody": []
    }
  ],
  "Variables": {
    "RandomSeed": "774481718",
    "Storage_TestConfigDefault": "ProductionTenant\nseanmccprodca\nU2FuaXRpemVk\nhttps://seanmccprodca.blob.core.windows.net\nhttps://seanmccprodca.file.core.windows.net\nhttps://seanmccprodca.queue.core.windows.net\nhttps://seanmccprodca.table.core.windows.net\n\n\n\n\nhttps://seanmccprodca-secondary.blob.core.windows.net\nhttps://seanmccprodca-secondary.file.core.windows.net\nhttps://seanmccprodca-secondary.queue.core.windows.net\nhttps://seanmccprodca-secondary.table.core.windows.net\n\nSanitized\n\n\nCloud\nBlobEndpoint=https://seanmccprodca.blob.core.windows.net/;QueueEndpoint=https://seanmccprodca.queue.core.windows.net/;FileEndpoint=https://seanmccprodca.file.core.windows.net/;BlobSecondaryEndpoint=https://seanmccprodca-secondary.blob.core.windows.net/;QueueSecondaryEndpoint=https://seanmccprodca-secondary.queue.core.windows.net/;FileSecondaryEndpoint=https://seanmccprodca-secondary.file.core.windows.net/;AccountName=seanmccprodca;AccountKey=Kg==;\nseanscope1"
  }
}