{
  "Entries": [
    {
      "RequestUri": "https://https://fakeHost.api.wus2.digitaltwins.azure.net/models/dtmi%3Aexample%3AWard%3B155773321?includeModelDefinition=true\u0026api-version=2020-05-31-preview",
      "RequestMethod": "GET",
      "RequestHeaders": {
        "Authorization": "Sanitized",
        "User-Agent": [
          "azsdk-net-DigitalTwins.Core/1.0.0-dev.20200820.1",
          "(.NET Core 4.6.29130.01; Microsoft Windows 10.0.18363 )"
        ],
        "x-ms-client-request-id": "d6aefe888904034dcc1935e4537abc9b",
        "x-ms-return-client-request-id": "true"
      },
      "RequestBody": null,
      "StatusCode": 200,
      "ResponseHeaders": {
        "Content-Length": "613",
        "Content-Type": "application/json; charset=utf-8",
        "Date": "Thu, 20 Aug 2020 22:33:06 GMT",
        "Strict-Transport-Security": "max-age=2592000"
      },
      "ResponseBody": {
        "id": "dtmi:example:Ward;155773321",
        "description": {
          "en": "A separate partition in a building, made of rooms and hallways."
        },
        "displayName": {
          "en": "Ward"
        },
        "decommissioned": false,
        "uploadTime": "2020-08-20T22:15:40.9055635\u002B00:00",
        "model": {
          "@id": "dtmi:example:Ward;155773321",
          "@type": "Interface",
          "displayName": "Ward",
          "description": "A separate partition in a building, made of rooms and hallways.",
          "contents": [
            {
              "@type": "Property",
              "name": "VisitorCount",
              "schema": "double"
            },
            {
              "@type": "Property",
              "name": "HandWashPercentage",
              "schema": "double"
            },
            {
              "@type": "Relationship",
              "name": "managedRooms"
            }
          ],
          "@context": [
            "dtmi:dtdl:context;2"
          ]
        }
      }
    },
    {
      "RequestUri": "https://https://fakeHost.api.wus2.digitaltwins.azure.net/models/dtmi%3Aexample%3AWard%3B145121366?includeModelDefinition=true\u0026api-version=2020-05-31-preview",
      "RequestMethod": "GET",
      "RequestHeaders": {
        "Authorization": "Sanitized",
        "User-Agent": [
          "azsdk-net-DigitalTwins.Core/1.0.0-dev.20200820.1",
          "(.NET Core 4.6.29130.01; Microsoft Windows 10.0.18363 )"
        ],
        "x-ms-client-request-id": "e3d2a5cb1255eeffc2ac1cd41e6dc8f6",
        "x-ms-return-client-request-id": "true"
      },
      "RequestBody": null,
      "StatusCode": 200,
      "ResponseHeaders": {
        "Content-Length": "613",
        "Content-Type": "application/json; charset=utf-8",
        "Date": "Thu, 20 Aug 2020 22:33:06 GMT",
        "Strict-Transport-Security": "max-age=2592000"
      },
      "ResponseBody": {
        "id": "dtmi:example:Ward;145121366",
        "description": {
          "en": "A separate partition in a building, made of rooms and hallways."
        },
        "displayName": {
          "en": "Ward"
        },
        "decommissioned": false,
        "uploadTime": "2020-08-20T22:16:00.0953669\u002B00:00",
        "model": {
          "@id": "dtmi:example:Ward;145121366",
          "@type": "Interface",
          "displayName": "Ward",
          "description": "A separate partition in a building, made of rooms and hallways.",
          "contents": [
            {
              "@type": "Property",
              "name": "VisitorCount",
              "schema": "double"
            },
            {
              "@type": "Property",
              "name": "HandWashPercentage",
              "schema": "double"
            },
            {
              "@type": "Relationship",
              "name": "managedRooms"
            }
          ],
          "@context": [
            "dtmi:dtdl:context;2"
          ]
        }
      }
    },
    {
      "RequestUri": "https://https://fakeHost.api.wus2.digitaltwins.azure.net/models/dtmi%3Aexample%3AWard%3B113005607?includeModelDefinition=true\u0026api-version=2020-05-31-preview",
      "RequestMethod": "GET",
      "RequestHeaders": {
        "Authorization": "Sanitized",
        "User-Agent": [
          "azsdk-net-DigitalTwins.Core/1.0.0-dev.20200820.1",
          "(.NET Core 4.6.29130.01; Microsoft Windows 10.0.18363 )"
        ],
        "x-ms-client-request-id": "723cc0e56bf6f802e49a6dee471d48f8",
        "x-ms-return-client-request-id": "true"
      },
      "RequestBody": null,
      "StatusCode": 200,
      "ResponseHeaders": {
        "Content-Length": "613",
        "Content-Type": "application/json; charset=utf-8",
        "Date": "Thu, 20 Aug 2020 22:33:06 GMT",
        "Strict-Transport-Security": "max-age=2592000"
      },
      "ResponseBody": {
        "id": "dtmi:example:Ward;113005607",
        "description": {
          "en": "A separate partition in a building, made of rooms and hallways."
        },
        "displayName": {
          "en": "Ward"
        },
        "decommissioned": false,
        "uploadTime": "2020-08-20T22:20:24.3285847\u002B00:00",
        "model": {
          "@id": "dtmi:example:Ward;113005607",
          "@type": "Interface",
          "displayName": "Ward",
          "description": "A separate partition in a building, made of rooms and hallways.",
          "contents": [
            {
              "@type": "Property",
              "name": "VisitorCount",
              "schema": "double"
            },
            {
              "@type": "Property",
              "name": "HandWashPercentage",
              "schema": "double"
            },
            {
              "@type": "Relationship",
              "name": "managedRooms"
            }
          ],
          "@context": [
            "dtmi:dtdl:context;2"
          ]
        }
      }
    },
    {
      "RequestUri": "https://https://fakeHost.api.wus2.digitaltwins.azure.net/models/dtmi%3Aexample%3AWard%3B181743108?includeModelDefinition=true\u0026api-version=2020-05-31-preview",
      "RequestMethod": "GET",
      "RequestHeaders": {
        "Authorization": "Sanitized",
        "User-Agent": [
          "azsdk-net-DigitalTwins.Core/1.0.0-dev.20200820.1",
          "(.NET Core 4.6.29130.01; Microsoft Windows 10.0.18363 )"
        ],
        "x-ms-client-request-id": "a534a2ffec33e7af42dc302eadab6ded",
        "x-ms-return-client-request-id": "true"
      },
      "RequestBody": null,
      "StatusCode": 200,
      "ResponseHeaders": {
        "Content-Length": "613",
        "Content-Type": "application/json; charset=utf-8",
        "Date": "Thu, 20 Aug 2020 22:33:06 GMT",
        "Strict-Transport-Security": "max-age=2592000"
      },
      "ResponseBody": {
        "id": "dtmi:example:Ward;181743108",
        "description": {
          "en": "A separate partition in a building, made of rooms and hallways."
        },
        "displayName": {
          "en": "Ward"
        },
        "decommissioned": false,
        "uploadTime": "2020-08-20T22:20:41.5341247\u002B00:00",
        "model": {
          "@id": "dtmi:example:Ward;181743108",
          "@type": "Interface",
          "displayName": "Ward",
          "description": "A separate partition in a building, made of rooms and hallways.",
          "contents": [
            {
              "@type": "Property",
              "name": "VisitorCount",
              "schema": "double"
            },
            {
              "@type": "Property",
              "name": "HandWashPercentage",
              "schema": "double"
            },
            {
              "@type": "Relationship",
              "name": "managedRooms"
            }
          ],
          "@context": [
            "dtmi:dtdl:context;2"
          ]
        }
      }
    },
    {
      "RequestUri": "https://https://fakeHost.api.wus2.digitaltwins.azure.net/models/dtmi%3Aexample%3AWard%3B113886965?includeModelDefinition=true\u0026api-version=2020-05-31-preview",
      "RequestMethod": "GET",
      "RequestHeaders": {
        "Authorization": "Sanitized",
        "User-Agent": [
          "azsdk-net-DigitalTwins.Core/1.0.0-dev.20200820.1",
          "(.NET Core 4.6.29130.01; Microsoft Windows 10.0.18363 )"
        ],
        "x-ms-client-request-id": "f15ffc953ad5ebd0717891007b8fd4dc",
        "x-ms-return-client-request-id": "true"
      },
      "RequestBody": null,
      "StatusCode": 200,
      "ResponseHeaders": {
        "Content-Length": "613",
        "Content-Type": "application/json; charset=utf-8",
        "Date": "Thu, 20 Aug 2020 22:33:06 GMT",
        "Strict-Transport-Security": "max-age=2592000"
      },
      "ResponseBody": {
        "id": "dtmi:example:Ward;113886965",
        "description": {
          "en": "A separate partition in a building, made of rooms and hallways."
        },
        "displayName": {
          "en": "Ward"
        },
        "decommissioned": false,
        "uploadTime": "2020-08-20T22:30:22.9339216\u002B00:00",
        "model": {
          "@id": "dtmi:example:Ward;113886965",
          "@type": "Interface",
          "displayName": "Ward",
          "description": "A separate partition in a building, made of rooms and hallways.",
          "contents": [
            {
              "@type": "Property",
              "name": "VisitorCount",
              "schema": "double"
            },
            {
              "@type": "Property",
              "name": "HandWashPercentage",
              "schema": "double"
            },
            {
              "@type": "Relationship",
              "name": "managedRooms"
            }
          ],
          "@context": [
            "dtmi:dtdl:context;2"
          ]
        }
      }
    },
    {
      "RequestUri": "https://https://fakeHost.api.wus2.digitaltwins.azure.net/models/dtmi%3Aexample%3AWard%3B144973413?includeModelDefinition=true\u0026api-version=2020-05-31-preview",
      "RequestMethod": "GET",
      "RequestHeaders": {
        "Authorization": "Sanitized",
        "User-Agent": [
          "azsdk-net-DigitalTwins.Core/1.0.0-dev.20200820.1",
          "(.NET Core 4.6.29130.01; Microsoft Windows 10.0.18363 )"
        ],
        "x-ms-client-request-id": "9ac2256ed4b18b8cb48ed1c936ee0001",
        "x-ms-return-client-request-id": "true"
      },
      "RequestBody": null,
      "StatusCode": 404,
      "ResponseHeaders": {
        "Content-Length": "212",
        "Content-Type": "application/json; charset=utf-8",
        "Date": "Thu, 20 Aug 2020 22:33:06 GMT",
        "Strict-Transport-Security": "max-age=2592000"
      },
      "ResponseBody": {
        "error": {
          "code": "ModelNotFound",
          "message": "There is no Model(s) available that matches the provided id(s) dtmi:example:Ward;144973413. Check that the Model ID provided is valid by doing a Model_List API call."
        }
      }
    },
    {
      "RequestUri": "https://https://fakeHost.api.wus2.digitaltwins.azure.net/models?api-version=2020-05-31-preview",
      "RequestMethod": "POST",
      "RequestHeaders": {
        "Accept": "application/json",
        "Authorization": "Sanitized",
        "Content-Length": "567",
        "Content-Type": "application/json; charset=utf-8",
        "User-Agent": [
          "azsdk-net-DigitalTwins.Core/1.0.0-dev.20200820.1",
          "(.NET Core 4.6.29130.01; Microsoft Windows 10.0.18363 )"
        ],
        "x-ms-client-request-id": "994c88332a376468bac1741de6c64d5c",
        "x-ms-return-client-request-id": "true"
      },
      "RequestBody": "[{    \u0022@id\u0022: \u0022dtmi:example:Ward;144973413\u0022,    \u0022@type\u0022: \u0022Interface\u0022,    \u0022displayName\u0022: \u0022Ward\u0022,    \u0022description\u0022: \u0022A separate partition in a building, made of rooms and hallways.\u0022,    \u0022contents\u0022: [        {            \u0022@type\u0022: \u0022Property\u0022,            \u0022name\u0022: \u0022VisitorCount\u0022,            \u0022schema\u0022: \u0022double\u0022        },        {            \u0022@type\u0022: \u0022Property\u0022,            \u0022name\u0022: \u0022HandWashPercentage\u0022,            \u0022schema\u0022: \u0022double\u0022        },        {            \u0022@type\u0022: \u0022Relationship\u0022,            \u0022name\u0022: \u0022managedRooms\u0022        }    ],    \u0022@context\u0022: \u0022dtmi:dtdl:context;2\u0022}]",
      "StatusCode": 201,
      "ResponseHeaders": {
        "Content-Length": "225",
        "Content-Type": "application/json; charset=utf-8",
        "Date": "Thu, 20 Aug 2020 22:33:07 GMT",
        "Strict-Transport-Security": "max-age=2592000"
      },
      "ResponseBody": "[{\u0022id\u0022:\u0022dtmi:example:Ward;144973413\u0022,\u0022description\u0022:{\u0022en\u0022:\u0022A separate partition in a building, made of rooms and hallways.\u0022},\u0022displayName\u0022:{\u0022en\u0022:\u0022Ward\u0022},\u0022decommissioned\u0022:false,\u0022uploadTime\u0022:\u00222020-08-20T22:33:07.9394918\u002B00:00\u0022}]"
    },
    {
      "RequestUri": "https://https://fakeHost.api.wus2.digitaltwins.azure.net/models?api-version=2020-05-31-preview",
      "RequestMethod": "POST",
      "RequestHeaders": {
        "Accept": "application/json",
        "Authorization": "Sanitized",
        "Content-Length": "567",
        "Content-Type": "application/json; charset=utf-8",
        "User-Agent": [
          "azsdk-net-DigitalTwins.Core/1.0.0-dev.20200820.1",
          "(.NET Core 4.6.29130.01; Microsoft Windows 10.0.18363 )"
        ],
        "x-ms-client-request-id": "473db752792b27e3d26520abfe213b89",
        "x-ms-return-client-request-id": "true"
      },
      "RequestBody": "[{    \u0022@id\u0022: \u0022dtmi:example:Ward;144973413\u0022,    \u0022@type\u0022: \u0022Interface\u0022,    \u0022displayName\u0022: \u0022Ward\u0022,    \u0022description\u0022: \u0022A separate partition in a building, made of rooms and hallways.\u0022,    \u0022contents\u0022: [        {            \u0022@type\u0022: \u0022Property\u0022,            \u0022name\u0022: \u0022VisitorCount\u0022,            \u0022schema\u0022: \u0022double\u0022        },        {            \u0022@type\u0022: \u0022Property\u0022,            \u0022name\u0022: \u0022HandWashPercentage\u0022,            \u0022schema\u0022: \u0022double\u0022        },        {            \u0022@type\u0022: \u0022Relationship\u0022,            \u0022name\u0022: \u0022managedRooms\u0022        }    ],    \u0022@context\u0022: \u0022dtmi:dtdl:context;2\u0022}]",
      "StatusCode": 409,
      "ResponseHeaders": {
        "Content-Length": "224",
        "Content-Type": "application/json; charset=utf-8",
        "Date": "Thu, 20 Aug 2020 22:33:08 GMT",
        "Strict-Transport-Security": "max-age=2592000"
      },
      "ResponseBody": {
        "error": {
          "code": "ModelAlreadyExists",
          "message": "Model with same ID already exists dtmi:example:Ward;144973413. Use Model_List API to view models that already exist. See the Swagger example.(http://aka.ms/ModelListSwSmpl)"
        }
      }
    }
  ],
  "Variables": {
    "DIGITALTWINS_URL": "https://fakeHost.api.wus2.digitaltwins.azure.net",
    "RandomSeed": "1374115566"
  }
}