{
  "Entries": [
    {
      "RequestUri": "https://seannsecanary.blob.core.windows.net/test-filesystem-b091e030-5297-2805-36b9-91d4f2c29887?restype=container",
      "RequestMethod": "PUT",
      "RequestHeaders": {
        "Authorization": "Sanitized",
        "traceparent": "00-a06fd6920b68ac45acca92e009865f7c-d0d0bbc91fa06d41-00",
        "User-Agent": [
          "azsdk-net-Storage.Files.DataLake/12.3.0-dev.20200727.1",
          "(.NET Core 4.6.29017.01; Microsoft Windows 10.0.18362 )"
        ],
        "x-ms-blob-public-access": "container",
        "x-ms-client-request-id": "eed76313-f149-956b-ed36-e2e12dba3ab8",
        "x-ms-date": "Mon, 27 Jul 2020 21:32:32 GMT",
        "x-ms-return-client-request-id": "true",
        "x-ms-version": "2019-12-12"
      },
      "RequestBody": null,
      "StatusCode": 201,
      "ResponseHeaders": {
        "Content-Length": "0",
        "Date": "Mon, 27 Jul 2020 21:32:32 GMT",
        "ETag": "\u00220x8D83274922D914F\u0022",
        "Last-Modified": "Mon, 27 Jul 2020 21:32:32 GMT",
        "Server": [
          "Windows-Azure-Blob/1.0",
          "Microsoft-HTTPAPI/2.0"
        ],
        "x-ms-client-request-id": "eed76313-f149-956b-ed36-e2e12dba3ab8",
        "x-ms-request-id": "3a7cb6b1-b01e-005e-3b5d-64a640000000",
        "x-ms-version": "2019-12-12"
      },
      "ResponseBody": []
    },
    {
      "RequestUri": "https://seannsecanary.dfs.core.windows.net/test-filesystem-b091e030-5297-2805-36b9-91d4f2c29887/test-file-bf1be087-f396-5bb8-a5df-fac4e7032ef6?resource=file",
      "RequestMethod": "PUT",
      "RequestHeaders": {
        "Authorization": "Sanitized",
        "traceparent": "00-209b444716404e43b21526f3524edda2-85a8d3718e6a0e4f-00",
        "User-Agent": [
          "azsdk-net-Storage.Files.DataLake/12.3.0-dev.20200727.1",
          "(.NET Core 4.6.29017.01; Microsoft Windows 10.0.18362 )"
        ],
        "x-ms-client-request-id": "187ab397-e724-2040-ab7b-4969f7a6adea",
        "x-ms-date": "Mon, 27 Jul 2020 21:32:33 GMT",
        "x-ms-return-client-request-id": "true",
        "x-ms-version": "2019-12-12"
      },
      "RequestBody": null,
      "StatusCode": 201,
      "ResponseHeaders": {
        "Content-Length": "0",
        "Date": "Mon, 27 Jul 2020 21:32:33 GMT",
        "ETag": "\u00220x8D8327492BBCAD3\u0022",
        "Last-Modified": "Mon, 27 Jul 2020 21:32:33 GMT",
        "Server": [
          "Windows-Azure-HDFS/1.0",
          "Microsoft-HTTPAPI/2.0"
        ],
        "x-ms-client-request-id": "187ab397-e724-2040-ab7b-4969f7a6adea",
        "x-ms-request-id": "7cf3f600-701f-0041-5c5d-641544000000",
        "x-ms-version": "2019-12-12"
      },
      "ResponseBody": []
    },
    {
      "RequestUri": "https://seannsecanary.blob.core.windows.net/test-filesystem-b091e030-5297-2805-36b9-91d4f2c29887/test-file-bf1be087-f396-5bb8-a5df-fac4e7032ef6",
      "RequestMethod": "HEAD",
      "RequestHeaders": {
        "Authorization": "Sanitized",
        "User-Agent": [
          "azsdk-net-Storage.Files.DataLake/12.3.0-dev.20200727.1",
          "(.NET Core 4.6.29017.01; Microsoft Windows 10.0.18362 )"
        ],
        "x-ms-client-request-id": "ea1e872c-7d60-3848-d17e-9d15cb5e23d4",
        "x-ms-date": "Mon, 27 Jul 2020 21:32:33 GMT",
        "x-ms-return-client-request-id": "true",
        "x-ms-version": "2019-12-12"
      },
      "RequestBody": null,
      "StatusCode": 200,
      "ResponseHeaders": {
        "Accept-Ranges": "bytes",
        "Content-Length": "0",
        "Content-Type": "application/octet-stream",
        "Date": "Mon, 27 Jul 2020 21:32:32 GMT",
        "ETag": "\u00220x8D8327492BBCAD3\u0022",
        "Last-Modified": "Mon, 27 Jul 2020 21:32:33 GMT",
        "Server": [
          "Windows-Azure-Blob/1.0",
          "Microsoft-HTTPAPI/2.0"
        ],
        "x-ms-access-tier": "Hot",
        "x-ms-access-tier-inferred": "true",
        "x-ms-blob-type": "BlockBlob",
        "x-ms-client-request-id": "ea1e872c-7d60-3848-d17e-9d15cb5e23d4",
        "x-ms-creation-time": "Mon, 27 Jul 2020 21:32:33 GMT",
        "x-ms-lease-state": "available",
        "x-ms-lease-status": "unlocked",
        "x-ms-request-id": "3a7cb709-b01e-005e-7d5d-64a640000000",
        "x-ms-server-encrypted": "true",
        "x-ms-version": "2019-12-12"
      },
      "ResponseBody": []
    },
    {
      "RequestUri": "https://seannsecanary.dfs.core.windows.net/test-filesystem-b091e030-5297-2805-36b9-91d4f2c29887/test-file-bf1be087-f396-5bb8-a5df-fac4e7032ef6?action=append\u0026position=0",
      "RequestMethod": "PATCH",
      "RequestHeaders": {
        "Authorization": "Sanitized",
        "Content-Length": "1024",
        "User-Agent": [
          "azsdk-net-Storage.Files.DataLake/12.3.0-dev.20200727.1",
          "(.NET Core 4.6.29017.01; Microsoft Windows 10.0.18362 )"
        ],
        "x-ms-client-request-id": "eed653c5-0f9e-cbde-aca6-f7a790b11930",
        "x-ms-date": "Mon, 27 Jul 2020 21:32:33 GMT",
        "x-ms-return-client-request-id": "true",
        "x-ms-version": "2019-12-12"
      },
      "RequestBody": "B\u002BzPc/mszd2ij21OnPdqS1r/LTSIFtEpeaHjbmDUlauZa7kFihEB6\u002BWddpV68YOzEf4P\u002BHl5YvEapvlYyF58zvrBtTA\u002BZMBI/UFP6588rogdMF1ixJ0yIAnH6\u002BMYqSKGIKeauTxSdK09xvo4KnZR3vdxOpgBGgldj5QndnndMFQeyMv4ofVLy7uvJf6i\u002BfaSdg3sp26KhAWePSqnK/0zYJalGmGrWTwBJW/dUvULupWelABs8IjllETFWmTLo6C9e8Ro/d\u002BU5xzQ6oH/rDIQkoOUCZb8x28Nv4Yc5v/XNoLPH9Ywor22Ca3kmwUG5ucStMfhNpoJwLRVWj1ZdwAd\u002BbT/L41c4PDF3v/pGCtqBtifCjE49gDnxl4h20h/XZGsxqJRBrdZttTXG1iaH6iI6lNkuW3P5QKzF2kvOgWnRoBuPVGJGAAhRVRdYdunTaa2mPD0G6Mk3eGgne9NKnvPL9TXK\u002BJW/9FTQnMYcYQmDMnDeaEUsyrdSV9w6HsQ0xvYjjIG0CLDX5keoNgvC2tdeZElirDZunuq\u002BuGC5hZWQm5YQONSIDun/xkI9RJSrT7zEm/p60lq/tO2XNVAQHmCyF5p18uIC1lVfYqX0cVpV02jj9OnbFYl7UEPm8NmZ7\u002BfhSy06dVzagcWlG6\u002B0y0OTQSInLGm21wHROqJeW\u002BV7xXL90uYtW53MCTLkNjoZhkUAU6\u002B3ssN\u002BarQrKTq6fGXgKVZ8tvhdZiWEGyN2kqDH93RdXgh1hBKvv6hxwjJjEYyNBAyj3Q9Mou2KM5egB5fTY3HGXN5dqmUDjTdQK6PzIMlWqY6UJBok0Psa65C6z3fQXp7AXPTub1mnoA/YPLdJltKOCV4Jfz9X4YwjAv6USP2/f4zFMsQUqHo07IPKDJQD0RT97IYZxx\u002BfaLsoiyya0xdSWPzqRKPOuaDj1FJ7TZU333Gp1lw3ZXitZYpI691NWdlst/PXGUyw73MlNjKNI9smMOu68Tz7GvOEfR7ZhY2Dlnq5DtWhIIYlOOco0m9F4EGvIvsxkqicsV0AUtwt12mlYZ\u002B309UFRNAlVbhVkkiEPlzdKmLSkcPR3J14oM3qN2G9Q3CPjcxsad3qzDzwRt8UvBR/UKzGks\u002Bb5jd3zOQCe15WmE7X9LCQsICFJ4WG4ZW\u002BI\u002BT5qqa09vBhM\u002BfU9Jz56JCema6QPMdj7qAsAatJ1MRhuej/CNC3oeGedoDIu7vjiz706EfnLecdVfwGiLUFFx7jczr0Op/AJveNMcYGmzMkCHZsVSx8uovBofMUsNlsWV\u002Bh5QhBL5CfNMFQGjwhFvqI4kB\u002BmIIypviu8ljs63XeYJhmZLXqotjlzWAq7GBPoEr4S45Y7YDdr35Pw==",
      "StatusCode": 202,
      "ResponseHeaders": {
        "Content-Length": "0",
        "Date": "Mon, 27 Jul 2020 21:32:33 GMT",
        "Server": [
          "Windows-Azure-HDFS/1.0",
          "Microsoft-HTTPAPI/2.0"
        ],
        "x-ms-client-request-id": "eed653c5-0f9e-cbde-aca6-f7a790b11930",
        "x-ms-request-id": "7cf3f601-701f-0041-5d5d-641544000000",
        "x-ms-request-server-encrypted": "true",
        "x-ms-version": "2019-12-12"
      },
      "ResponseBody": []
    },
    {
      "RequestUri": "https://seannsecanary.dfs.core.windows.net/test-filesystem-b091e030-5297-2805-36b9-91d4f2c29887/test-file-bf1be087-f396-5bb8-a5df-fac4e7032ef6?action=flush\u0026position=1024",
      "RequestMethod": "PATCH",
      "RequestHeaders": {
        "Authorization": "Sanitized",
        "Content-Length": "0",
        "User-Agent": [
          "azsdk-net-Storage.Files.DataLake/12.3.0-dev.20200727.1",
          "(.NET Core 4.6.29017.01; Microsoft Windows 10.0.18362 )"
        ],
        "x-ms-client-request-id": "784f62c9-3487-ce35-8d77-c21275b1ed39",
        "x-ms-date": "Mon, 27 Jul 2020 21:32:33 GMT",
        "x-ms-return-client-request-id": "true",
        "x-ms-version": "2019-12-12"
      },
      "RequestBody": null,
      "StatusCode": 200,
      "ResponseHeaders": {
        "Content-Length": "0",
        "Date": "Mon, 27 Jul 2020 21:32:33 GMT",
        "ETag": "\u00220x8D8327492EF16EC\u0022",
        "Last-Modified": "Mon, 27 Jul 2020 21:32:33 GMT",
        "Server": [
          "Windows-Azure-HDFS/1.0",
          "Microsoft-HTTPAPI/2.0"
        ],
        "x-ms-client-request-id": "784f62c9-3487-ce35-8d77-c21275b1ed39",
        "x-ms-request-id": "7cf3f602-701f-0041-5e5d-641544000000",
        "x-ms-request-server-encrypted": "false",
        "x-ms-version": "2019-12-12"
      },
      "ResponseBody": []
    },
    {
      "RequestUri": "https://seannsecanary.blob.core.windows.net/test-filesystem-b091e030-5297-2805-36b9-91d4f2c29887/test-file-bf1be087-f396-5bb8-a5df-fac4e7032ef6",
      "RequestMethod": "GET",
      "RequestHeaders": {
        "Authorization": "Sanitized",
        "User-Agent": [
          "azsdk-net-Storage.Files.DataLake/12.3.0-dev.20200727.1",
          "(.NET Core 4.6.29017.01; Microsoft Windows 10.0.18362 )"
        ],
        "x-ms-client-request-id": "2ddef4d0-a161-92a8-bf66-81436d98497c",
        "x-ms-date": "Mon, 27 Jul 2020 21:32:33 GMT",
        "x-ms-return-client-request-id": "true",
        "x-ms-version": "2019-12-12"
      },
      "RequestBody": null,
      "StatusCode": 200,
      "ResponseHeaders": {
        "Accept-Ranges": "bytes",
        "Content-Length": "1024",
        "Content-Type": "application/octet-stream",
        "Date": "Mon, 27 Jul 2020 21:32:32 GMT",
        "ETag": "\u00220x8D8327492EF16EC\u0022",
        "Last-Modified": "Mon, 27 Jul 2020 21:32:33 GMT",
        "Server": [
          "Windows-Azure-Blob/1.0",
          "Microsoft-HTTPAPI/2.0"
        ],
        "x-ms-blob-type": "BlockBlob",
        "x-ms-client-request-id": "2ddef4d0-a161-92a8-bf66-81436d98497c",
        "x-ms-creation-time": "Mon, 27 Jul 2020 21:32:33 GMT",
        "x-ms-lease-state": "available",
        "x-ms-lease-status": "unlocked",
        "x-ms-request-id": "3a7cb722-b01e-005e-0e5d-64a640000000",
        "x-ms-server-encrypted": "true",
        "x-ms-version": "2019-12-12"
      },
      "ResponseBody": "B\u002BzPc/mszd2ij21OnPdqS1r/LTSIFtEpeaHjbmDUlauZa7kFihEB6\u002BWddpV68YOzEf4P\u002BHl5YvEapvlYyF58zvrBtTA\u002BZMBI/UFP6588rogdMF1ixJ0yIAnH6\u002BMYqSKGIKeauTxSdK09xvo4KnZR3vdxOpgBGgldj5QndnndMFQeyMv4ofVLy7uvJf6i\u002BfaSdg3sp26KhAWePSqnK/0zYJalGmGrWTwBJW/dUvULupWelABs8IjllETFWmTLo6C9e8Ro/d\u002BU5xzQ6oH/rDIQkoOUCZb8x28Nv4Yc5v/XNoLPH9Ywor22Ca3kmwUG5ucStMfhNpoJwLRVWj1ZdwAd\u002BbT/L41c4PDF3v/pGCtqBtifCjE49gDnxl4h20h/XZGsxqJRBrdZttTXG1iaH6iI6lNkuW3P5QKzF2kvOgWnRoBuPVGJGAAhRVRdYdunTaa2mPD0G6Mk3eGgne9NKnvPL9TXK\u002BJW/9FTQnMYcYQmDMnDeaEUsyrdSV9w6HsQ0xvYjjIG0CLDX5keoNgvC2tdeZElirDZunuq\u002BuGC5hZWQm5YQONSIDun/xkI9RJSrT7zEm/p60lq/tO2XNVAQHmCyF5p18uIC1lVfYqX0cVpV02jj9OnbFYl7UEPm8NmZ7\u002BfhSy06dVzagcWlG6\u002B0y0OTQSInLGm21wHROqJeW\u002BV7xXL90uYtW53MCTLkNjoZhkUAU6\u002B3ssN\u002BarQrKTq6fGXgKVZ8tvhdZiWEGyN2kqDH93RdXgh1hBKvv6hxwjJjEYyNBAyj3Q9Mou2KM5egB5fTY3HGXN5dqmUDjTdQK6PzIMlWqY6UJBok0Psa65C6z3fQXp7AXPTub1mnoA/YPLdJltKOCV4Jfz9X4YwjAv6USP2/f4zFMsQUqHo07IPKDJQD0RT97IYZxx\u002BfaLsoiyya0xdSWPzqRKPOuaDj1FJ7TZU333Gp1lw3ZXitZYpI691NWdlst/PXGUyw73MlNjKNI9smMOu68Tz7GvOEfR7ZhY2Dlnq5DtWhIIYlOOco0m9F4EGvIvsxkqicsV0AUtwt12mlYZ\u002B309UFRNAlVbhVkkiEPlzdKmLSkcPR3J14oM3qN2G9Q3CPjcxsad3qzDzwRt8UvBR/UKzGks\u002Bb5jd3zOQCe15WmE7X9LCQsICFJ4WG4ZW\u002BI\u002BT5qqa09vBhM\u002BfU9Jz56JCema6QPMdj7qAsAatJ1MRhuej/CNC3oeGedoDIu7vjiz706EfnLecdVfwGiLUFFx7jczr0Op/AJveNMcYGmzMkCHZsVSx8uovBofMUsNlsWV\u002Bh5QhBL5CfNMFQGjwhFvqI4kB\u002BmIIypviu8ljs63XeYJhmZLXqotjlzWAq7GBPoEr4S45Y7YDdr35Pw=="
    },
    {
      "RequestUri": "https://seannsecanary.blob.core.windows.net/test-filesystem-b091e030-5297-2805-36b9-91d4f2c29887?restype=container",
      "RequestMethod": "DELETE",
      "RequestHeaders": {
        "Authorization": "Sanitized",
        "traceparent": "00-44b8c375c1c1aa48b480cd3087f43cfa-b62e3d11b3fc864a-00",
        "User-Agent": [
          "azsdk-net-Storage.Files.DataLake/12.3.0-dev.20200727.1",
          "(.NET Core 4.6.29017.01; Microsoft Windows 10.0.18362 )"
        ],
        "x-ms-client-request-id": "8141c779-bfd3-e1d7-d63b-ae33263c290f",
        "x-ms-date": "Mon, 27 Jul 2020 21:32:33 GMT",
        "x-ms-return-client-request-id": "true",
        "x-ms-version": "2019-12-12"
      },
      "RequestBody": null,
      "StatusCode": 202,
      "ResponseHeaders": {
        "Content-Length": "0",
        "Date": "Mon, 27 Jul 2020 21:32:32 GMT",
        "Server": [
          "Windows-Azure-Blob/1.0",
          "Microsoft-HTTPAPI/2.0"
        ],
        "x-ms-client-request-id": "8141c779-bfd3-e1d7-d63b-ae33263c290f",
        "x-ms-request-id": "3a7cb723-b01e-005e-0f5d-64a640000000",
        "x-ms-version": "2019-12-12"
      },
      "ResponseBody": []
    },
    {
      "RequestUri": "https://seannsecanary.blob.core.windows.net/test-filesystem-484944cd-aed8-6717-8bbc-4ca7d1371e86?restype=container",
      "RequestMethod": "PUT",
      "RequestHeaders": {
        "Authorization": "Sanitized",
        "traceparent": "00-988ce116442bc94b9e4515f0ef753b2e-720b38a8a658d440-00",
        "User-Agent": [
          "azsdk-net-Storage.Files.DataLake/12.3.0-dev.20200727.1",
          "(.NET Core 4.6.29017.01; Microsoft Windows 10.0.18362 )"
        ],
        "x-ms-blob-public-access": "container",
        "x-ms-client-request-id": "30a4c090-76ee-ca9a-b0da-f6167330109e",
        "x-ms-date": "Mon, 27 Jul 2020 21:32:33 GMT",
        "x-ms-return-client-request-id": "true",
        "x-ms-version": "2019-12-12"
      },
      "RequestBody": null,
      "StatusCode": 201,
      "ResponseHeaders": {
        "Content-Length": "0",
        "Date": "Mon, 27 Jul 2020 21:32:34 GMT",
        "ETag": "\u00220x8D832749363806F\u0022",
        "Last-Modified": "Mon, 27 Jul 2020 21:32:34 GMT",
        "Server": [
          "Windows-Azure-Blob/1.0",
          "Microsoft-HTTPAPI/2.0"
        ],
        "x-ms-client-request-id": "30a4c090-76ee-ca9a-b0da-f6167330109e",
        "x-ms-request-id": "78eea430-401e-0081-445d-64ed7a000000",
        "x-ms-version": "2019-12-12"
      },
      "ResponseBody": []
    },
    {
      "RequestUri": "https://seannsecanary.dfs.core.windows.net/test-filesystem-484944cd-aed8-6717-8bbc-4ca7d1371e86/test-file-188d271d-8372-04b8-9b55-5978366fac55?resource=file",
      "RequestMethod": "PUT",
      "RequestHeaders": {
        "Authorization": "Sanitized",
        "traceparent": "00-60cc62405dada84f99e87b489c00bf19-c867c08224c81145-00",
        "User-Agent": [
          "azsdk-net-Storage.Files.DataLake/12.3.0-dev.20200727.1",
          "(.NET Core 4.6.29017.01; Microsoft Windows 10.0.18362 )"
        ],
        "x-ms-client-request-id": "938ad94f-e3a8-0c32-079f-95981d229441",
        "x-ms-date": "Mon, 27 Jul 2020 21:32:35 GMT",
        "x-ms-return-client-request-id": "true",
        "x-ms-version": "2019-12-12"
      },
      "RequestBody": null,
      "StatusCode": 201,
      "ResponseHeaders": {
        "Content-Length": "0",
        "Date": "Mon, 27 Jul 2020 21:32:34 GMT",
        "ETag": "\u00220x8D8327493E68644\u0022",
        "Last-Modified": "Mon, 27 Jul 2020 21:32:35 GMT",
        "Server": [
          "Windows-Azure-HDFS/1.0",
          "Microsoft-HTTPAPI/2.0"
        ],
        "x-ms-client-request-id": "938ad94f-e3a8-0c32-079f-95981d229441",
        "x-ms-request-id": "c7611b74-c01f-0019-335d-64cd1b000000",
        "x-ms-version": "2019-12-12"
      },
      "ResponseBody": []
    },
    {
      "RequestUri": "https://seannsecanary.blob.core.windows.net/test-filesystem-484944cd-aed8-6717-8bbc-4ca7d1371e86/test-file-188d271d-8372-04b8-9b55-5978366fac55",
      "RequestMethod": "HEAD",
      "RequestHeaders": {
        "Authorization": "Sanitized",
        "If-Modified-Since": "Sun, 26 Jul 2020 21:32:32 GMT",
        "User-Agent": [
          "azsdk-net-Storage.Files.DataLake/12.3.0-dev.20200727.1",
          "(.NET Core 4.6.29017.01; Microsoft Windows 10.0.18362 )"
        ],
        "x-ms-client-request-id": "7efbb5d7-21cc-a267-861e-bce4a4049fa1",
        "x-ms-date": "Mon, 27 Jul 2020 21:32:35 GMT",
        "x-ms-return-client-request-id": "true",
        "x-ms-version": "2019-12-12"
      },
      "RequestBody": null,
      "StatusCode": 200,
      "ResponseHeaders": {
        "Accept-Ranges": "bytes",
        "Content-Length": "0",
        "Content-Type": "application/octet-stream",
        "Date": "Mon, 27 Jul 2020 21:32:34 GMT",
        "ETag": "\u00220x8D8327493E68644\u0022",
        "Last-Modified": "Mon, 27 Jul 2020 21:32:35 GMT",
        "Server": [
          "Windows-Azure-Blob/1.0",
          "Microsoft-HTTPAPI/2.0"
        ],
        "x-ms-access-tier": "Hot",
        "x-ms-access-tier-inferred": "true",
        "x-ms-blob-type": "BlockBlob",
        "x-ms-client-request-id": "7efbb5d7-21cc-a267-861e-bce4a4049fa1",
        "x-ms-creation-time": "Mon, 27 Jul 2020 21:32:35 GMT",
        "x-ms-lease-state": "available",
        "x-ms-lease-status": "unlocked",
        "x-ms-request-id": "78eea4a0-401e-0081-045d-64ed7a000000",
        "x-ms-server-encrypted": "true",
        "x-ms-version": "2019-12-12"
      },
      "ResponseBody": []
    },
    {
      "RequestUri": "https://seannsecanary.dfs.core.windows.net/test-filesystem-484944cd-aed8-6717-8bbc-4ca7d1371e86/test-file-188d271d-8372-04b8-9b55-5978366fac55?action=append\u0026position=0",
      "RequestMethod": "PATCH",
      "RequestHeaders": {
        "Authorization": "Sanitized",
        "Content-Length": "1024",
        "User-Agent": [
          "azsdk-net-Storage.Files.DataLake/12.3.0-dev.20200727.1",
          "(.NET Core 4.6.29017.01; Microsoft Windows 10.0.18362 )"
        ],
        "x-ms-client-request-id": "77380a8c-4a38-e651-5242-68eb319c91f4",
        "x-ms-date": "Mon, 27 Jul 2020 21:32:35 GMT",
        "x-ms-return-client-request-id": "true",
        "x-ms-version": "2019-12-12"
      },
      "RequestBody": "LqBUyxj/Cy\u002BOXaVzjjwzCNSaKFzkGK3ddQoJ9Fj/ElBqs04wPrWmT85bBUo\u002Bvn3KbI3Eg/o3XRXzdlUN9RfXjktUCdvuAsoe89iOiRNjn7eNP4jKO49WMlU4PcdfmFq2g3b/6bWh3GnDpo8hqdQCj9eegLaPDFO7/taGtsQDvlt\u002B1wWcY7YB62MeB5QANImBNa3wwRijJ3YjQ\u002BreGyWkwOczo9HOZSsgnJRTcAW\u002Bu8lNBYAWEv1C2q\u002BOeSDMI9A9eUeszJG3stCBzySDULdxZIcgkRWljq3q8cghP\u002BsLVHnDFva9Ee84lVOvlEPYvor4HRWYq5G6l\u002BuawtrJlnLkdnurwDrAs1KX6PzC9flpETI\u002BKCLWcqjnCH4LI08Ubv7hyx7HLf5POGrCAMOV\u002BKHyMLCoim1QDgPSw7e7tY8Dg3n94SraouQz7vC3FHHlURDdGPOebOOQkLwa9WpHlIPbvn1JmBd2F47MdJx9mPmS7HGm3pybZBaVbFBuwKx67Fpt3FXznLn5ZgFl0vhHE/jCiAj4obXmP1lnsyvGCFbhUYhCELyknlC4rXibNpEeTlhYqzikgkukhp37jOiNMl6qhIBvBAM8Hum4P/M9SwjHSGXSbl0ePc89nYkfqBFoKnoZ8bIQrklVG4xO7EJXZzuUM0OCusQAi0axMmZ5HXbXTxR5I1pWtpocfVLQz1GN5TZOinTO5XC2GWVrX3zi3P4Vd5wt3UPhPnypZj1xL7z1I0wvKpICCWqkwwr06lYdOaBTu1i1XwfzbUv3JH4yROmodTwvsrFsE20xiRo57FQliy2dHXRjQMREPL1GCuTrcn4hTHQa7obv56fqg9XtuoH30ZlRlSZ0RDV36nb0JQiJRRecGKDfC52mrjbNebzuV4E8TjlLmtxXrAc/ogMP\u002B8KeYT6\u002BUKLgGMb7qufwp8t4iZL0t9bPPas6RWuYoGiZlrJ0Lhd\u002BMAffWzZzT\u002B/1ZwU7xhlwG0PrzyOSgws2SHhdYhM0e3iz\u002BViLFVyfXO27Rd5mXdlOKHtviF/066z7qBO\u002BFezbweuNh8zA5QXnS3M11z4t0OqeDzqYxPMYvw2skGxI4UYB34Py2dUMjUN1iD3svhRtztcoIAWyQ/z4dMi\u002BFFWZnmosNPe6OvcVkYL3Ijy1LAH5P8GVH8BBT5yH\u002BmQNTnnt3OnSwIkdspTfE4\u002BDuiC/QkfGxdSTBH6p6\u002BVaMz\u002BSB0MICUZT42x424wttQwxvZR7yLgcRoikWthrKNWjwn9UTAxLerHabF7bTupIZU9yeC1R32uHdsC7ZK9u57qW1BgN2WgA5ULjoFtZQfidXPSJ\u002BLCnUuMUzdZLkBYBbISkRXrROozmcpLqbT4PLTTIHQ==",
      "StatusCode": 202,
      "ResponseHeaders": {
        "Content-Length": "0",
        "Date": "Mon, 27 Jul 2020 21:32:35 GMT",
        "Server": [
          "Windows-Azure-HDFS/1.0",
          "Microsoft-HTTPAPI/2.0"
        ],
        "x-ms-client-request-id": "77380a8c-4a38-e651-5242-68eb319c91f4",
        "x-ms-request-id": "c7611b75-c01f-0019-345d-64cd1b000000",
        "x-ms-request-server-encrypted": "true",
        "x-ms-version": "2019-12-12"
      },
      "ResponseBody": []
    },
    {
      "RequestUri": "https://seannsecanary.dfs.core.windows.net/test-filesystem-484944cd-aed8-6717-8bbc-4ca7d1371e86/test-file-188d271d-8372-04b8-9b55-5978366fac55?action=flush\u0026position=1024",
      "RequestMethod": "PATCH",
      "RequestHeaders": {
        "Authorization": "Sanitized",
        "Content-Length": "0",
        "If-Modified-Since": "Sun, 26 Jul 2020 21:32:32 GMT",
        "User-Agent": [
          "azsdk-net-Storage.Files.DataLake/12.3.0-dev.20200727.1",
          "(.NET Core 4.6.29017.01; Microsoft Windows 10.0.18362 )"
        ],
        "x-ms-client-request-id": "9a58fde1-27cb-3768-2228-f4442cad245b",
        "x-ms-date": "Mon, 27 Jul 2020 21:32:35 GMT",
        "x-ms-return-client-request-id": "true",
        "x-ms-version": "2019-12-12"
      },
      "RequestBody": null,
      "StatusCode": 200,
      "ResponseHeaders": {
        "Content-Length": "0",
        "Date": "Mon, 27 Jul 2020 21:32:35 GMT",
        "ETag": "\u00220x8D83274942B6F45\u0022",
        "Last-Modified": "Mon, 27 Jul 2020 21:32:35 GMT",
        "Server": [
          "Windows-Azure-HDFS/1.0",
          "Microsoft-HTTPAPI/2.0"
        ],
        "x-ms-client-request-id": "9a58fde1-27cb-3768-2228-f4442cad245b",
        "x-ms-request-id": "c7611b76-c01f-0019-355d-64cd1b000000",
        "x-ms-request-server-encrypted": "false",
        "x-ms-version": "2019-12-12"
      },
      "ResponseBody": []
    },
    {
      "RequestUri": "https://seannsecanary.blob.core.windows.net/test-filesystem-484944cd-aed8-6717-8bbc-4ca7d1371e86/test-file-188d271d-8372-04b8-9b55-5978366fac55",
      "RequestMethod": "GET",
      "RequestHeaders": {
        "Authorization": "Sanitized",
        "User-Agent": [
          "azsdk-net-Storage.Files.DataLake/12.3.0-dev.20200727.1",
          "(.NET Core 4.6.29017.01; Microsoft Windows 10.0.18362 )"
        ],
        "x-ms-client-request-id": "340a9ef5-f644-4528-86fa-bff4a568156e",
        "x-ms-date": "Mon, 27 Jul 2020 21:32:35 GMT",
        "x-ms-return-client-request-id": "true",
        "x-ms-version": "2019-12-12"
      },
      "RequestBody": null,
      "StatusCode": 200,
      "ResponseHeaders": {
        "Accept-Ranges": "bytes",
        "Content-Length": "1024",
        "Content-Type": "application/octet-stream",
        "Date": "Mon, 27 Jul 2020 21:32:34 GMT",
        "ETag": "\u00220x8D83274942B6F45\u0022",
        "Last-Modified": "Mon, 27 Jul 2020 21:32:35 GMT",
        "Server": [
          "Windows-Azure-Blob/1.0",
          "Microsoft-HTTPAPI/2.0"
        ],
        "x-ms-blob-type": "BlockBlob",
        "x-ms-client-request-id": "340a9ef5-f644-4528-86fa-bff4a568156e",
        "x-ms-creation-time": "Mon, 27 Jul 2020 21:32:35 GMT",
        "x-ms-lease-state": "available",
        "x-ms-lease-status": "unlocked",
        "x-ms-request-id": "78eea4bc-401e-0081-185d-64ed7a000000",
        "x-ms-server-encrypted": "true",
        "x-ms-version": "2019-12-12"
      },
      "ResponseBody": "LqBUyxj/Cy\u002BOXaVzjjwzCNSaKFzkGK3ddQoJ9Fj/ElBqs04wPrWmT85bBUo\u002Bvn3KbI3Eg/o3XRXzdlUN9RfXjktUCdvuAsoe89iOiRNjn7eNP4jKO49WMlU4PcdfmFq2g3b/6bWh3GnDpo8hqdQCj9eegLaPDFO7/taGtsQDvlt\u002B1wWcY7YB62MeB5QANImBNa3wwRijJ3YjQ\u002BreGyWkwOczo9HOZSsgnJRTcAW\u002Bu8lNBYAWEv1C2q\u002BOeSDMI9A9eUeszJG3stCBzySDULdxZIcgkRWljq3q8cghP\u002BsLVHnDFva9Ee84lVOvlEPYvor4HRWYq5G6l\u002BuawtrJlnLkdnurwDrAs1KX6PzC9flpETI\u002BKCLWcqjnCH4LI08Ubv7hyx7HLf5POGrCAMOV\u002BKHyMLCoim1QDgPSw7e7tY8Dg3n94SraouQz7vC3FHHlURDdGPOebOOQkLwa9WpHlIPbvn1JmBd2F47MdJx9mPmS7HGm3pybZBaVbFBuwKx67Fpt3FXznLn5ZgFl0vhHE/jCiAj4obXmP1lnsyvGCFbhUYhCELyknlC4rXibNpEeTlhYqzikgkukhp37jOiNMl6qhIBvBAM8Hum4P/M9SwjHSGXSbl0ePc89nYkfqBFoKnoZ8bIQrklVG4xO7EJXZzuUM0OCusQAi0axMmZ5HXbXTxR5I1pWtpocfVLQz1GN5TZOinTO5XC2GWVrX3zi3P4Vd5wt3UPhPnypZj1xL7z1I0wvKpICCWqkwwr06lYdOaBTu1i1XwfzbUv3JH4yROmodTwvsrFsE20xiRo57FQliy2dHXRjQMREPL1GCuTrcn4hTHQa7obv56fqg9XtuoH30ZlRlSZ0RDV36nb0JQiJRRecGKDfC52mrjbNebzuV4E8TjlLmtxXrAc/ogMP\u002B8KeYT6\u002BUKLgGMb7qufwp8t4iZL0t9bPPas6RWuYoGiZlrJ0Lhd\u002BMAffWzZzT\u002B/1ZwU7xhlwG0PrzyOSgws2SHhdYhM0e3iz\u002BViLFVyfXO27Rd5mXdlOKHtviF/066z7qBO\u002BFezbweuNh8zA5QXnS3M11z4t0OqeDzqYxPMYvw2skGxI4UYB34Py2dUMjUN1iD3svhRtztcoIAWyQ/z4dMi\u002BFFWZnmosNPe6OvcVkYL3Ijy1LAH5P8GVH8BBT5yH\u002BmQNTnnt3OnSwIkdspTfE4\u002BDuiC/QkfGxdSTBH6p6\u002BVaMz\u002BSB0MICUZT42x424wttQwxvZR7yLgcRoikWthrKNWjwn9UTAxLerHabF7bTupIZU9yeC1R32uHdsC7ZK9u57qW1BgN2WgA5ULjoFtZQfidXPSJ\u002BLCnUuMUzdZLkBYBbISkRXrROozmcpLqbT4PLTTIHQ=="
    },
    {
      "RequestUri": "https://seannsecanary.blob.core.windows.net/test-filesystem-484944cd-aed8-6717-8bbc-4ca7d1371e86?restype=container",
      "RequestMethod": "DELETE",
      "RequestHeaders": {
        "Authorization": "Sanitized",
        "traceparent": "00-63e704198910bb47b9119d746f2e2563-f66f4b3312608841-00",
        "User-Agent": [
          "azsdk-net-Storage.Files.DataLake/12.3.0-dev.20200727.1",
          "(.NET Core 4.6.29017.01; Microsoft Windows 10.0.18362 )"
        ],
        "x-ms-client-request-id": "8d4f8820-f0a3-1316-24ce-df8f9aad4cf5",
        "x-ms-date": "Mon, 27 Jul 2020 21:32:35 GMT",
        "x-ms-return-client-request-id": "true",
        "x-ms-version": "2019-12-12"
      },
      "RequestBody": null,
      "StatusCode": 202,
      "ResponseHeaders": {
        "Content-Length": "0",
        "Date": "Mon, 27 Jul 2020 21:32:34 GMT",
        "Server": [
          "Windows-Azure-Blob/1.0",
          "Microsoft-HTTPAPI/2.0"
        ],
        "x-ms-client-request-id": "8d4f8820-f0a3-1316-24ce-df8f9aad4cf5",
        "x-ms-request-id": "78eea4be-401e-0081-1a5d-64ed7a000000",
        "x-ms-version": "2019-12-12"
      },
      "ResponseBody": []
    },
    {
      "RequestUri": "https://seannsecanary.blob.core.windows.net/test-filesystem-9911eee1-74f9-0d98-5f83-d8deb95379b0?restype=container",
      "RequestMethod": "PUT",
      "RequestHeaders": {
        "Authorization": "Sanitized",
        "traceparent": "00-f2a08e5acf65264a84c9063ce0b2784d-dcbbdee97b62f34c-00",
        "User-Agent": [
          "azsdk-net-Storage.Files.DataLake/12.3.0-dev.20200727.1",
          "(.NET Core 4.6.29017.01; Microsoft Windows 10.0.18362 )"
        ],
        "x-ms-blob-public-access": "container",
        "x-ms-client-request-id": "ddf34719-d9c3-ab08-f041-2e1f173859d0",
        "x-ms-date": "Mon, 27 Jul 2020 21:32:35 GMT",
        "x-ms-return-client-request-id": "true",
        "x-ms-version": "2019-12-12"
      },
      "RequestBody": null,
      "StatusCode": 201,
      "ResponseHeaders": {
        "Content-Length": "0",
        "Date": "Mon, 27 Jul 2020 21:32:35 GMT",
        "ETag": "\u00220x8D83274947BED38\u0022",
        "Last-Modified": "Mon, 27 Jul 2020 21:32:36 GMT",
        "Server": [
          "Windows-Azure-Blob/1.0",
          "Microsoft-HTTPAPI/2.0"
        ],
        "x-ms-client-request-id": "ddf34719-d9c3-ab08-f041-2e1f173859d0",
        "x-ms-request-id": "75e91e8d-101e-0068-4c5d-642b30000000",
        "x-ms-version": "2019-12-12"
      },
      "ResponseBody": []
    },
    {
      "RequestUri": "https://seannsecanary.dfs.core.windows.net/test-filesystem-9911eee1-74f9-0d98-5f83-d8deb95379b0/test-file-dd082e54-2fd9-5adc-2380-86e6069305af?resource=file",
      "RequestMethod": "PUT",
      "RequestHeaders": {
        "Authorization": "Sanitized",
        "traceparent": "00-1c0e07256309454b80faa5ddd564c139-a3a2141770f8704b-00",
        "User-Agent": [
          "azsdk-net-Storage.Files.DataLake/12.3.0-dev.20200727.1",
          "(.NET Core 4.6.29017.01; Microsoft Windows 10.0.18362 )"
        ],
        "x-ms-client-request-id": "dab09eb9-0ea7-ead4-6a99-b9425321a55c",
        "x-ms-date": "Mon, 27 Jul 2020 21:32:36 GMT",
        "x-ms-return-client-request-id": "true",
        "x-ms-version": "2019-12-12"
      },
      "RequestBody": null,
      "StatusCode": 201,
      "ResponseHeaders": {
        "Content-Length": "0",
        "Date": "Mon, 27 Jul 2020 21:32:35 GMT",
        "ETag": "\u00220x8D8327494E21BD4\u0022",
        "Last-Modified": "Mon, 27 Jul 2020 21:32:36 GMT",
        "Server": [
          "Windows-Azure-HDFS/1.0",
          "Microsoft-HTTPAPI/2.0"
        ],
        "x-ms-client-request-id": "dab09eb9-0ea7-ead4-6a99-b9425321a55c",
        "x-ms-request-id": "2e7d60a6-d01f-0005-535d-649f7b000000",
        "x-ms-version": "2019-12-12"
      },
      "ResponseBody": []
    },
    {
      "RequestUri": "https://seannsecanary.blob.core.windows.net/test-filesystem-9911eee1-74f9-0d98-5f83-d8deb95379b0/test-file-dd082e54-2fd9-5adc-2380-86e6069305af",
      "RequestMethod": "HEAD",
      "RequestHeaders": {
        "Authorization": "Sanitized",
        "If-Unmodified-Since": "Tue, 28 Jul 2020 21:32:32 GMT",
        "User-Agent": [
          "azsdk-net-Storage.Files.DataLake/12.3.0-dev.20200727.1",
          "(.NET Core 4.6.29017.01; Microsoft Windows 10.0.18362 )"
        ],
        "x-ms-client-request-id": "3aabe83a-1159-13bc-22fe-ed863572cf5e",
        "x-ms-date": "Mon, 27 Jul 2020 21:32:36 GMT",
        "x-ms-return-client-request-id": "true",
        "x-ms-version": "2019-12-12"
      },
      "RequestBody": null,
      "StatusCode": 200,
      "ResponseHeaders": {
        "Accept-Ranges": "bytes",
        "Content-Length": "0",
        "Content-Type": "application/octet-stream",
        "Date": "Mon, 27 Jul 2020 21:32:36 GMT",
        "ETag": "\u00220x8D8327494E21BD4\u0022",
        "Last-Modified": "Mon, 27 Jul 2020 21:32:36 GMT",
        "Server": [
          "Windows-Azure-Blob/1.0",
          "Microsoft-HTTPAPI/2.0"
        ],
        "x-ms-access-tier": "Hot",
        "x-ms-access-tier-inferred": "true",
        "x-ms-blob-type": "BlockBlob",
        "x-ms-client-request-id": "3aabe83a-1159-13bc-22fe-ed863572cf5e",
        "x-ms-creation-time": "Mon, 27 Jul 2020 21:32:36 GMT",
        "x-ms-lease-state": "available",
        "x-ms-lease-status": "unlocked",
        "x-ms-request-id": "75e91ef5-101e-0068-245d-642b30000000",
        "x-ms-server-encrypted": "true",
        "x-ms-version": "2019-12-12"
      },
      "ResponseBody": []
    },
    {
      "RequestUri": "https://seannsecanary.dfs.core.windows.net/test-filesystem-9911eee1-74f9-0d98-5f83-d8deb95379b0/test-file-dd082e54-2fd9-5adc-2380-86e6069305af?action=append\u0026position=0",
      "RequestMethod": "PATCH",
      "RequestHeaders": {
        "Authorization": "Sanitized",
        "Content-Length": "1024",
        "User-Agent": [
          "azsdk-net-Storage.Files.DataLake/12.3.0-dev.20200727.1",
          "(.NET Core 4.6.29017.01; Microsoft Windows 10.0.18362 )"
        ],
        "x-ms-client-request-id": "5271a2a2-53b3-101d-8a98-8a83e33103d1",
        "x-ms-date": "Mon, 27 Jul 2020 21:32:37 GMT",
        "x-ms-return-client-request-id": "true",
        "x-ms-version": "2019-12-12"
      },
      "RequestBody": "PH6H7XTnb7hAWiexAgYAeAerLWjjKgiKVdkHx\u002BKqWpOCz5nbJItm0i73mU3mI\u002BdkmEE6qPQ9eRF1/Jib36jVlgCTLjJsJVN8RVs665G7ozHxoy6gb7GfRVaHZSfzyvKFIQNMU/W093LtvmOZAo2AullmqTx6NCZO9Ojb5L8siHpotMmOblA7Pau7s7FOBkLJB6vNjCG1Cuzc/l8N2BKzwTXpME3D8ksJKmuQvoF1/\u002B2lEt0UX/xYsqndsXDxLmSYCPF7ZdX1BhRfw2G1JExqZ/5xZ8Y0nmE5kH2j5kHbGPwH97WP\u002BZkYsAvJtJuaoo1dcklxf8adZGqQQtRXUSDThKtlri2W2m1lWbe7a\u002BrGn\u002B7wRnT3apg1apNL/7fEwF/q9jDwNPRgxpfcDCYP4vl/yqLmZwqs2xkSMESZS9u1oJhY0HS51Wr5j3/cGl5yJoiayzUU3VhUPhoW3gSwx3u7JmuOthGExfQ47diKz8C7oAm8/n\u002BloMI/A5Jao/dlSccEIfTy4292FgVA3PCAyW5ZWj369Mj7FYWpTrJ\u002BKiL90qMQhq7MyLyaReh5ZMTRvzokAEm5a1X/CAtuSZW8\u002BOvjQwlNb0PAjJGBYK7ggrDB1454WinZQ2dOEX2jXn8m3U38lSG6hE/2Y3O3OAqmH4ZarHEGQ53BCgCi/l7GHC4RWoJh4\u002ByPBlM/gva2IQtcp/L2SLEOH5qvO4ohGIXxL0ZFpd2IRDuZyqYdx8CmC\u002Bn0RVZs0NR8Azrosahibu3NTlOvcHwu1GO2XH4L8FjZCS\u002BhLNIvhF9yyaKioJOTN1u4UHlt9ptsxnHztXNVcBLiD6h4wEIansnzPKfajDPPIiUiUqDfaxKUNWVhO8/sHViPv5HqGncZnrGvern0kjo9I5NOMx5xAqOW5IvcuWL6Bx9OSsyi5QetCbTuL/FYoKIrIxc7nuk6Hb3tUzbsPeROtXKapUdumj6LoCppgtOxPkTosJZKvmk1FCwPtZHRwczQn3p/vvpavYjZsP2/0JrpOxXxA4xOBPYIZJEaX\u002BWsut5emeJYMoBKjvMNcQ5rdkOSJXl8374/gZuDdllpP12iLPUeYTe3kQmUp3WYQJLone5NiDpsMNogHhdH1bwm4U6VakQYTBQM2pRw5zhIp0EJm9hrG7cjNvwb/kMfcLtMbsYnAtVOz1DZQa2l\u002B0mh13bWPTnju8WWcTRI/U7Q7GnYI3hyIaVru8uIkdkJfjqyeSbNSTKCabMAkJChBdIBCVVEzdjQL7bRaoJuWinsjfP5lYQnA6M2VrrFcpEUybX5hoiExbBi4klw\u002B96wFA6JEwKcqG9N2QayDXceCr0lvaHMdNOhaMhDl7M6twfEhkKrO16Odw==",
      "StatusCode": 202,
      "ResponseHeaders": {
        "Content-Length": "0",
        "Date": "Mon, 27 Jul 2020 21:32:36 GMT",
        "Server": [
          "Windows-Azure-HDFS/1.0",
          "Microsoft-HTTPAPI/2.0"
        ],
        "x-ms-client-request-id": "5271a2a2-53b3-101d-8a98-8a83e33103d1",
        "x-ms-request-id": "2e7d60a7-d01f-0005-545d-649f7b000000",
        "x-ms-request-server-encrypted": "true",
        "x-ms-version": "2019-12-12"
      },
      "ResponseBody": []
    },
    {
      "RequestUri": "https://seannsecanary.dfs.core.windows.net/test-filesystem-9911eee1-74f9-0d98-5f83-d8deb95379b0/test-file-dd082e54-2fd9-5adc-2380-86e6069305af?action=flush\u0026position=1024",
      "RequestMethod": "PATCH",
      "RequestHeaders": {
        "Authorization": "Sanitized",
        "Content-Length": "0",
        "If-Unmodified-Since": "Tue, 28 Jul 2020 21:32:32 GMT",
        "User-Agent": [
          "azsdk-net-Storage.Files.DataLake/12.3.0-dev.20200727.1",
          "(.NET Core 4.6.29017.01; Microsoft Windows 10.0.18362 )"
        ],
        "x-ms-client-request-id": "92e46735-7c01-43aa-276f-fc319b9bb2de",
        "x-ms-date": "Mon, 27 Jul 2020 21:32:37 GMT",
        "x-ms-return-client-request-id": "true",
        "x-ms-version": "2019-12-12"
      },
      "RequestBody": null,
      "StatusCode": 200,
      "ResponseHeaders": {
        "Content-Length": "0",
        "Date": "Mon, 27 Jul 2020 21:32:36 GMT",
        "ETag": "\u00220x8D83274950FC576\u0022",
        "Last-Modified": "Mon, 27 Jul 2020 21:32:37 GMT",
        "Server": [
          "Windows-Azure-HDFS/1.0",
          "Microsoft-HTTPAPI/2.0"
        ],
        "x-ms-client-request-id": "92e46735-7c01-43aa-276f-fc319b9bb2de",
        "x-ms-request-id": "2e7d60a8-d01f-0005-555d-649f7b000000",
        "x-ms-request-server-encrypted": "false",
        "x-ms-version": "2019-12-12"
      },
      "ResponseBody": []
    },
    {
      "RequestUri": "https://seannsecanary.blob.core.windows.net/test-filesystem-9911eee1-74f9-0d98-5f83-d8deb95379b0/test-file-dd082e54-2fd9-5adc-2380-86e6069305af",
      "RequestMethod": "GET",
      "RequestHeaders": {
        "Authorization": "Sanitized",
        "User-Agent": [
          "azsdk-net-Storage.Files.DataLake/12.3.0-dev.20200727.1",
          "(.NET Core 4.6.29017.01; Microsoft Windows 10.0.18362 )"
        ],
        "x-ms-client-request-id": "7c4dd532-704c-8bd0-836f-d14e60a4772e",
        "x-ms-date": "Mon, 27 Jul 2020 21:32:37 GMT",
        "x-ms-return-client-request-id": "true",
        "x-ms-version": "2019-12-12"
      },
      "RequestBody": null,
      "StatusCode": 200,
      "ResponseHeaders": {
        "Accept-Ranges": "bytes",
        "Content-Length": "1024",
        "Content-Type": "application/octet-stream",
        "Date": "Mon, 27 Jul 2020 21:32:36 GMT",
        "ETag": "\u00220x8D83274950FC576\u0022",
        "Last-Modified": "Mon, 27 Jul 2020 21:32:37 GMT",
        "Server": [
          "Windows-Azure-Blob/1.0",
          "Microsoft-HTTPAPI/2.0"
        ],
        "x-ms-blob-type": "BlockBlob",
        "x-ms-client-request-id": "7c4dd532-704c-8bd0-836f-d14e60a4772e",
        "x-ms-creation-time": "Mon, 27 Jul 2020 21:32:36 GMT",
        "x-ms-lease-state": "available",
        "x-ms-lease-status": "unlocked",
        "x-ms-request-id": "75e91f15-101e-0068-415d-642b30000000",
        "x-ms-server-encrypted": "true",
        "x-ms-version": "2019-12-12"
      },
      "ResponseBody": "PH6H7XTnb7hAWiexAgYAeAerLWjjKgiKVdkHx\u002BKqWpOCz5nbJItm0i73mU3mI\u002BdkmEE6qPQ9eRF1/Jib36jVlgCTLjJsJVN8RVs665G7ozHxoy6gb7GfRVaHZSfzyvKFIQNMU/W093LtvmOZAo2AullmqTx6NCZO9Ojb5L8siHpotMmOblA7Pau7s7FOBkLJB6vNjCG1Cuzc/l8N2BKzwTXpME3D8ksJKmuQvoF1/\u002B2lEt0UX/xYsqndsXDxLmSYCPF7ZdX1BhRfw2G1JExqZ/5xZ8Y0nmE5kH2j5kHbGPwH97WP\u002BZkYsAvJtJuaoo1dcklxf8adZGqQQtRXUSDThKtlri2W2m1lWbe7a\u002BrGn\u002B7wRnT3apg1apNL/7fEwF/q9jDwNPRgxpfcDCYP4vl/yqLmZwqs2xkSMESZS9u1oJhY0HS51Wr5j3/cGl5yJoiayzUU3VhUPhoW3gSwx3u7JmuOthGExfQ47diKz8C7oAm8/n\u002BloMI/A5Jao/dlSccEIfTy4292FgVA3PCAyW5ZWj369Mj7FYWpTrJ\u002BKiL90qMQhq7MyLyaReh5ZMTRvzokAEm5a1X/CAtuSZW8\u002BOvjQwlNb0PAjJGBYK7ggrDB1454WinZQ2dOEX2jXn8m3U38lSG6hE/2Y3O3OAqmH4ZarHEGQ53BCgCi/l7GHC4RWoJh4\u002ByPBlM/gva2IQtcp/L2SLEOH5qvO4ohGIXxL0ZFpd2IRDuZyqYdx8CmC\u002Bn0RVZs0NR8Azrosahibu3NTlOvcHwu1GO2XH4L8FjZCS\u002BhLNIvhF9yyaKioJOTN1u4UHlt9ptsxnHztXNVcBLiD6h4wEIansnzPKfajDPPIiUiUqDfaxKUNWVhO8/sHViPv5HqGncZnrGvern0kjo9I5NOMx5xAqOW5IvcuWL6Bx9OSsyi5QetCbTuL/FYoKIrIxc7nuk6Hb3tUzbsPeROtXKapUdumj6LoCppgtOxPkTosJZKvmk1FCwPtZHRwczQn3p/vvpavYjZsP2/0JrpOxXxA4xOBPYIZJEaX\u002BWsut5emeJYMoBKjvMNcQ5rdkOSJXl8374/gZuDdllpP12iLPUeYTe3kQmUp3WYQJLone5NiDpsMNogHhdH1bwm4U6VakQYTBQM2pRw5zhIp0EJm9hrG7cjNvwb/kMfcLtMbsYnAtVOz1DZQa2l\u002B0mh13bWPTnju8WWcTRI/U7Q7GnYI3hyIaVru8uIkdkJfjqyeSbNSTKCabMAkJChBdIBCVVEzdjQL7bRaoJuWinsjfP5lYQnA6M2VrrFcpEUybX5hoiExbBi4klw\u002B96wFA6JEwKcqG9N2QayDXceCr0lvaHMdNOhaMhDl7M6twfEhkKrO16Odw=="
    },
    {
      "RequestUri": "https://seannsecanary.blob.core.windows.net/test-filesystem-9911eee1-74f9-0d98-5f83-d8deb95379b0?restype=container",
      "RequestMethod": "DELETE",
      "RequestHeaders": {
        "Authorization": "Sanitized",
        "traceparent": "00-4b2f06f6c88a774f8bd3268bff31876b-0bac23dc9515134a-00",
        "User-Agent": [
          "azsdk-net-Storage.Files.DataLake/12.3.0-dev.20200727.1",
          "(.NET Core 4.6.29017.01; Microsoft Windows 10.0.18362 )"
        ],
        "x-ms-client-request-id": "c6fe521d-364e-9691-b149-fc48fd7ae428",
        "x-ms-date": "Mon, 27 Jul 2020 21:32:37 GMT",
        "x-ms-return-client-request-id": "true",
        "x-ms-version": "2019-12-12"
      },
      "RequestBody": null,
      "StatusCode": 202,
      "ResponseHeaders": {
        "Content-Length": "0",
        "Date": "Mon, 27 Jul 2020 21:32:36 GMT",
        "Server": [
          "Windows-Azure-Blob/1.0",
          "Microsoft-HTTPAPI/2.0"
        ],
        "x-ms-client-request-id": "c6fe521d-364e-9691-b149-fc48fd7ae428",
        "x-ms-request-id": "75e91f1d-101e-0068-495d-642b30000000",
        "x-ms-version": "2019-12-12"
      },
      "ResponseBody": []
    },
    {
      "RequestUri": "https://seannsecanary.blob.core.windows.net/test-filesystem-dc3c5ae5-1587-4d9f-d8e6-ddadaa2c9877?restype=container",
      "RequestMethod": "PUT",
      "RequestHeaders": {
        "Authorization": "Sanitized",
        "traceparent": "00-4810ac4418c15f418cdfc6293e8d96b3-dcb8b5209d65a24e-00",
        "User-Agent": [
          "azsdk-net-Storage.Files.DataLake/12.3.0-dev.20200727.1",
          "(.NET Core 4.6.29017.01; Microsoft Windows 10.0.18362 )"
        ],
        "x-ms-blob-public-access": "container",
        "x-ms-client-request-id": "98bd9dba-3ecf-07d1-b2b1-ee6758e4eb85",
        "x-ms-date": "Mon, 27 Jul 2020 21:32:37 GMT",
        "x-ms-return-client-request-id": "true",
        "x-ms-version": "2019-12-12"
      },
      "RequestBody": null,
      "StatusCode": 201,
      "ResponseHeaders": {
        "Content-Length": "0",
        "Date": "Mon, 27 Jul 2020 21:32:36 GMT",
        "ETag": "\u00220x8D83274954637DB\u0022",
        "Last-Modified": "Mon, 27 Jul 2020 21:32:37 GMT",
        "Server": [
          "Windows-Azure-Blob/1.0",
          "Microsoft-HTTPAPI/2.0"
        ],
        "x-ms-client-request-id": "98bd9dba-3ecf-07d1-b2b1-ee6758e4eb85",
        "x-ms-request-id": "8806cf59-501e-009d-1d5d-64bf1a000000",
        "x-ms-version": "2019-12-12"
      },
      "ResponseBody": []
    },
    {
      "RequestUri": "https://seannsecanary.dfs.core.windows.net/test-filesystem-dc3c5ae5-1587-4d9f-d8e6-ddadaa2c9877/test-file-84f385b0-d549-3481-7a11-23d58bdd6323?resource=file",
      "RequestMethod": "PUT",
      "RequestHeaders": {
        "Authorization": "Sanitized",
        "traceparent": "00-a230792f4aa89440bd08a2109b800f84-c0db125b67f67f4b-00",
        "User-Agent": [
          "azsdk-net-Storage.Files.DataLake/12.3.0-dev.20200727.1",
          "(.NET Core 4.6.29017.01; Microsoft Windows 10.0.18362 )"
        ],
        "x-ms-client-request-id": "631104c5-e3c0-e5da-1c89-1ebe1bfc7cd5",
        "x-ms-date": "Mon, 27 Jul 2020 21:32:37 GMT",
        "x-ms-return-client-request-id": "true",
        "x-ms-version": "2019-12-12"
      },
      "RequestBody": null,
      "StatusCode": 201,
      "ResponseHeaders": {
        "Content-Length": "0",
        "Date": "Mon, 27 Jul 2020 21:32:37 GMT",
        "ETag": "\u00220x8D83274956BF1A7\u0022",
        "Last-Modified": "Mon, 27 Jul 2020 21:32:37 GMT",
        "Server": [
          "Windows-Azure-HDFS/1.0",
          "Microsoft-HTTPAPI/2.0"
        ],
        "x-ms-client-request-id": "631104c5-e3c0-e5da-1c89-1ebe1bfc7cd5",
        "x-ms-request-id": "88d73445-a01f-007d-445d-643c83000000",
        "x-ms-version": "2019-12-12"
      },
      "ResponseBody": []
    },
    {
      "RequestUri": "https://seannsecanary.blob.core.windows.net/test-filesystem-dc3c5ae5-1587-4d9f-d8e6-ddadaa2c9877/test-file-84f385b0-d549-3481-7a11-23d58bdd6323",
      "RequestMethod": "HEAD",
      "RequestHeaders": {
        "Authorization": "Sanitized",
        "User-Agent": [
          "azsdk-net-Storage.Files.DataLake/12.3.0-dev.20200727.1",
          "(.NET Core 4.6.29017.01; Microsoft Windows 10.0.18362 )"
        ],
        "x-ms-client-request-id": "860f4d3d-00cc-9a63-de0d-f0e5e1e9fbab",
        "x-ms-date": "Mon, 27 Jul 2020 21:32:37 GMT",
        "x-ms-return-client-request-id": "true",
        "x-ms-version": "2019-12-12"
      },
      "RequestBody": null,
      "StatusCode": 200,
      "ResponseHeaders": {
        "Accept-Ranges": "bytes",
        "Content-Length": "0",
        "Content-Type": "application/octet-stream",
        "Date": "Mon, 27 Jul 2020 21:32:37 GMT",
        "ETag": "\u00220x8D83274956BF1A7\u0022",
        "Last-Modified": "Mon, 27 Jul 2020 21:32:37 GMT",
        "Server": [
          "Windows-Azure-Blob/1.0",
          "Microsoft-HTTPAPI/2.0"
        ],
        "x-ms-access-tier": "Hot",
        "x-ms-access-tier-inferred": "true",
        "x-ms-blob-type": "BlockBlob",
        "x-ms-client-request-id": "860f4d3d-00cc-9a63-de0d-f0e5e1e9fbab",
        "x-ms-creation-time": "Mon, 27 Jul 2020 21:32:37 GMT",
        "x-ms-lease-state": "available",
        "x-ms-lease-status": "unlocked",
        "x-ms-request-id": "8806cf76-501e-009d-2f5d-64bf1a000000",
        "x-ms-server-encrypted": "true",
        "x-ms-version": "2019-12-12"
      },
      "ResponseBody": []
    },
    {
      "RequestUri": "https://seannsecanary.blob.core.windows.net/test-filesystem-dc3c5ae5-1587-4d9f-d8e6-ddadaa2c9877/test-file-84f385b0-d549-3481-7a11-23d58bdd6323",
      "RequestMethod": "HEAD",
      "RequestHeaders": {
        "Authorization": "Sanitized",
        "If-Match": "\u00220x8D83274956BF1A7\u0022",
        "User-Agent": [
          "azsdk-net-Storage.Files.DataLake/12.3.0-dev.20200727.1",
          "(.NET Core 4.6.29017.01; Microsoft Windows 10.0.18362 )"
        ],
        "x-ms-client-request-id": "eb6b00c3-53c0-46c7-1f01-07b979ade6c3",
        "x-ms-date": "Mon, 27 Jul 2020 21:32:37 GMT",
        "x-ms-return-client-request-id": "true",
        "x-ms-version": "2019-12-12"
      },
      "RequestBody": null,
      "StatusCode": 200,
      "ResponseHeaders": {
        "Accept-Ranges": "bytes",
        "Content-Length": "0",
        "Content-Type": "application/octet-stream",
        "Date": "Mon, 27 Jul 2020 21:32:37 GMT",
        "ETag": "\u00220x8D83274956BF1A7\u0022",
        "Last-Modified": "Mon, 27 Jul 2020 21:32:37 GMT",
        "Server": [
          "Windows-Azure-Blob/1.0",
          "Microsoft-HTTPAPI/2.0"
        ],
        "x-ms-access-tier": "Hot",
        "x-ms-access-tier-inferred": "true",
        "x-ms-blob-type": "BlockBlob",
        "x-ms-client-request-id": "eb6b00c3-53c0-46c7-1f01-07b979ade6c3",
        "x-ms-creation-time": "Mon, 27 Jul 2020 21:32:37 GMT",
        "x-ms-lease-state": "available",
        "x-ms-lease-status": "unlocked",
        "x-ms-request-id": "8806cf7c-501e-009d-325d-64bf1a000000",
        "x-ms-server-encrypted": "true",
        "x-ms-version": "2019-12-12"
      },
      "ResponseBody": []
    },
    {
      "RequestUri": "https://seannsecanary.dfs.core.windows.net/test-filesystem-dc3c5ae5-1587-4d9f-d8e6-ddadaa2c9877/test-file-84f385b0-d549-3481-7a11-23d58bdd6323?action=append\u0026position=0",
      "RequestMethod": "PATCH",
      "RequestHeaders": {
        "Authorization": "Sanitized",
        "Content-Length": "1024",
        "User-Agent": [
          "azsdk-net-Storage.Files.DataLake/12.3.0-dev.20200727.1",
          "(.NET Core 4.6.29017.01; Microsoft Windows 10.0.18362 )"
        ],
        "x-ms-client-request-id": "1991cd09-3d36-f1b6-79cd-58a4cd966ce0",
        "x-ms-date": "Mon, 27 Jul 2020 21:32:37 GMT",
        "x-ms-return-client-request-id": "true",
        "x-ms-version": "2019-12-12"
      },
      "RequestBody": "rIan95A05OftX4bjBrprjxYcgM7s9QhNZ06/4\u002B0x0PTiMnTy5HtxCGgomG15f5QkomHOxGgtvrZ\u002BWo9BdQH5u46RAdNGeKuaq3dlw1yb0\u002Be6mkCMYgyLtHO9dIrsL5NmL9ze537A3im2Mxnwx/tZ4oenh9rBbFiCBkxgiAQgrnvj/5OAvetp\u002BbsW1i/zmu13Y5IDRKe5pMODW\u002BEyX1UllYWdDcho2SWbPo4eqpUpj2tf6CVxHWnUKlrQ/GEJNplm8UGpVY0lD4ltZwYZm/otWsx103cws3cbyOJtl93DkQf0uLlTgDneOdmcBLZju45goqGVlGMiNT3Kjoyqt3erqdX/JONA2tqSlpmek67AuA1UDfU7Lv2k0oJ8ifGsNIFh8VvhY5arH8jHA/3JhKKOCdV/VqqCb3vXW1JhxFDo5WIXPKJT31R3qO4tdCoA2k3g7YAbLd3X34HgCQhESlp33x2askf/OymBCK28VPtQ14EEgNfQzLeFQF0gc9ZMMl6TtZQNZSgG4LFWmiUwG4qGjzGHP8mDpxJlFXLp38hTNNVOKJ5mQ3FZ/aAleTGSVCTTmeOkxfKVEA2Bp1C1HAHpAmVP4fLrH0y/LkIoXS7g08BNFkXkr2/iuRiQ5Zsho\u002BGfPHbMQnIx53mW5JewbLPfoNSPaAa7BFP2bSjaWjqxnopgiSG3FJBOGy/LTcrYMkxlsUTGkjrb4zcj1dVJV4w/5UYMT\u002BKRKItEQUzW8LaJHjrcdan26gtPhabplD\u002B6BMOijGiDy\u002BJp04m4glDuBPKAmbeabeLjSPs6vMo8qJNMiTyINGNOBVJYcqIgPWe7YYGzaPqIIJfhv0NtSQ8YLSr1bPkTZc\u002BPMpRkQfpAwguTf1pIiD\u002BZw2mlp3Qg4bxDQEV3KtBup/yxJDZlI96cofw42cm0z6TrW6iQbr1bblDYIQG0yJc6JNhelmQINJ\u002BKCQV36AfyjnChjM8n3jg\u002BVrXmjQLc6Nhk/bXwVjhA4icJBWW444ZJ5ZKQEzzIEkafH0CuIqacrSAtEupSATg4YamoHtnThnIvnadwTNSbnOpuUTb4kcCAbFdEi9Cb9uNZWLKTIPNty5nOf4T/LGFMkXb/47ABP8/oJ7KCj/uhk6bDFvQiCHz2AYWdKRI7gD/1\u002BPpamxMzWBjiq/hA6zyeLOzeOxVsKYj6CeIrYxW9rKZzjJcAR/eTkL7cP1yDtRZI//0mXUUpic5xYJIxCPQCJf5RzV\u002BlneX0S6tXkOordlPL4mQYlk9hSQPIj\u002BdkYojK2RleMui3o2IYMRKZ0vjkRek/ZSWP6Y6v74Rc3A39kOgjjbfQzUNrFD8CAGU8x3YK5Er9JP1iOu\u002BKrkJjW8ZUGqEpdg==",
      "StatusCode": 202,
      "ResponseHeaders": {
        "Content-Length": "0",
        "Date": "Mon, 27 Jul 2020 21:32:37 GMT",
        "Server": [
          "Windows-Azure-HDFS/1.0",
          "Microsoft-HTTPAPI/2.0"
        ],
        "x-ms-client-request-id": "1991cd09-3d36-f1b6-79cd-58a4cd966ce0",
        "x-ms-request-id": "88d73446-a01f-007d-455d-643c83000000",
        "x-ms-request-server-encrypted": "true",
        "x-ms-version": "2019-12-12"
      },
      "ResponseBody": []
    },
    {
      "RequestUri": "https://seannsecanary.dfs.core.windows.net/test-filesystem-dc3c5ae5-1587-4d9f-d8e6-ddadaa2c9877/test-file-84f385b0-d549-3481-7a11-23d58bdd6323?action=flush\u0026position=1024",
      "RequestMethod": "PATCH",
      "RequestHeaders": {
        "Authorization": "Sanitized",
        "Content-Length": "0",
        "If-Match": "\u00220x8D83274956BF1A7\u0022",
        "User-Agent": [
          "azsdk-net-Storage.Files.DataLake/12.3.0-dev.20200727.1",
          "(.NET Core 4.6.29017.01; Microsoft Windows 10.0.18362 )"
        ],
        "x-ms-client-request-id": "abafb2e6-cc1b-d58d-9a3f-4f027ab28216",
        "x-ms-date": "Mon, 27 Jul 2020 21:32:38 GMT",
        "x-ms-return-client-request-id": "true",
        "x-ms-version": "2019-12-12"
      },
      "RequestBody": null,
      "StatusCode": 200,
      "ResponseHeaders": {
        "Content-Length": "0",
        "Date": "Mon, 27 Jul 2020 21:32:37 GMT",
        "ETag": "\u00220x8D83274958FE867\u0022",
        "Last-Modified": "Mon, 27 Jul 2020 21:32:37 GMT",
        "Server": [
          "Windows-Azure-HDFS/1.0",
          "Microsoft-HTTPAPI/2.0"
        ],
        "x-ms-client-request-id": "abafb2e6-cc1b-d58d-9a3f-4f027ab28216",
        "x-ms-request-id": "88d73447-a01f-007d-465d-643c83000000",
        "x-ms-request-server-encrypted": "false",
        "x-ms-version": "2019-12-12"
      },
      "ResponseBody": []
    },
    {
      "RequestUri": "https://seannsecanary.blob.core.windows.net/test-filesystem-dc3c5ae5-1587-4d9f-d8e6-ddadaa2c9877/test-file-84f385b0-d549-3481-7a11-23d58bdd6323",
      "RequestMethod": "GET",
      "RequestHeaders": {
        "Authorization": "Sanitized",
        "User-Agent": [
          "azsdk-net-Storage.Files.DataLake/12.3.0-dev.20200727.1",
          "(.NET Core 4.6.29017.01; Microsoft Windows 10.0.18362 )"
        ],
        "x-ms-client-request-id": "1abe74e8-c1e6-36c4-d78a-3b9c382575f5",
        "x-ms-date": "Mon, 27 Jul 2020 21:32:38 GMT",
        "x-ms-return-client-request-id": "true",
        "x-ms-version": "2019-12-12"
      },
      "RequestBody": null,
      "StatusCode": 200,
      "ResponseHeaders": {
        "Accept-Ranges": "bytes",
        "Content-Length": "1024",
        "Content-Type": "application/octet-stream",
        "Date": "Mon, 27 Jul 2020 21:32:37 GMT",
        "ETag": "\u00220x8D83274958FE867\u0022",
        "Last-Modified": "Mon, 27 Jul 2020 21:32:37 GMT",
        "Server": [
          "Windows-Azure-Blob/1.0",
          "Microsoft-HTTPAPI/2.0"
        ],
        "x-ms-blob-type": "BlockBlob",
        "x-ms-client-request-id": "1abe74e8-c1e6-36c4-d78a-3b9c382575f5",
        "x-ms-creation-time": "Mon, 27 Jul 2020 21:32:37 GMT",
        "x-ms-lease-state": "available",
        "x-ms-lease-status": "unlocked",
        "x-ms-request-id": "8806cf94-501e-009d-455d-64bf1a000000",
        "x-ms-server-encrypted": "true",
        "x-ms-version": "2019-12-12"
      },
      "ResponseBody": "rIan95A05OftX4bjBrprjxYcgM7s9QhNZ06/4\u002B0x0PTiMnTy5HtxCGgomG15f5QkomHOxGgtvrZ\u002BWo9BdQH5u46RAdNGeKuaq3dlw1yb0\u002Be6mkCMYgyLtHO9dIrsL5NmL9ze537A3im2Mxnwx/tZ4oenh9rBbFiCBkxgiAQgrnvj/5OAvetp\u002BbsW1i/zmu13Y5IDRKe5pMODW\u002BEyX1UllYWdDcho2SWbPo4eqpUpj2tf6CVxHWnUKlrQ/GEJNplm8UGpVY0lD4ltZwYZm/otWsx103cws3cbyOJtl93DkQf0uLlTgDneOdmcBLZju45goqGVlGMiNT3Kjoyqt3erqdX/JONA2tqSlpmek67AuA1UDfU7Lv2k0oJ8ifGsNIFh8VvhY5arH8jHA/3JhKKOCdV/VqqCb3vXW1JhxFDo5WIXPKJT31R3qO4tdCoA2k3g7YAbLd3X34HgCQhESlp33x2askf/OymBCK28VPtQ14EEgNfQzLeFQF0gc9ZMMl6TtZQNZSgG4LFWmiUwG4qGjzGHP8mDpxJlFXLp38hTNNVOKJ5mQ3FZ/aAleTGSVCTTmeOkxfKVEA2Bp1C1HAHpAmVP4fLrH0y/LkIoXS7g08BNFkXkr2/iuRiQ5Zsho\u002BGfPHbMQnIx53mW5JewbLPfoNSPaAa7BFP2bSjaWjqxnopgiSG3FJBOGy/LTcrYMkxlsUTGkjrb4zcj1dVJV4w/5UYMT\u002BKRKItEQUzW8LaJHjrcdan26gtPhabplD\u002B6BMOijGiDy\u002BJp04m4glDuBPKAmbeabeLjSPs6vMo8qJNMiTyINGNOBVJYcqIgPWe7YYGzaPqIIJfhv0NtSQ8YLSr1bPkTZc\u002BPMpRkQfpAwguTf1pIiD\u002BZw2mlp3Qg4bxDQEV3KtBup/yxJDZlI96cofw42cm0z6TrW6iQbr1bblDYIQG0yJc6JNhelmQINJ\u002BKCQV36AfyjnChjM8n3jg\u002BVrXmjQLc6Nhk/bXwVjhA4icJBWW444ZJ5ZKQEzzIEkafH0CuIqacrSAtEupSATg4YamoHtnThnIvnadwTNSbnOpuUTb4kcCAbFdEi9Cb9uNZWLKTIPNty5nOf4T/LGFMkXb/47ABP8/oJ7KCj/uhk6bDFvQiCHz2AYWdKRI7gD/1\u002BPpamxMzWBjiq/hA6zyeLOzeOxVsKYj6CeIrYxW9rKZzjJcAR/eTkL7cP1yDtRZI//0mXUUpic5xYJIxCPQCJf5RzV\u002BlneX0S6tXkOordlPL4mQYlk9hSQPIj\u002BdkYojK2RleMui3o2IYMRKZ0vjkRek/ZSWP6Y6v74Rc3A39kOgjjbfQzUNrFD8CAGU8x3YK5Er9JP1iOu\u002BKrkJjW8ZUGqEpdg=="
    },
    {
      "RequestUri": "https://seannsecanary.blob.core.windows.net/test-filesystem-dc3c5ae5-1587-4d9f-d8e6-ddadaa2c9877?restype=container",
      "RequestMethod": "DELETE",
      "RequestHeaders": {
        "Authorization": "Sanitized",
        "traceparent": "00-e32bf92bcd6d1c43a795c4b9e19be349-e10aa898ff29a54c-00",
        "User-Agent": [
          "azsdk-net-Storage.Files.DataLake/12.3.0-dev.20200727.1",
          "(.NET Core 4.6.29017.01; Microsoft Windows 10.0.18362 )"
        ],
        "x-ms-client-request-id": "061a96f4-68f4-4e2f-08cc-235108db497f",
        "x-ms-date": "Mon, 27 Jul 2020 21:32:38 GMT",
        "x-ms-return-client-request-id": "true",
        "x-ms-version": "2019-12-12"
      },
      "RequestBody": null,
      "StatusCode": 202,
      "ResponseHeaders": {
        "Content-Length": "0",
        "Date": "Mon, 27 Jul 2020 21:32:37 GMT",
        "Server": [
          "Windows-Azure-Blob/1.0",
          "Microsoft-HTTPAPI/2.0"
        ],
        "x-ms-client-request-id": "061a96f4-68f4-4e2f-08cc-235108db497f",
        "x-ms-request-id": "8806cfa2-501e-009d-515d-64bf1a000000",
        "x-ms-version": "2019-12-12"
      },
      "ResponseBody": []
    },
    {
      "RequestUri": "https://seannsecanary.blob.core.windows.net/test-filesystem-d5827b2b-713e-fffa-6b1c-e0b8ba49db64?restype=container",
      "RequestMethod": "PUT",
      "RequestHeaders": {
        "Authorization": "Sanitized",
        "traceparent": "00-d8164f11abd17449b980f8772f6bfbb1-cb38165f34647148-00",
        "User-Agent": [
          "azsdk-net-Storage.Files.DataLake/12.3.0-dev.20200727.1",
          "(.NET Core 4.6.29017.01; Microsoft Windows 10.0.18362 )"
        ],
        "x-ms-blob-public-access": "container",
        "x-ms-client-request-id": "df4e86e4-00f0-82e9-9c1a-9ad7877694be",
        "x-ms-date": "Mon, 27 Jul 2020 21:32:38 GMT",
        "x-ms-return-client-request-id": "true",
        "x-ms-version": "2019-12-12"
      },
      "RequestBody": null,
      "StatusCode": 201,
      "ResponseHeaders": {
        "Content-Length": "0",
        "Date": "Mon, 27 Jul 2020 21:32:37 GMT",
        "ETag": "\u00220x8D8327495C774CF\u0022",
        "Last-Modified": "Mon, 27 Jul 2020 21:32:38 GMT",
        "Server": [
          "Windows-Azure-Blob/1.0",
          "Microsoft-HTTPAPI/2.0"
        ],
        "x-ms-client-request-id": "df4e86e4-00f0-82e9-9c1a-9ad7877694be",
        "x-ms-request-id": "abd8f848-d01e-0048-5a5d-645097000000",
        "x-ms-version": "2019-12-12"
      },
      "ResponseBody": []
    },
    {
      "RequestUri": "https://seannsecanary.dfs.core.windows.net/test-filesystem-d5827b2b-713e-fffa-6b1c-e0b8ba49db64/test-file-f49dbef0-a833-bb74-7a52-dc59a00839b4?resource=file",
      "RequestMethod": "PUT",
      "RequestHeaders": {
        "Authorization": "Sanitized",
        "traceparent": "00-02759cb248dabc4dbffedc8a12a5477b-c27365d47f413a4c-00",
        "User-Agent": [
          "azsdk-net-Storage.Files.DataLake/12.3.0-dev.20200727.1",
          "(.NET Core 4.6.29017.01; Microsoft Windows 10.0.18362 )"
        ],
        "x-ms-client-request-id": "07011250-a41a-3b2a-1293-659e2490e293",
        "x-ms-date": "Mon, 27 Jul 2020 21:32:38 GMT",
        "x-ms-return-client-request-id": "true",
        "x-ms-version": "2019-12-12"
      },
      "RequestBody": null,
      "StatusCode": 201,
      "ResponseHeaders": {
        "Content-Length": "0",
        "Date": "Mon, 27 Jul 2020 21:32:38 GMT",
        "ETag": "\u00220x8D8327495EA4EDE\u0022",
        "Last-Modified": "Mon, 27 Jul 2020 21:32:38 GMT",
        "Server": [
          "Windows-Azure-HDFS/1.0",
          "Microsoft-HTTPAPI/2.0"
        ],
        "x-ms-client-request-id": "07011250-a41a-3b2a-1293-659e2490e293",
        "x-ms-request-id": "de719fdd-b01f-002c-685d-64a10f000000",
        "x-ms-version": "2019-12-12"
      },
      "ResponseBody": []
    },
    {
      "RequestUri": "https://seannsecanary.blob.core.windows.net/test-filesystem-d5827b2b-713e-fffa-6b1c-e0b8ba49db64/test-file-f49dbef0-a833-bb74-7a52-dc59a00839b4",
      "RequestMethod": "HEAD",
      "RequestHeaders": {
        "Authorization": "Sanitized",
        "If-None-Match": "\u0022garbage\u0022",
        "User-Agent": [
          "azsdk-net-Storage.Files.DataLake/12.3.0-dev.20200727.1",
          "(.NET Core 4.6.29017.01; Microsoft Windows 10.0.18362 )"
        ],
        "x-ms-client-request-id": "974fe16e-4330-8bfb-99a6-ce21db2054bf",
        "x-ms-date": "Mon, 27 Jul 2020 21:32:38 GMT",
        "x-ms-return-client-request-id": "true",
        "x-ms-version": "2019-12-12"
      },
      "RequestBody": null,
      "StatusCode": 200,
      "ResponseHeaders": {
        "Accept-Ranges": "bytes",
        "Content-Length": "0",
        "Content-Type": "application/octet-stream",
        "Date": "Mon, 27 Jul 2020 21:32:38 GMT",
        "ETag": "\u00220x8D8327495EA4EDE\u0022",
        "Last-Modified": "Mon, 27 Jul 2020 21:32:38 GMT",
        "Server": [
          "Windows-Azure-Blob/1.0",
          "Microsoft-HTTPAPI/2.0"
        ],
        "x-ms-access-tier": "Hot",
        "x-ms-access-tier-inferred": "true",
        "x-ms-blob-type": "BlockBlob",
        "x-ms-client-request-id": "974fe16e-4330-8bfb-99a6-ce21db2054bf",
        "x-ms-creation-time": "Mon, 27 Jul 2020 21:32:38 GMT",
        "x-ms-lease-state": "available",
        "x-ms-lease-status": "unlocked",
        "x-ms-request-id": "abd8f863-d01e-0048-6e5d-645097000000",
        "x-ms-server-encrypted": "true",
        "x-ms-version": "2019-12-12"
      },
      "ResponseBody": []
    },
    {
      "RequestUri": "https://seannsecanary.dfs.core.windows.net/test-filesystem-d5827b2b-713e-fffa-6b1c-e0b8ba49db64/test-file-f49dbef0-a833-bb74-7a52-dc59a00839b4?action=append\u0026position=0",
      "RequestMethod": "PATCH",
      "RequestHeaders": {
        "Authorization": "Sanitized",
        "Content-Length": "1024",
        "User-Agent": [
          "azsdk-net-Storage.Files.DataLake/12.3.0-dev.20200727.1",
          "(.NET Core 4.6.29017.01; Microsoft Windows 10.0.18362 )"
        ],
        "x-ms-client-request-id": "ae90b378-eaec-4b4d-2143-8a8752f78431",
        "x-ms-date": "Mon, 27 Jul 2020 21:32:38 GMT",
        "x-ms-return-client-request-id": "true",
        "x-ms-version": "2019-12-12"
      },
      "RequestBody": "4eZUBKJgw/RK6ssNo4TmUKlZCY0GMpneWJghZ5bWjplDcQ7u1qTg708NvC/ZHZiOrBX0yodUja9MdasJP1tddFsxyTF1\u002BHoEeRk\u002B\u002BXVpBDv/kruB4cQS7\u002BRfoWD51q/zsEjUqFNnGLSb8FBtFZQ543BvCqyg25KWHtlNFVYZC6NpS0gtlVzomHoH5vF0pdpQJb7wicwCU9S1Pol6GQJdgeStA8pLDE0Uh3EymfWhIXn//PCYKYHWZvh0d1bSbn53qWQMxqEQBRlw3AJb0LneExwQeh0SxFhj153R1pT3QRnyu\u002B\u002BRlVvY7/fWJ0x\u002Be5Y\u002BlWQ6wvNhZOQLqO8DPi6FeZrpaBTKTX7BN4slPJwL5FsGk0EvvH4mkVYKhuxr1LHJUK6ylRKBc0jleYpnPChH/8OU/arsVbwbw9a\u002BwMeRVmPaW\u002BzuWU9IhR/5SkL0vlUuwoYp19cG3frxltI8w7OBVCMnjeA8WaV0S3iK8wt6JwSBj/1AaH\u002BM037x/MN8DMJrd/UfzTB08mngtItee\u002Bnvd2/NujO2QOykmrliSlzi\u002BD62H3sVWlnUDZ2UYLPzLViUAYVUrlKOtTcJezJ3EacM/bxNqFxt2R0V\u002BayVIt85sG1hzknXjknrJ2lDDN4nXfz2h2L2pYT7JihoP7Wl\u002BZNX0MrFFUNeNW9yYYHyKsw\u002B7Zywn5p9QgvpZqcgb0\u002BURi3W6zwUYke4l1Lyg0QCCPxbKVEY9Vn52o6/3K\u002BbPcUg3htTHD6QKYtU9wdHir7G5l2rxUX\u002BfFHU3BGuVYWYHVmM0qUor\u002Bu\u002BygDFw/1Rsk/P\u002BPVR8HiAImLKfz8s4tQGvNquurgYnTZx7PpFOLhTgirB3lyPRizgDK9DXi\u002Brkegrvwcjo/eXt1q/4AN\u002BO\u002Bmqdv0VagR4dnatza4I1T8GxVoRGXmwMN4zKiYB0GUoYtDGmegylifkskiQddZIjuIbuBqpbCFv\u002BUUe4T/ddqUQhGveQjtW0y8zLWYwILoI6pxE5hhLf/WuVqCiFLXnBzyjgPFqakumxOTrdT\u002B7PtiLFfejmJCMxAR1L\u002BybtL96TCUqjZ/JnX9RniE0YAq18xfHF/\u002B9RG\u002BrF7vs9TteChAkcCgakLE5wXd3UflvWGT6vzzV1J2/vAi2fnXk3ahE8pQQD\u002B/hm2JljVWHRfJ1PL5X8TX/iTVyZbQgYxE8VOPPM15kXkh0GCTZb0ZHN3YVQEK2jOtyRWlfnqo7wThRKThyuBKUEN1249kRJRnuKy0\u002BCiLOhcj3XO70BcCeOFfriEYN1X9kgS9lQKkSYR9QcHJ9/bYVgqRwelwjnwsd16qCJZ3S4Fat2YjzaUQf5fvPpJVNITug1gWinVoiQOIkSGn\u002BkDuCfQ==",
      "StatusCode": 202,
      "ResponseHeaders": {
        "Content-Length": "0",
        "Date": "Mon, 27 Jul 2020 21:32:38 GMT",
        "Server": [
          "Windows-Azure-HDFS/1.0",
          "Microsoft-HTTPAPI/2.0"
        ],
        "x-ms-client-request-id": "ae90b378-eaec-4b4d-2143-8a8752f78431",
        "x-ms-request-id": "de719fde-b01f-002c-695d-64a10f000000",
        "x-ms-request-server-encrypted": "true",
        "x-ms-version": "2019-12-12"
      },
      "ResponseBody": []
    },
    {
      "RequestUri": "https://seannsecanary.dfs.core.windows.net/test-filesystem-d5827b2b-713e-fffa-6b1c-e0b8ba49db64/test-file-f49dbef0-a833-bb74-7a52-dc59a00839b4?action=flush\u0026position=1024",
      "RequestMethod": "PATCH",
      "RequestHeaders": {
        "Authorization": "Sanitized",
        "Content-Length": "0",
        "If-None-Match": "\u0022garbage\u0022",
        "User-Agent": [
          "azsdk-net-Storage.Files.DataLake/12.3.0-dev.20200727.1",
          "(.NET Core 4.6.29017.01; Microsoft Windows 10.0.18362 )"
        ],
        "x-ms-client-request-id": "28a820be-a68f-61d3-d8ba-0f0e8deb61f5",
        "x-ms-date": "Mon, 27 Jul 2020 21:32:38 GMT",
        "x-ms-return-client-request-id": "true",
        "x-ms-version": "2019-12-12"
      },
      "RequestBody": null,
      "StatusCode": 200,
      "ResponseHeaders": {
        "Content-Length": "0",
        "Date": "Mon, 27 Jul 2020 21:32:38 GMT",
        "ETag": "\u00220x8D832749605FFB0\u0022",
        "Last-Modified": "Mon, 27 Jul 2020 21:32:38 GMT",
        "Server": [
          "Windows-Azure-HDFS/1.0",
          "Microsoft-HTTPAPI/2.0"
        ],
        "x-ms-client-request-id": "28a820be-a68f-61d3-d8ba-0f0e8deb61f5",
        "x-ms-request-id": "de719fdf-b01f-002c-6a5d-64a10f000000",
        "x-ms-request-server-encrypted": "false",
        "x-ms-version": "2019-12-12"
      },
      "ResponseBody": []
    },
    {
      "RequestUri": "https://seannsecanary.blob.core.windows.net/test-filesystem-d5827b2b-713e-fffa-6b1c-e0b8ba49db64/test-file-f49dbef0-a833-bb74-7a52-dc59a00839b4",
      "RequestMethod": "GET",
      "RequestHeaders": {
        "Authorization": "Sanitized",
        "User-Agent": [
          "azsdk-net-Storage.Files.DataLake/12.3.0-dev.20200727.1",
          "(.NET Core 4.6.29017.01; Microsoft Windows 10.0.18362 )"
        ],
        "x-ms-client-request-id": "32c8dd79-5c4f-9aa1-cea5-fbb58f55c884",
        "x-ms-date": "Mon, 27 Jul 2020 21:32:38 GMT",
        "x-ms-return-client-request-id": "true",
        "x-ms-version": "2019-12-12"
      },
      "RequestBody": null,
      "StatusCode": 200,
      "ResponseHeaders": {
        "Accept-Ranges": "bytes",
        "Content-Length": "1024",
        "Content-Type": "application/octet-stream",
        "Date": "Mon, 27 Jul 2020 21:32:38 GMT",
        "ETag": "\u00220x8D832749605FFB0\u0022",
        "Last-Modified": "Mon, 27 Jul 2020 21:32:38 GMT",
        "Server": [
          "Windows-Azure-Blob/1.0",
          "Microsoft-HTTPAPI/2.0"
        ],
        "x-ms-blob-type": "BlockBlob",
        "x-ms-client-request-id": "32c8dd79-5c4f-9aa1-cea5-fbb58f55c884",
        "x-ms-creation-time": "Mon, 27 Jul 2020 21:32:38 GMT",
        "x-ms-lease-state": "available",
        "x-ms-lease-status": "unlocked",
        "x-ms-request-id": "abd8f89b-d01e-0048-215d-645097000000",
        "x-ms-server-encrypted": "true",
        "x-ms-version": "2019-12-12"
      },
      "ResponseBody": "4eZUBKJgw/RK6ssNo4TmUKlZCY0GMpneWJghZ5bWjplDcQ7u1qTg708NvC/ZHZiOrBX0yodUja9MdasJP1tddFsxyTF1\u002BHoEeRk\u002B\u002BXVpBDv/kruB4cQS7\u002BRfoWD51q/zsEjUqFNnGLSb8FBtFZQ543BvCqyg25KWHtlNFVYZC6NpS0gtlVzomHoH5vF0pdpQJb7wicwCU9S1Pol6GQJdgeStA8pLDE0Uh3EymfWhIXn//PCYKYHWZvh0d1bSbn53qWQMxqEQBRlw3AJb0LneExwQeh0SxFhj153R1pT3QRnyu\u002B\u002BRlVvY7/fWJ0x\u002Be5Y\u002BlWQ6wvNhZOQLqO8DPi6FeZrpaBTKTX7BN4slPJwL5FsGk0EvvH4mkVYKhuxr1LHJUK6ylRKBc0jleYpnPChH/8OU/arsVbwbw9a\u002BwMeRVmPaW\u002BzuWU9IhR/5SkL0vlUuwoYp19cG3frxltI8w7OBVCMnjeA8WaV0S3iK8wt6JwSBj/1AaH\u002BM037x/MN8DMJrd/UfzTB08mngtItee\u002Bnvd2/NujO2QOykmrliSlzi\u002BD62H3sVWlnUDZ2UYLPzLViUAYVUrlKOtTcJezJ3EacM/bxNqFxt2R0V\u002BayVIt85sG1hzknXjknrJ2lDDN4nXfz2h2L2pYT7JihoP7Wl\u002BZNX0MrFFUNeNW9yYYHyKsw\u002B7Zywn5p9QgvpZqcgb0\u002BURi3W6zwUYke4l1Lyg0QCCPxbKVEY9Vn52o6/3K\u002BbPcUg3htTHD6QKYtU9wdHir7G5l2rxUX\u002BfFHU3BGuVYWYHVmM0qUor\u002Bu\u002BygDFw/1Rsk/P\u002BPVR8HiAImLKfz8s4tQGvNquurgYnTZx7PpFOLhTgirB3lyPRizgDK9DXi\u002Brkegrvwcjo/eXt1q/4AN\u002BO\u002Bmqdv0VagR4dnatza4I1T8GxVoRGXmwMN4zKiYB0GUoYtDGmegylifkskiQddZIjuIbuBqpbCFv\u002BUUe4T/ddqUQhGveQjtW0y8zLWYwILoI6pxE5hhLf/WuVqCiFLXnBzyjgPFqakumxOTrdT\u002B7PtiLFfejmJCMxAR1L\u002BybtL96TCUqjZ/JnX9RniE0YAq18xfHF/\u002B9RG\u002BrF7vs9TteChAkcCgakLE5wXd3UflvWGT6vzzV1J2/vAi2fnXk3ahE8pQQD\u002B/hm2JljVWHRfJ1PL5X8TX/iTVyZbQgYxE8VOPPM15kXkh0GCTZb0ZHN3YVQEK2jOtyRWlfnqo7wThRKThyuBKUEN1249kRJRnuKy0\u002BCiLOhcj3XO70BcCeOFfriEYN1X9kgS9lQKkSYR9QcHJ9/bYVgqRwelwjnwsd16qCJZ3S4Fat2YjzaUQf5fvPpJVNITug1gWinVoiQOIkSGn\u002BkDuCfQ=="
    },
    {
      "RequestUri": "https://seannsecanary.blob.core.windows.net/test-filesystem-d5827b2b-713e-fffa-6b1c-e0b8ba49db64?restype=container",
      "RequestMethod": "DELETE",
      "RequestHeaders": {
        "Authorization": "Sanitized",
        "traceparent": "00-f52579419d426540abd713cb07b13a07-0e000ede55f99e47-00",
        "User-Agent": [
          "azsdk-net-Storage.Files.DataLake/12.3.0-dev.20200727.1",
          "(.NET Core 4.6.29017.01; Microsoft Windows 10.0.18362 )"
        ],
        "x-ms-client-request-id": "b0942466-2f22-61a5-78e9-513e188a49f9",
        "x-ms-date": "Mon, 27 Jul 2020 21:32:38 GMT",
        "x-ms-return-client-request-id": "true",
        "x-ms-version": "2019-12-12"
      },
      "RequestBody": null,
      "StatusCode": 202,
      "ResponseHeaders": {
        "Content-Length": "0",
        "Date": "Mon, 27 Jul 2020 21:32:38 GMT",
        "Server": [
          "Windows-Azure-Blob/1.0",
          "Microsoft-HTTPAPI/2.0"
        ],
        "x-ms-client-request-id": "b0942466-2f22-61a5-78e9-513e188a49f9",
        "x-ms-request-id": "abd8f8a2-d01e-0048-285d-645097000000",
        "x-ms-version": "2019-12-12"
      },
      "ResponseBody": []
    },
    {
      "RequestUri": "https://seannsecanary.blob.core.windows.net/test-filesystem-8b19bb70-7630-cf38-141c-527f834b334d?restype=container",
      "RequestMethod": "PUT",
      "RequestHeaders": {
        "Authorization": "Sanitized",
        "traceparent": "00-4d3eed614edab5498b94ee5729c0d889-2df24ab3c4ce8f44-00",
        "User-Agent": [
          "azsdk-net-Storage.Files.DataLake/12.3.0-dev.20200727.1",
          "(.NET Core 4.6.29017.01; Microsoft Windows 10.0.18362 )"
        ],
        "x-ms-blob-public-access": "container",
        "x-ms-client-request-id": "abe5df86-9567-f047-ecc4-9b05dc26dd2c",
        "x-ms-date": "Mon, 27 Jul 2020 21:32:39 GMT",
        "x-ms-return-client-request-id": "true",
        "x-ms-version": "2019-12-12"
      },
      "RequestBody": null,
      "StatusCode": 201,
      "ResponseHeaders": {
        "Content-Length": "0",
        "Date": "Mon, 27 Jul 2020 21:32:39 GMT",
        "ETag": "\u00220x8D83274964B59AE\u0022",
        "Last-Modified": "Mon, 27 Jul 2020 21:32:39 GMT",
        "Server": [
          "Windows-Azure-Blob/1.0",
          "Microsoft-HTTPAPI/2.0"
        ],
        "x-ms-client-request-id": "abe5df86-9567-f047-ecc4-9b05dc26dd2c",
        "x-ms-request-id": "a9aa313e-201e-002e-795d-641fb7000000",
        "x-ms-version": "2019-12-12"
      },
      "ResponseBody": []
    },
    {
      "RequestUri": "https://seannsecanary.dfs.core.windows.net/test-filesystem-8b19bb70-7630-cf38-141c-527f834b334d/test-file-95b904b5-dd3a-5737-590f-7c62106f768a?resource=file",
      "RequestMethod": "PUT",
      "RequestHeaders": {
        "Authorization": "Sanitized",
        "traceparent": "00-520175373c9be9408f69f17541652134-deab62a1cdea3749-00",
        "User-Agent": [
          "azsdk-net-Storage.Files.DataLake/12.3.0-dev.20200727.1",
          "(.NET Core 4.6.29017.01; Microsoft Windows 10.0.18362 )"
        ],
        "x-ms-client-request-id": "541339f1-fed0-a81b-a88d-525819e4df7d",
        "x-ms-date": "Mon, 27 Jul 2020 21:32:39 GMT",
        "x-ms-return-client-request-id": "true",
        "x-ms-version": "2019-12-12"
      },
      "RequestBody": null,
      "StatusCode": 201,
      "ResponseHeaders": {
        "Content-Length": "0",
        "Date": "Mon, 27 Jul 2020 21:32:39 GMT",
        "ETag": "\u00220x8D8327496C10224\u0022",
        "Last-Modified": "Mon, 27 Jul 2020 21:32:39 GMT",
        "Server": [
          "Windows-Azure-HDFS/1.0",
          "Microsoft-HTTPAPI/2.0"
        ],
        "x-ms-client-request-id": "541339f1-fed0-a81b-a88d-525819e4df7d",
        "x-ms-request-id": "e92c07c0-901f-0004-6c5d-64c0a7000000",
        "x-ms-version": "2019-12-12"
      },
      "ResponseBody": []
    },
    {
      "RequestUri": "https://seannsecanary.blob.core.windows.net/test-filesystem-8b19bb70-7630-cf38-141c-527f834b334d/test-file-95b904b5-dd3a-5737-590f-7c62106f768a?comp=lease",
      "RequestMethod": "PUT",
      "RequestHeaders": {
        "Authorization": "Sanitized",
        "traceparent": "00-16aa8bb87685bd44a74eee520c8c9206-7a6526e1dabc114c-00",
        "User-Agent": [
          "azsdk-net-Storage.Files.DataLake/12.3.0-dev.20200727.1",
          "(.NET Core 4.6.29017.01; Microsoft Windows 10.0.18362 )"
        ],
        "x-ms-client-request-id": "6dae017f-4bdf-b7bc-74e5-3505a43f486d",
        "x-ms-date": "Mon, 27 Jul 2020 21:32:40 GMT",
        "x-ms-lease-action": "acquire",
        "x-ms-lease-duration": "-1",
        "x-ms-proposed-lease-id": "e17c104e-392c-2dc5-1fcb-59db5f3adafd",
        "x-ms-return-client-request-id": "true",
        "x-ms-version": "2019-12-12"
      },
      "RequestBody": null,
      "StatusCode": 201,
      "ResponseHeaders": {
        "Content-Length": "0",
        "Date": "Mon, 27 Jul 2020 21:32:39 GMT",
        "ETag": "\u00220x8D8327496C10224\u0022",
        "Last-Modified": "Mon, 27 Jul 2020 21:32:39 GMT",
        "Server": [
          "Windows-Azure-Blob/1.0",
          "Microsoft-HTTPAPI/2.0"
        ],
        "x-ms-client-request-id": "6dae017f-4bdf-b7bc-74e5-3505a43f486d",
        "x-ms-lease-id": "e17c104e-392c-2dc5-1fcb-59db5f3adafd",
        "x-ms-request-id": "a9aa3185-201e-002e-335d-641fb7000000",
        "x-ms-version": "2019-12-12"
      },
      "ResponseBody": []
    },
    {
      "RequestUri": "https://seannsecanary.blob.core.windows.net/test-filesystem-8b19bb70-7630-cf38-141c-527f834b334d/test-file-95b904b5-dd3a-5737-590f-7c62106f768a",
      "RequestMethod": "HEAD",
      "RequestHeaders": {
        "Authorization": "Sanitized",
        "User-Agent": [
          "azsdk-net-Storage.Files.DataLake/12.3.0-dev.20200727.1",
          "(.NET Core 4.6.29017.01; Microsoft Windows 10.0.18362 )"
        ],
        "x-ms-client-request-id": "e1729ddd-d499-03f3-b155-4a1f3b54f5ea",
        "x-ms-date": "Mon, 27 Jul 2020 21:32:40 GMT",
        "x-ms-lease-id": "e17c104e-392c-2dc5-1fcb-59db5f3adafd",
        "x-ms-return-client-request-id": "true",
        "x-ms-version": "2019-12-12"
      },
      "RequestBody": null,
      "StatusCode": 200,
      "ResponseHeaders": {
        "Accept-Ranges": "bytes",
        "Content-Length": "0",
        "Content-Type": "application/octet-stream",
        "Date": "Mon, 27 Jul 2020 21:32:39 GMT",
        "ETag": "\u00220x8D8327496C10224\u0022",
        "Last-Modified": "Mon, 27 Jul 2020 21:32:39 GMT",
        "Server": [
          "Windows-Azure-Blob/1.0",
          "Microsoft-HTTPAPI/2.0"
        ],
        "x-ms-access-tier": "Hot",
        "x-ms-access-tier-inferred": "true",
        "x-ms-blob-type": "BlockBlob",
        "x-ms-client-request-id": "e1729ddd-d499-03f3-b155-4a1f3b54f5ea",
        "x-ms-creation-time": "Mon, 27 Jul 2020 21:32:39 GMT",
        "x-ms-lease-duration": "infinite",
        "x-ms-lease-state": "leased",
        "x-ms-lease-status": "locked",
        "x-ms-request-id": "a9aa31a0-201e-002e-495d-641fb7000000",
        "x-ms-server-encrypted": "true",
        "x-ms-version": "2019-12-12"
      },
      "ResponseBody": []
    },
    {
      "RequestUri": "https://seannsecanary.dfs.core.windows.net/test-filesystem-8b19bb70-7630-cf38-141c-527f834b334d/test-file-95b904b5-dd3a-5737-590f-7c62106f768a?action=append\u0026position=0",
      "RequestMethod": "PATCH",
      "RequestHeaders": {
        "Authorization": "Sanitized",
        "Content-Length": "1024",
        "User-Agent": [
          "azsdk-net-Storage.Files.DataLake/12.3.0-dev.20200727.1",
          "(.NET Core 4.6.29017.01; Microsoft Windows 10.0.18362 )"
        ],
        "x-ms-client-request-id": "a0cb643a-a8c4-2910-f6e5-1fb876697135",
        "x-ms-date": "Mon, 27 Jul 2020 21:32:40 GMT",
        "x-ms-lease-id": "e17c104e-392c-2dc5-1fcb-59db5f3adafd",
        "x-ms-return-client-request-id": "true",
        "x-ms-version": "2019-12-12"
      },
      "RequestBody": "s1R0hnMIISxW8QHaPev3kvYDXF2LbB6X1rliduu15qAIjibhGE7iduCCF\u002B1K4nmI7qMPoePr4UY23LC5papAoQtg0a/EFnmnIOZ8CVUwTfNA2ohIpUW9Ha3gqjudKdA2QXbi6RDKw9cpZ4D8btfxBo\u002B9ecsi\u002BPvFo7QC5Gw\u002BCfcVRsfeTWTidRaxHj7EwK7V76Os4K8EE0l7HUVcyN9r616J5ycQErkq2gO1cdm9AeMFLfTIkihHEDJ9YzAfhq02RTLfOtiGxN3qgQarT6JvvRthVpvqolk1Qtf0kq6IC1RWfiun3cYKf2gX3hAim8CQDaYUvS8SS6PZqvgBkTIvYXWxVdB3yOBVV9cy08RIEqYWZIQHdE4kQzOHzTLNCe016HyacEbwGEXFvmVY33jfkJhR6yytJ\u002BwnjBGd7/quh07p/epHraFgJks/QrbozGS6qD2Zex3Ah8GPc\u002BQ0UilKFzYXbuKNl\u002BL28MXhbuU2Pr\u002Bt40e9FAwwKHUpuDq9LNMi9Cp/0F6CLBFao4tY3xncWDUkh2/hjQMq50VsZN6oOcTxvnq6t21hK7Y1YnGA10lcTV8EmaVkQGYmVekYFccysmnGZiCeIaHHwly4qyuSqQ/8EBd/o6AfjX0UlGKESBbvA7AHunEovSy9PdZIrJQ7k6vZHASwsw7Jp9mjiow/Q3lGyKh6i\u002B\u002Be01LrwWbJ1uDo2AC2qisRPlCiPROXhTOffvlcAuPswAi8O0mxxfGnAND5urGMiJlONIpY2E3cB04fTEJtbNT8/Bj4\u002Bm7iYHle\u002Bj1CnsqBEvVgDs5ZlOe63zT6kXmuOpP8/L2YlI0qa9QR\u002Bd4PmWmDnTlNDF0Fo2gxPRo6584Ar8CpRqEM6X5oNaP5SJoJqkbLdvQ/YS019lhVZ1Zy74MGEEkeZlLHd7S65Na6DFvOKJLUb3HawE6Sc1BJt4Eo9UYf8zdQ6kTzA/8/hXxWe\u002Br9hz7EnoASK1D7i/ICfsAyku\u002BQmxgkfT1N4GtxmjvRPPhlSy9CZFbGDcfnVV9S8YU/DPKNxeDR2QoBdr4UoJEVKU/5nDKQ7y6Yyo1QPSfd\u002B\u002B7mMo1IRHYYlHIlQe2YsWw20SsQWFRTrh3E9PtSgJviI3rPLm4EzOXZ4Qi/aq5AABghGmv7zaOakoNwg1B7xhPXQx1zyIP\u002BMgVGN3ZLlERuhPPiMGYw5lXWNZvrk0iUXhv16CeQzDeVI\u002BhltZYtTv4/Af9cmJWsplzHnJPnE568sdlaVqsc3re7TA19yjG\u002Bqeedq5JJOMWGSEHLyC\u002BkrRBKqQO90vdSIiNIoEuHL9srCfOsSmcMc3kT1A1pURWHF579MyEuAdbvSoluAJd5/xlmn78892OpPjaJqg==",
      "StatusCode": 202,
      "ResponseHeaders": {
        "Content-Length": "0",
        "Date": "Mon, 27 Jul 2020 21:32:40 GMT",
        "Server": [
          "Windows-Azure-HDFS/1.0",
          "Microsoft-HTTPAPI/2.0"
        ],
        "x-ms-client-request-id": "a0cb643a-a8c4-2910-f6e5-1fb876697135",
        "x-ms-request-id": "e92c07c1-901f-0004-6d5d-64c0a7000000",
        "x-ms-request-server-encrypted": "true",
        "x-ms-version": "2019-12-12"
      },
      "ResponseBody": []
    },
    {
      "RequestUri": "https://seannsecanary.dfs.core.windows.net/test-filesystem-8b19bb70-7630-cf38-141c-527f834b334d/test-file-95b904b5-dd3a-5737-590f-7c62106f768a?action=flush\u0026position=1024",
      "RequestMethod": "PATCH",
      "RequestHeaders": {
        "Authorization": "Sanitized",
        "Content-Length": "0",
        "User-Agent": [
          "azsdk-net-Storage.Files.DataLake/12.3.0-dev.20200727.1",
          "(.NET Core 4.6.29017.01; Microsoft Windows 10.0.18362 )"
        ],
        "x-ms-client-request-id": "d6e52b9d-5489-fb26-46af-0e7c98a8c9a5",
        "x-ms-date": "Mon, 27 Jul 2020 21:32:40 GMT",
        "x-ms-lease-id": "e17c104e-392c-2dc5-1fcb-59db5f3adafd",
        "x-ms-return-client-request-id": "true",
        "x-ms-version": "2019-12-12"
      },
      "RequestBody": null,
      "StatusCode": 200,
      "ResponseHeaders": {
        "Content-Length": "0",
        "Date": "Mon, 27 Jul 2020 21:32:40 GMT",
        "ETag": "\u00220x8D8327497136E17\u0022",
        "Last-Modified": "Mon, 27 Jul 2020 21:32:40 GMT",
        "Server": [
          "Windows-Azure-HDFS/1.0",
          "Microsoft-HTTPAPI/2.0"
        ],
        "x-ms-client-request-id": "d6e52b9d-5489-fb26-46af-0e7c98a8c9a5",
        "x-ms-request-id": "e92c07c2-901f-0004-6e5d-64c0a7000000",
        "x-ms-request-server-encrypted": "false",
        "x-ms-version": "2019-12-12"
      },
      "ResponseBody": []
    },
    {
      "RequestUri": "https://seannsecanary.blob.core.windows.net/test-filesystem-8b19bb70-7630-cf38-141c-527f834b334d/test-file-95b904b5-dd3a-5737-590f-7c62106f768a",
      "RequestMethod": "GET",
      "RequestHeaders": {
        "Authorization": "Sanitized",
        "User-Agent": [
          "azsdk-net-Storage.Files.DataLake/12.3.0-dev.20200727.1",
          "(.NET Core 4.6.29017.01; Microsoft Windows 10.0.18362 )"
        ],
        "x-ms-client-request-id": "4a1a108e-9a83-b1ab-a95d-6a95aa208c94",
        "x-ms-date": "Mon, 27 Jul 2020 21:32:40 GMT",
        "x-ms-return-client-request-id": "true",
        "x-ms-version": "2019-12-12"
      },
      "RequestBody": null,
      "StatusCode": 200,
      "ResponseHeaders": {
        "Accept-Ranges": "bytes",
        "Content-Length": "1024",
        "Content-Type": "application/octet-stream",
        "Date": "Mon, 27 Jul 2020 21:32:40 GMT",
        "ETag": "\u00220x8D8327497136E17\u0022",
        "Last-Modified": "Mon, 27 Jul 2020 21:32:40 GMT",
        "Server": [
          "Windows-Azure-Blob/1.0",
          "Microsoft-HTTPAPI/2.0"
        ],
        "x-ms-blob-type": "BlockBlob",
        "x-ms-client-request-id": "4a1a108e-9a83-b1ab-a95d-6a95aa208c94",
        "x-ms-creation-time": "Mon, 27 Jul 2020 21:32:39 GMT",
        "x-ms-lease-duration": "infinite",
        "x-ms-lease-state": "leased",
        "x-ms-lease-status": "locked",
        "x-ms-request-id": "a9aa31bc-201e-002e-5c5d-641fb7000000",
        "x-ms-server-encrypted": "true",
        "x-ms-version": "2019-12-12"
      },
      "ResponseBody": "s1R0hnMIISxW8QHaPev3kvYDXF2LbB6X1rliduu15qAIjibhGE7iduCCF\u002B1K4nmI7qMPoePr4UY23LC5papAoQtg0a/EFnmnIOZ8CVUwTfNA2ohIpUW9Ha3gqjudKdA2QXbi6RDKw9cpZ4D8btfxBo\u002B9ecsi\u002BPvFo7QC5Gw\u002BCfcVRsfeTWTidRaxHj7EwK7V76Os4K8EE0l7HUVcyN9r616J5ycQErkq2gO1cdm9AeMFLfTIkihHEDJ9YzAfhq02RTLfOtiGxN3qgQarT6JvvRthVpvqolk1Qtf0kq6IC1RWfiun3cYKf2gX3hAim8CQDaYUvS8SS6PZqvgBkTIvYXWxVdB3yOBVV9cy08RIEqYWZIQHdE4kQzOHzTLNCe016HyacEbwGEXFvmVY33jfkJhR6yytJ\u002BwnjBGd7/quh07p/epHraFgJks/QrbozGS6qD2Zex3Ah8GPc\u002BQ0UilKFzYXbuKNl\u002BL28MXhbuU2Pr\u002Bt40e9FAwwKHUpuDq9LNMi9Cp/0F6CLBFao4tY3xncWDUkh2/hjQMq50VsZN6oOcTxvnq6t21hK7Y1YnGA10lcTV8EmaVkQGYmVekYFccysmnGZiCeIaHHwly4qyuSqQ/8EBd/o6AfjX0UlGKESBbvA7AHunEovSy9PdZIrJQ7k6vZHASwsw7Jp9mjiow/Q3lGyKh6i\u002B\u002Be01LrwWbJ1uDo2AC2qisRPlCiPROXhTOffvlcAuPswAi8O0mxxfGnAND5urGMiJlONIpY2E3cB04fTEJtbNT8/Bj4\u002Bm7iYHle\u002Bj1CnsqBEvVgDs5ZlOe63zT6kXmuOpP8/L2YlI0qa9QR\u002Bd4PmWmDnTlNDF0Fo2gxPRo6584Ar8CpRqEM6X5oNaP5SJoJqkbLdvQ/YS019lhVZ1Zy74MGEEkeZlLHd7S65Na6DFvOKJLUb3HawE6Sc1BJt4Eo9UYf8zdQ6kTzA/8/hXxWe\u002Br9hz7EnoASK1D7i/ICfsAyku\u002BQmxgkfT1N4GtxmjvRPPhlSy9CZFbGDcfnVV9S8YU/DPKNxeDR2QoBdr4UoJEVKU/5nDKQ7y6Yyo1QPSfd\u002B\u002B7mMo1IRHYYlHIlQe2YsWw20SsQWFRTrh3E9PtSgJviI3rPLm4EzOXZ4Qi/aq5AABghGmv7zaOakoNwg1B7xhPXQx1zyIP\u002BMgVGN3ZLlERuhPPiMGYw5lXWNZvrk0iUXhv16CeQzDeVI\u002BhltZYtTv4/Af9cmJWsplzHnJPnE568sdlaVqsc3re7TA19yjG\u002Bqeedq5JJOMWGSEHLyC\u002BkrRBKqQO90vdSIiNIoEuHL9srCfOsSmcMc3kT1A1pURWHF579MyEuAdbvSoluAJd5/xlmn78892OpPjaJqg=="
    },
    {
      "RequestUri": "https://seannsecanary.blob.core.windows.net/test-filesystem-8b19bb70-7630-cf38-141c-527f834b334d?restype=container",
      "RequestMethod": "DELETE",
      "RequestHeaders": {
        "Authorization": "Sanitized",
        "traceparent": "00-5046c6138d43fd49944c334b0993a5eb-c6d88c3a2361f847-00",
        "User-Agent": [
          "azsdk-net-Storage.Files.DataLake/12.3.0-dev.20200727.1",
          "(.NET Core 4.6.29017.01; Microsoft Windows 10.0.18362 )"
        ],
        "x-ms-client-request-id": "88eeece5-7e8d-c021-9467-32ec9c45d6a6",
        "x-ms-date": "Mon, 27 Jul 2020 21:32:40 GMT",
        "x-ms-return-client-request-id": "true",
        "x-ms-version": "2019-12-12"
      },
      "RequestBody": null,
      "StatusCode": 202,
      "ResponseHeaders": {
        "Content-Length": "0",
        "Date": "Mon, 27 Jul 2020 21:32:40 GMT",
        "Server": [
          "Windows-Azure-Blob/1.0",
          "Microsoft-HTTPAPI/2.0"
        ],
        "x-ms-client-request-id": "88eeece5-7e8d-c021-9467-32ec9c45d6a6",
        "x-ms-request-id": "a9aa31cf-201e-002e-645d-641fb7000000",
        "x-ms-version": "2019-12-12"
      },
      "ResponseBody": []
    }
  ],
  "Variables": {
    "DateTimeOffsetNow": "2020-07-27T16:32:32.0271653-05:00",
    "RandomSeed": "165804547",
    "Storage_TestConfigHierarchicalNamespace": "NamespaceTenant\nseannsecanary\nU2FuaXRpemVk\nhttps://seannsecanary.blob.core.windows.net\nhttps://seannsecanary.file.core.windows.net\nhttps://seannsecanary.queue.core.windows.net\nhttps://seannsecanary.table.core.windows.net\n\n\n\n\nhttps://seannsecanary-secondary.blob.core.windows.net\nhttps://seannsecanary-secondary.file.core.windows.net\nhttps://seannsecanary-secondary.queue.core.windows.net\nhttps://seannsecanary-secondary.table.core.windows.net\n68390a19-a643-458b-b726-408abf67b4fc\nSanitized\n72f988bf-86f1-41af-91ab-2d7cd011db47\nhttps://login.microsoftonline.com/\nCloud\nBlobEndpoint=https://seannsecanary.blob.core.windows.net/;QueueEndpoint=https://seannsecanary.queue.core.windows.net/;FileEndpoint=https://seannsecanary.file.core.windows.net/;BlobSecondaryEndpoint=https://seannsecanary-secondary.blob.core.windows.net/;QueueSecondaryEndpoint=https://seannsecanary-secondary.queue.core.windows.net/;FileSecondaryEndpoint=https://seannsecanary-secondary.file.core.windows.net/;AccountName=seannsecanary;AccountKey=Sanitized\n"
  }
}