{
  "Entries": [
    {
      "RequestUri": "https://FakeHost.net/devices?api-version=2020-03-13",
      "RequestMethod": "POST",
      "RequestHeaders": {
        "Authorization": "Sanitized",
        "Content-Length": "1205",
        "Content-Type": "application/json",
        "User-Agent": [
          "azsdk-net-Iot.Hub.Service/1.0.0-dev.20200820.1",
          "(.NET Core 4.6.28516.03; Microsoft Windows 10.0.18363 )"
        ],
        "x-ms-client-request-id": "d568f5c8e57529c1e029374b1c53010a",
        "x-ms-return-client-request-id": "true"
      },
      "RequestBody": "[{\u0022id\u0022:\u0022bulkDeviceWithTwin304767959\u0022,\u0022importMode\u0022:\u0022create\u0022,\u0022status\u0022:\u0022enabled\u0022,\u0022properties\u0022:{\u0022desired\u0022:{\u0022user\u0022:\u0022userA\u0022}}},{\u0022id\u0022:\u0022bulkDeviceWithTwin1919949225\u0022,\u0022importMode\u0022:\u0022create\u0022,\u0022status\u0022:\u0022enabled\u0022,\u0022properties\u0022:{\u0022desired\u0022:{\u0022user\u0022:\u0022userA\u0022}}},{\u0022id\u0022:\u0022bulkDeviceWithTwin655299890\u0022,\u0022importMode\u0022:\u0022create\u0022,\u0022status\u0022:\u0022enabled\u0022,\u0022properties\u0022:{\u0022desired\u0022:{\u0022user\u0022:\u0022userA\u0022}}},{\u0022id\u0022:\u0022bulkDeviceWithTwin1439309114\u0022,\u0022importMode\u0022:\u0022create\u0022,\u0022status\u0022:\u0022enabled\u0022,\u0022properties\u0022:{\u0022desired\u0022:{\u0022user\u0022:\u0022userA\u0022}}},{\u0022id\u0022:\u0022bulkDeviceWithTwin1676140744\u0022,\u0022importMode\u0022:\u0022create\u0022,\u0022status\u0022:\u0022enabled\u0022,\u0022properties\u0022:{\u0022desired\u0022:{\u0022user\u0022:\u0022userA\u0022}}},{\u0022id\u0022:\u0022bulkDeviceWithTwin369166372\u0022,\u0022importMode\u0022:\u0022create\u0022,\u0022status\u0022:\u0022enabled\u0022,\u0022properties\u0022:{\u0022desired\u0022:{\u0022user\u0022:\u0022userA\u0022}}},{\u0022id\u0022:\u0022bulkDeviceWithTwin782746723\u0022,\u0022importMode\u0022:\u0022create\u0022,\u0022status\u0022:\u0022enabled\u0022,\u0022properties\u0022:{\u0022desired\u0022:{\u0022user\u0022:\u0022userA\u0022}}},{\u0022id\u0022:\u0022bulkDeviceWithTwin854489741\u0022,\u0022importMode\u0022:\u0022create\u0022,\u0022status\u0022:\u0022enabled\u0022,\u0022properties\u0022:{\u0022desired\u0022:{\u0022user\u0022:\u0022userA\u0022}}},{\u0022id\u0022:\u0022bulkDeviceWithTwin1377918686\u0022,\u0022importMode\u0022:\u0022create\u0022,\u0022status\u0022:\u0022enabled\u0022,\u0022properties\u0022:{\u0022desired\u0022:{\u0022user\u0022:\u0022userA\u0022}}},{\u0022id\u0022:\u0022bulkDeviceWithTwin577916315\u0022,\u0022importMode\u0022:\u0022create\u0022,\u0022status\u0022:\u0022enabled\u0022,\u0022properties\u0022:{\u0022desired\u0022:{\u0022user\u0022:\u0022userA\u0022}}}]",
      "StatusCode": 200,
      "ResponseHeaders": {
        "Content-Length": "47",
        "Content-Type": "application/json; charset=utf-8",
        "Date": "Thu, 20 Aug 2020 21:44:49 GMT",
        "Server": "Microsoft-HTTPAPI/2.0",
        "Vary": "Origin",
        "x-ms-request-id": "e39339ec-07a7-4d47-88b3-b65417136172"
      },
      "ResponseBody": {
        "isSuccessful": true,
        "errors": [],
        "warnings": []
      }
    },
    {
      "RequestUri": "https://FakeHost.net/twins/bulkDeviceWithTwin304767959?api-version=2020-03-13",
      "RequestMethod": "GET",
      "RequestHeaders": {
        "Authorization": "Sanitized",
        "User-Agent": [
          "azsdk-net-Iot.Hub.Service/1.0.0-dev.20200820.1",
          "(.NET Core 4.6.28516.03; Microsoft Windows 10.0.18363 )"
        ],
        "x-ms-client-request-id": "f08737db3f531255a2c51ba6431d0eda",
        "x-ms-return-client-request-id": "true"
      },
      "RequestBody": null,
      "StatusCode": 200,
      "ResponseHeaders": {
        "Content-Length": "689",
        "Content-Type": "application/json; charset=utf-8",
        "Date": "Thu, 20 Aug 2020 21:44:49 GMT",
        "Server": "Microsoft-HTTPAPI/2.0",
        "Vary": "Origin",
        "x-ms-request-id": "3543493a-cdd8-4f2e-846f-0e7fee3f2436"
      },
      "ResponseBody": {
        "deviceId": "bulkDeviceWithTwin304767959",
        "etag": "AAAAAAAAAAE=",
        "deviceEtag": "MTQwNzc3MDkz",
        "status": "enabled",
        "statusUpdateTime": "0001-01-01T00:00:00Z",
        "connectionState": "Disconnected",
        "lastActivityTime": "0001-01-01T00:00:00Z",
        "cloudToDeviceMessageCount": 0,
        "authenticationType": "sas",
        "x509Thumbprint": {
          "primaryThumbprint": null,
          "secondaryThumbprint": null
        },
        "version": 2,
        "properties": {
          "desired": {
            "user": "userA",
            "$metadata": {
              "$lastUpdated": "0001-01-01T00:00:00Z",
              "$lastUpdatedVersion": 1,
              "user": {
                "$lastUpdated": "0001-01-01T00:00:00Z",
                "$lastUpdatedVersion": 1
              }
            },
            "$version": 1
          },
          "reported": {
            "$metadata": {
              "$lastUpdated": "2020-08-20T21:44:50.8374919Z"
            },
            "$version": 1
          }
        },
        "capabilities": {
          "iotEdge": false
        }
      }
    },
    {
      "RequestUri": "https://FakeHost.net/devices?api-version=2020-03-13",
      "RequestMethod": "POST",
      "RequestHeaders": {
        "Authorization": "Sanitized",
        "Content-Length": "595",
        "Content-Type": "application/json",
        "User-Agent": [
          "azsdk-net-Iot.Hub.Service/1.0.0-dev.20200820.1",
          "(.NET Core 4.6.28516.03; Microsoft Windows 10.0.18363 )"
        ],
        "x-ms-client-request-id": "e4bdc527c97c715eedadb728278b8cde",
        "x-ms-return-client-request-id": "true"
      },
      "RequestBody": "[{\u0022id\u0022:\u0022bulkDeviceWithTwin304767959\u0022,\u0022importMode\u0022:\u0022delete\u0022},{\u0022id\u0022:\u0022bulkDeviceWithTwin1919949225\u0022,\u0022importMode\u0022:\u0022delete\u0022},{\u0022id\u0022:\u0022bulkDeviceWithTwin655299890\u0022,\u0022importMode\u0022:\u0022delete\u0022},{\u0022id\u0022:\u0022bulkDeviceWithTwin1439309114\u0022,\u0022importMode\u0022:\u0022delete\u0022},{\u0022id\u0022:\u0022bulkDeviceWithTwin1676140744\u0022,\u0022importMode\u0022:\u0022delete\u0022},{\u0022id\u0022:\u0022bulkDeviceWithTwin369166372\u0022,\u0022importMode\u0022:\u0022delete\u0022},{\u0022id\u0022:\u0022bulkDeviceWithTwin782746723\u0022,\u0022importMode\u0022:\u0022delete\u0022},{\u0022id\u0022:\u0022bulkDeviceWithTwin854489741\u0022,\u0022importMode\u0022:\u0022delete\u0022},{\u0022id\u0022:\u0022bulkDeviceWithTwin1377918686\u0022,\u0022importMode\u0022:\u0022delete\u0022},{\u0022id\u0022:\u0022bulkDeviceWithTwin577916315\u0022,\u0022importMode\u0022:\u0022delete\u0022}]",
      "StatusCode": 200,
      "ResponseHeaders": {
        "Content-Length": "47",
        "Content-Type": "application/json; charset=utf-8",
        "Date": "Thu, 20 Aug 2020 21:44:50 GMT",
        "Server": "Microsoft-HTTPAPI/2.0",
        "Vary": "Origin",
        "x-ms-request-id": "527f43e2-9d8d-4f9f-bfd5-f04c973190a3"
      },
      "ResponseBody": {
        "isSuccessful": true,
        "errors": [],
        "warnings": []
      }
    }
  ],
  "Variables": {
    "IOT_HUB_CONNECTION_STRING": "HostName=FakeHost.net;SharedAccessKeyName=iothubowner;SharedAccessKey=Kg==",
    "RandomSeed": "999894705"
  }
}