{
  "Entries": [
    {
      "RequestUri": "https://seanmccdfsca2.blob.core.windows.net/test-filesystem-e5fca0e9-3342-6563-96d9-a1c95861c85d?restype=container",
      "RequestMethod": "PUT",
      "RequestHeaders": {
        "Authorization": "Sanitized",
        "traceparent": "00-6e008940aa67c1498db1c06d8abb4042-e1426024ceffc44b-00",
        "User-Agent": [
          "azsdk-net-Storage.Files.DataLake/12.3.0-dev.20200713.1",
          "(.NET Core 4.6.28801.04; Microsoft Windows 10.0.18362 )"
        ],
        "x-ms-blob-public-access": "container",
        "x-ms-client-request-id": "9f3ce74f-dc3a-210e-8024-89c147b3a25e",
        "x-ms-date": "Tue, 14 Jul 2020 01:17:27 GMT",
        "x-ms-return-client-request-id": "true",
        "x-ms-version": "2019-12-12"
      },
      "RequestBody": null,
      "StatusCode": 201,
      "ResponseHeaders": {
        "Content-Length": "0",
        "Date": "Tue, 14 Jul 2020 01:17:27 GMT",
        "ETag": "\u00220x8D82793ACA41DF0\u0022",
        "Last-Modified": "Tue, 14 Jul 2020 01:17:28 GMT",
        "Server": [
          "Windows-Azure-Blob/1.0",
          "Microsoft-HTTPAPI/2.0"
        ],
        "x-ms-client-request-id": "9f3ce74f-dc3a-210e-8024-89c147b3a25e",
        "x-ms-request-id": "59984220-c01e-0053-2f7c-59b2b6000000",
        "x-ms-version": "2019-12-12"
      },
      "ResponseBody": []
    },
    {
      "RequestUri": "https://seanmccdfsca2.blob.core.windows.net/test-filesystem-e5fca0e9-3342-6563-96d9-a1c95861c85d?restype=container",
      "RequestMethod": "GET",
      "RequestHeaders": {
        "Authorization": "Sanitized",
        "traceparent": "00-4f127765656f2f46a8cd314012d517ba-92cdc03dba192342-00",
        "User-Agent": [
          "azsdk-net-Storage.Files.DataLake/12.3.0-dev.20200713.1",
          "(.NET Core 4.6.28801.04; Microsoft Windows 10.0.18362 )"
        ],
        "x-ms-client-request-id": "707a0cfd-2824-4a23-0306-cc52775a2bc1",
        "x-ms-date": "Tue, 14 Jul 2020 01:17:27 GMT",
        "x-ms-return-client-request-id": "true",
        "x-ms-version": "2019-12-12"
      },
      "RequestBody": null,
      "StatusCode": 200,
      "ResponseHeaders": {
        "Content-Length": "0",
        "Date": "Tue, 14 Jul 2020 01:17:27 GMT",
        "ETag": "\u00220x8D82793ACA41DF0\u0022",
        "Last-Modified": "Tue, 14 Jul 2020 01:17:28 GMT",
        "Server": [
          "Windows-Azure-Blob/1.0",
          "Microsoft-HTTPAPI/2.0"
        ],
        "x-ms-blob-public-access": "container",
        "x-ms-client-request-id": "707a0cfd-2824-4a23-0306-cc52775a2bc1",
        "x-ms-default-encryption-scope": "$account-encryption-key",
        "x-ms-deny-encryption-scope-override": "false",
        "x-ms-has-immutability-policy": "false",
        "x-ms-has-legal-hold": "false",
        "x-ms-lease-state": "available",
        "x-ms-lease-status": "unlocked",
        "x-ms-request-id": "5998424b-c01e-0053-537c-59b2b6000000",
        "x-ms-version": "2019-12-12"
      },
      "ResponseBody": []
    },
    {
      "RequestUri": "https://seanmccdfsca2.blob.core.windows.net/test-filesystem-e5fca0e9-3342-6563-96d9-a1c95861c85d?sv=2019-12-12\u0026ss=b\u0026srt=sco\u0026st=2020-07-14T00%3A17%3A27Z\u0026se=2020-07-14T02%3A17%3A27Z\u0026sp=rwdxlact\u0026sig=Sanitized\u0026restype=container",
      "RequestMethod": "GET",
      "RequestHeaders": {
        "User-Agent": [
          "azsdk-net-Storage.Files.DataLake/12.3.0-dev.20200713.1",
          "(.NET Core 4.6.28801.04; Microsoft Windows 10.0.18362 )"
        ],
        "x-ms-client-request-id": "3ac4be97-3138-7439-97e0-65bb79c17129",
        "x-ms-return-client-request-id": "true",
        "x-ms-version": "2019-12-12"
      },
      "RequestBody": null,
      "StatusCode": 200,
      "ResponseHeaders": {
        "Content-Length": "0",
        "Date": "Tue, 14 Jul 2020 01:17:28 GMT",
        "ETag": "\u00220x8D82793ACA41DF0\u0022",
        "Last-Modified": "Tue, 14 Jul 2020 01:17:28 GMT",
        "Server": [
          "Windows-Azure-Blob/1.0",
          "Microsoft-HTTPAPI/2.0"
        ],
        "x-ms-blob-public-access": "container",
        "x-ms-client-request-id": "3ac4be97-3138-7439-97e0-65bb79c17129",
        "x-ms-default-encryption-scope": "$account-encryption-key",
        "x-ms-deny-encryption-scope-override": "false",
        "x-ms-has-immutability-policy": "false",
        "x-ms-has-legal-hold": "false",
        "x-ms-lease-state": "available",
        "x-ms-lease-status": "unlocked",
        "x-ms-request-id": "1548e4b3-101e-008b-2a7c-5995ef000000",
        "x-ms-version": "2019-12-12"
      },
      "ResponseBody": []
    },
    {
      "RequestUri": "https://seanmccdfsca2.blob.core.windows.net/test-filesystem-e5fca0e9-3342-6563-96d9-a1c95861c85d?restype=container",
      "RequestMethod": "DELETE",
      "RequestHeaders": {
        "Authorization": "Sanitized",
        "traceparent": "00-6e2f54034274f04eb823059190366f28-adc00294ca369945-00",
        "User-Agent": [
          "azsdk-net-Storage.Files.DataLake/12.3.0-dev.20200713.1",
          "(.NET Core 4.6.28801.04; Microsoft Windows 10.0.18362 )"
        ],
        "x-ms-client-request-id": "b9bb8ff0-f096-3288-8e0e-86c00d178f11",
        "x-ms-date": "Tue, 14 Jul 2020 01:17:27 GMT",
        "x-ms-return-client-request-id": "true",
        "x-ms-version": "2019-12-12"
      },
      "RequestBody": null,
      "StatusCode": 202,
      "ResponseHeaders": {
        "Content-Length": "0",
        "Date": "Tue, 14 Jul 2020 01:17:28 GMT",
        "Server": [
          "Windows-Azure-Blob/1.0",
          "Microsoft-HTTPAPI/2.0"
        ],
        "x-ms-client-request-id": "b9bb8ff0-f096-3288-8e0e-86c00d178f11",
        "x-ms-request-id": "1548e4c3-101e-008b-347c-5995ef000000",
        "x-ms-version": "2019-12-12"
      },
      "ResponseBody": []
    }
  ],
  "Variables": {
    "DateTimeOffsetNow": "2020-07-13T20:17:27.6294157-05:00",
    "RandomSeed": "1229445007",
    "Storage_TestConfigHierarchicalNamespace": "NamespaceTenant\nseanmccdfsca2\nU2FuaXRpemVk\nhttps://seanmccdfsca2.blob.core.windows.net\nhttps://seanmccdfsca2.file.core.windows.net\nhttps://seanmccdfsca2.queue.core.windows.net\nhttps://seanmccdfsca2.table.core.windows.net\n\n\n\n\nhttps://seanmccdfsca2-secondary.blob.core.windows.net\nhttps://seanmccdfsca2-secondary.file.core.windows.net\nhttps://seanmccdfsca2-secondary.queue.core.windows.net\nhttps://seanmccdfsca2-secondary.table.core.windows.net\n68390a19-a643-458b-b726-408abf67b4fc\nSanitized\n72f988bf-86f1-41af-91ab-2d7cd011db47\nhttps://login.microsoftonline.com/\nCloud\nBlobEndpoint=https://seanmccdfsca2.blob.core.windows.net/;QueueEndpoint=https://seanmccdfsca2.queue.core.windows.net/;FileEndpoint=https://seanmccdfsca2.file.core.windows.net/;BlobSecondaryEndpoint=https://seanmccdfsca2-secondary.blob.core.windows.net/;QueueSecondaryEndpoint=https://seanmccdfsca2-secondary.queue.core.windows.net/;FileSecondaryEndpoint=https://seanmccdfsca2-secondary.file.core.windows.net/;AccountName=seanmccdfsca2;AccountKey=Sanitized\n"
  }
}