{
  "Entries": [
    {
      "RequestUri": "https://seannsecanary.blob.core.windows.net/test-filesystem-0b9257ed-8b2c-4e38-7353-48c48b619881?restype=container",
      "RequestMethod": "PUT",
      "RequestHeaders": {
        "Authorization": "Sanitized",
        "traceparent": "00-44405bb40a43364e83e26a7640643d16-566f3ab25f006040-00",
        "User-Agent": [
          "azsdk-net-Storage.Files.DataLake/12.3.0-dev.20200727.1",
          "(.NET Core 4.6.29017.01; Microsoft Windows 10.0.18362 )"
        ],
        "x-ms-blob-public-access": "container",
        "x-ms-client-request-id": "c3de737b-9fc0-33fd-18c2-28c3d7a4be23",
        "x-ms-date": "Mon, 27 Jul 2020 17:42:24 GMT",
        "x-ms-return-client-request-id": "true",
        "x-ms-version": "2019-12-12"
      },
      "RequestBody": null,
      "StatusCode": 201,
      "ResponseHeaders": {
        "Content-Length": "0",
        "Date": "Mon, 27 Jul 2020 17:42:25 GMT",
        "ETag": "\u00220x8D832546D1A4DFD\u0022",
        "Last-Modified": "Mon, 27 Jul 2020 17:42:26 GMT",
        "Server": [
          "Windows-Azure-Blob/1.0",
          "Microsoft-HTTPAPI/2.0"
        ],
        "x-ms-client-request-id": "c3de737b-9fc0-33fd-18c2-28c3d7a4be23",
        "x-ms-request-id": "baa67ba9-601e-0062-1d3d-648f87000000",
        "x-ms-version": "2019-12-12"
      },
      "ResponseBody": []
    },
    {
      "RequestUri": "https://seannsecanary.dfs.core.windows.net/test-filesystem-0b9257ed-8b2c-4e38-7353-48c48b619881/test-file-2644dbc7-e7fc-be50-d226-5c82fd128944?resource=file",
      "RequestMethod": "PUT",
      "RequestHeaders": {
        "Authorization": "Sanitized",
        "traceparent": "00-04b3d24661440b428a207821faa0a0f5-de58b19657a4e348-00",
        "User-Agent": [
          "azsdk-net-Storage.Files.DataLake/12.3.0-dev.20200727.1",
          "(.NET Core 4.6.29017.01; Microsoft Windows 10.0.18362 )"
        ],
        "x-ms-client-request-id": "ea5e6aec-8bea-9338-2220-f19a437a3505",
        "x-ms-date": "Mon, 27 Jul 2020 17:42:24 GMT",
        "x-ms-return-client-request-id": "true",
        "x-ms-version": "2019-12-12"
      },
      "RequestBody": null,
      "StatusCode": 201,
      "ResponseHeaders": {
        "Content-Length": "0",
        "Date": "Mon, 27 Jul 2020 17:42:25 GMT",
        "ETag": "\u00220x8D832546D403DF9\u0022",
        "Last-Modified": "Mon, 27 Jul 2020 17:42:26 GMT",
        "Server": [
          "Windows-Azure-HDFS/1.0",
          "Microsoft-HTTPAPI/2.0"
        ],
        "x-ms-client-request-id": "ea5e6aec-8bea-9338-2220-f19a437a3505",
        "x-ms-request-id": "556fe4dd-b01f-0013-283d-6469ac000000",
        "x-ms-version": "2019-12-12"
      },
      "ResponseBody": []
    },
    {
      "RequestUri": "https://seannsecanary.blob.core.windows.net/test-filesystem-0b9257ed-8b2c-4e38-7353-48c48b619881/test-file-2644dbc7-e7fc-be50-d226-5c82fd128944",
      "RequestMethod": "HEAD",
      "RequestHeaders": {
        "Authorization": "Sanitized",
        "If-Modified-Since": "Tue, 28 Jul 2020 17:42:24 GMT",
        "User-Agent": [
          "azsdk-net-Storage.Files.DataLake/12.3.0-dev.20200727.1",
          "(.NET Core 4.6.29017.01; Microsoft Windows 10.0.18362 )"
        ],
        "x-ms-client-request-id": "56a5ab2d-a9b9-d6f2-05f6-5ca458227e3c",
        "x-ms-date": "Mon, 27 Jul 2020 17:42:24 GMT",
        "x-ms-return-client-request-id": "true",
        "x-ms-version": "2019-12-12"
      },
      "RequestBody": null,
      "StatusCode": 304,
      "ResponseHeaders": {
        "Content-Length": "0",
        "Date": "Mon, 27 Jul 2020 17:42:25 GMT",
        "Server": [
          "Windows-Azure-Blob/1.0",
          "Microsoft-HTTPAPI/2.0"
        ],
        "x-ms-client-request-id": "56a5ab2d-a9b9-d6f2-05f6-5ca458227e3c",
        "x-ms-error-code": "ConditionNotMet",
        "x-ms-request-id": "baa67bc4-601e-0062-313d-648f87000000",
        "x-ms-version": "2019-12-12"
      },
      "ResponseBody": []
    },
    {
      "RequestUri": "https://seannsecanary.blob.core.windows.net/test-filesystem-0b9257ed-8b2c-4e38-7353-48c48b619881?restype=container",
      "RequestMethod": "DELETE",
      "RequestHeaders": {
        "Authorization": "Sanitized",
        "traceparent": "00-4893dce5767e7c4ca4ab6d30434cb560-49a917be6aa61544-00",
        "User-Agent": [
          "azsdk-net-Storage.Files.DataLake/12.3.0-dev.20200727.1",
          "(.NET Core 4.6.29017.01; Microsoft Windows 10.0.18362 )"
        ],
        "x-ms-client-request-id": "a19dc1fe-b02e-68b3-f966-8094f6acfd2a",
        "x-ms-date": "Mon, 27 Jul 2020 17:42:24 GMT",
        "x-ms-return-client-request-id": "true",
        "x-ms-version": "2019-12-12"
      },
      "RequestBody": null,
      "StatusCode": 202,
      "ResponseHeaders": {
        "Content-Length": "0",
        "Date": "Mon, 27 Jul 2020 17:42:25 GMT",
        "Server": [
          "Windows-Azure-Blob/1.0",
          "Microsoft-HTTPAPI/2.0"
        ],
        "x-ms-client-request-id": "a19dc1fe-b02e-68b3-f966-8094f6acfd2a",
        "x-ms-request-id": "baa67bcd-601e-0062-373d-648f87000000",
        "x-ms-version": "2019-12-12"
      },
      "ResponseBody": []
    },
    {
      "RequestUri": "https://seannsecanary.blob.core.windows.net/test-filesystem-30a8505b-2f03-59d2-b257-b9d773304b84?restype=container",
      "RequestMethod": "PUT",
      "RequestHeaders": {
        "Authorization": "Sanitized",
        "traceparent": "00-63d57926a78aff42b041305510a62cdb-f3f0e6b564261348-00",
        "User-Agent": [
          "azsdk-net-Storage.Files.DataLake/12.3.0-dev.20200727.1",
          "(.NET Core 4.6.29017.01; Microsoft Windows 10.0.18362 )"
        ],
        "x-ms-blob-public-access": "container",
        "x-ms-client-request-id": "3a660ae5-47d8-cf30-ef44-efd6f6dcf4c8",
        "x-ms-date": "Mon, 27 Jul 2020 17:42:24 GMT",
        "x-ms-return-client-request-id": "true",
        "x-ms-version": "2019-12-12"
      },
      "RequestBody": null,
      "StatusCode": 201,
      "ResponseHeaders": {
        "Content-Length": "0",
        "Date": "Mon, 27 Jul 2020 17:42:26 GMT",
        "ETag": "\u00220x8D832546D760C2D\u0022",
        "Last-Modified": "Mon, 27 Jul 2020 17:42:26 GMT",
        "Server": [
          "Windows-Azure-Blob/1.0",
          "Microsoft-HTTPAPI/2.0"
        ],
        "x-ms-client-request-id": "3a660ae5-47d8-cf30-ef44-efd6f6dcf4c8",
        "x-ms-request-id": "87ecc2d7-501e-009d-3f3d-64bf1a000000",
        "x-ms-version": "2019-12-12"
      },
      "ResponseBody": []
    },
    {
      "RequestUri": "https://seannsecanary.dfs.core.windows.net/test-filesystem-30a8505b-2f03-59d2-b257-b9d773304b84/test-file-ce15fb1a-6505-7ea5-42b0-d6c54da2054e?resource=file",
      "RequestMethod": "PUT",
      "RequestHeaders": {
        "Authorization": "Sanitized",
        "traceparent": "00-03add0cbe92f60428f8bae163575b80b-7fb8021ead88e043-00",
        "User-Agent": [
          "azsdk-net-Storage.Files.DataLake/12.3.0-dev.20200727.1",
          "(.NET Core 4.6.29017.01; Microsoft Windows 10.0.18362 )"
        ],
        "x-ms-client-request-id": "58151849-884e-7fea-65e7-f728716a814c",
        "x-ms-date": "Mon, 27 Jul 2020 17:42:25 GMT",
        "x-ms-return-client-request-id": "true",
        "x-ms-version": "2019-12-12"
      },
      "RequestBody": null,
      "StatusCode": 201,
      "ResponseHeaders": {
        "Content-Length": "0",
        "Date": "Mon, 27 Jul 2020 17:42:27 GMT",
        "ETag": "\u00220x8D832546D9A1291\u0022",
        "Last-Modified": "Mon, 27 Jul 2020 17:42:27 GMT",
        "Server": [
          "Windows-Azure-HDFS/1.0",
          "Microsoft-HTTPAPI/2.0"
        ],
        "x-ms-client-request-id": "58151849-884e-7fea-65e7-f728716a814c",
        "x-ms-request-id": "2b51c356-b01f-005e-5e3d-64a640000000",
        "x-ms-version": "2019-12-12"
      },
      "ResponseBody": []
    },
    {
      "RequestUri": "https://seannsecanary.blob.core.windows.net/test-filesystem-30a8505b-2f03-59d2-b257-b9d773304b84/test-file-ce15fb1a-6505-7ea5-42b0-d6c54da2054e",
      "RequestMethod": "HEAD",
      "RequestHeaders": {
        "Authorization": "Sanitized",
        "If-Unmodified-Since": "Sun, 26 Jul 2020 17:42:24 GMT",
        "User-Agent": [
          "azsdk-net-Storage.Files.DataLake/12.3.0-dev.20200727.1",
          "(.NET Core 4.6.29017.01; Microsoft Windows 10.0.18362 )"
        ],
        "x-ms-client-request-id": "55862d48-d0e5-318f-92e7-b795bf9fdf35",
        "x-ms-date": "Mon, 27 Jul 2020 17:42:25 GMT",
        "x-ms-return-client-request-id": "true",
        "x-ms-version": "2019-12-12"
      },
      "RequestBody": null,
      "StatusCode": 412,
      "ResponseHeaders": {
        "Content-Length": "0",
        "Date": "Mon, 27 Jul 2020 17:42:27 GMT",
        "Server": [
          "Windows-Azure-Blob/1.0",
          "Microsoft-HTTPAPI/2.0"
        ],
        "x-ms-client-request-id": "55862d48-d0e5-318f-92e7-b795bf9fdf35",
        "x-ms-error-code": "ConditionNotMet",
        "x-ms-request-id": "87ecc2ea-501e-009d-4e3d-64bf1a000000",
        "x-ms-version": "2019-12-12"
      },
      "ResponseBody": []
    },
    {
      "RequestUri": "https://seannsecanary.blob.core.windows.net/test-filesystem-30a8505b-2f03-59d2-b257-b9d773304b84?restype=container",
      "RequestMethod": "DELETE",
      "RequestHeaders": {
        "Authorization": "Sanitized",
        "traceparent": "00-0eef1030641efe41bb5f6e670b537d19-f8c317d64db7b440-00",
        "User-Agent": [
          "azsdk-net-Storage.Files.DataLake/12.3.0-dev.20200727.1",
          "(.NET Core 4.6.29017.01; Microsoft Windows 10.0.18362 )"
        ],
        "x-ms-client-request-id": "f3dc5aaf-9137-73ab-52f5-c4aedc3c98a4",
        "x-ms-date": "Mon, 27 Jul 2020 17:42:25 GMT",
        "x-ms-return-client-request-id": "true",
        "x-ms-version": "2019-12-12"
      },
      "RequestBody": null,
      "StatusCode": 202,
      "ResponseHeaders": {
        "Content-Length": "0",
        "Date": "Mon, 27 Jul 2020 17:42:27 GMT",
        "Server": [
          "Windows-Azure-Blob/1.0",
          "Microsoft-HTTPAPI/2.0"
        ],
        "x-ms-client-request-id": "f3dc5aaf-9137-73ab-52f5-c4aedc3c98a4",
        "x-ms-request-id": "87ecc307-501e-009d-653d-64bf1a000000",
        "x-ms-version": "2019-12-12"
      },
      "ResponseBody": []
    },
    {
      "RequestUri": "https://seannsecanary.blob.core.windows.net/test-filesystem-2b3a44b7-4e26-7f54-c0bf-fabb75a52866?restype=container",
      "RequestMethod": "PUT",
      "RequestHeaders": {
        "Authorization": "Sanitized",
        "traceparent": "00-d1b141d59bdbfa419f7793137a9ca5d1-663ce56d3151f548-00",
        "User-Agent": [
          "azsdk-net-Storage.Files.DataLake/12.3.0-dev.20200727.1",
          "(.NET Core 4.6.29017.01; Microsoft Windows 10.0.18362 )"
        ],
        "x-ms-blob-public-access": "container",
        "x-ms-client-request-id": "c432b691-aef0-6189-065c-327897effead",
        "x-ms-date": "Mon, 27 Jul 2020 17:42:25 GMT",
        "x-ms-return-client-request-id": "true",
        "x-ms-version": "2019-12-12"
      },
      "RequestBody": null,
      "StatusCode": 201,
      "ResponseHeaders": {
        "Content-Length": "0",
        "Date": "Mon, 27 Jul 2020 17:42:27 GMT",
        "ETag": "\u00220x8D832546E147C61\u0022",
        "Last-Modified": "Mon, 27 Jul 2020 17:42:27 GMT",
        "Server": [
          "Windows-Azure-Blob/1.0",
          "Microsoft-HTTPAPI/2.0"
        ],
        "x-ms-client-request-id": "c432b691-aef0-6189-065c-327897effead",
        "x-ms-request-id": "ea356d42-401e-0075-103d-64268c000000",
        "x-ms-version": "2019-12-12"
      },
      "ResponseBody": []
    },
    {
      "RequestUri": "https://seannsecanary.dfs.core.windows.net/test-filesystem-2b3a44b7-4e26-7f54-c0bf-fabb75a52866/test-file-d49f5dcc-3456-cae1-46b2-6d8708dc7c01?resource=file",
      "RequestMethod": "PUT",
      "RequestHeaders": {
        "Authorization": "Sanitized",
        "traceparent": "00-81940172d024394ba8d132f5d728a149-920b2a3c5a307944-00",
        "User-Agent": [
          "azsdk-net-Storage.Files.DataLake/12.3.0-dev.20200727.1",
          "(.NET Core 4.6.29017.01; Microsoft Windows 10.0.18362 )"
        ],
        "x-ms-client-request-id": "a6ab989f-161f-5dc8-d567-7e3d4101592a",
        "x-ms-date": "Mon, 27 Jul 2020 17:42:26 GMT",
        "x-ms-return-client-request-id": "true",
        "x-ms-version": "2019-12-12"
      },
      "RequestBody": null,
      "StatusCode": 201,
      "ResponseHeaders": {
        "Content-Length": "0",
        "Date": "Mon, 27 Jul 2020 17:42:27 GMT",
        "ETag": "\u00220x8D832546E3BB65B\u0022",
        "Last-Modified": "Mon, 27 Jul 2020 17:42:28 GMT",
        "Server": [
          "Windows-Azure-HDFS/1.0",
          "Microsoft-HTTPAPI/2.0"
        ],
        "x-ms-client-request-id": "a6ab989f-161f-5dc8-d567-7e3d4101592a",
        "x-ms-request-id": "40274b82-e01f-0031-443d-64acb3000000",
        "x-ms-version": "2019-12-12"
      },
      "ResponseBody": []
    },
    {
      "RequestUri": "https://seannsecanary.blob.core.windows.net/test-filesystem-2b3a44b7-4e26-7f54-c0bf-fabb75a52866/test-file-d49f5dcc-3456-cae1-46b2-6d8708dc7c01",
      "RequestMethod": "HEAD",
      "RequestHeaders": {
        "Authorization": "Sanitized",
        "If-Match": "\u0022garbage\u0022",
        "User-Agent": [
          "azsdk-net-Storage.Files.DataLake/12.3.0-dev.20200727.1",
          "(.NET Core 4.6.29017.01; Microsoft Windows 10.0.18362 )"
        ],
        "x-ms-client-request-id": "ec37df0b-eb3d-6ad4-b983-5ebc538ca529",
        "x-ms-date": "Mon, 27 Jul 2020 17:42:26 GMT",
        "x-ms-return-client-request-id": "true",
        "x-ms-version": "2019-12-12"
      },
      "RequestBody": null,
      "StatusCode": 412,
      "ResponseHeaders": {
        "Content-Length": "0",
        "Date": "Mon, 27 Jul 2020 17:42:27 GMT",
        "Server": [
          "Windows-Azure-Blob/1.0",
          "Microsoft-HTTPAPI/2.0"
        ],
        "x-ms-client-request-id": "ec37df0b-eb3d-6ad4-b983-5ebc538ca529",
        "x-ms-error-code": "ConditionNotMet",
        "x-ms-request-id": "ea356d62-401e-0075-2a3d-64268c000000",
        "x-ms-version": "2019-12-12"
      },
      "ResponseBody": []
    },
    {
      "RequestUri": "https://seannsecanary.blob.core.windows.net/test-filesystem-2b3a44b7-4e26-7f54-c0bf-fabb75a52866?restype=container",
      "RequestMethod": "DELETE",
      "RequestHeaders": {
        "Authorization": "Sanitized",
        "traceparent": "00-13f19cec7186a44fb11ec52d5a9c767c-85c26809edf52d44-00",
        "User-Agent": [
          "azsdk-net-Storage.Files.DataLake/12.3.0-dev.20200727.1",
          "(.NET Core 4.6.29017.01; Microsoft Windows 10.0.18362 )"
        ],
        "x-ms-client-request-id": "095195a7-d577-5d0a-a153-836a3e2f0665",
        "x-ms-date": "Mon, 27 Jul 2020 17:42:26 GMT",
        "x-ms-return-client-request-id": "true",
        "x-ms-version": "2019-12-12"
      },
      "RequestBody": null,
      "StatusCode": 202,
      "ResponseHeaders": {
        "Content-Length": "0",
        "Date": "Mon, 27 Jul 2020 17:42:27 GMT",
        "Server": [
          "Windows-Azure-Blob/1.0",
          "Microsoft-HTTPAPI/2.0"
        ],
        "x-ms-client-request-id": "095195a7-d577-5d0a-a153-836a3e2f0665",
        "x-ms-request-id": "ea356d73-401e-0075-373d-64268c000000",
        "x-ms-version": "2019-12-12"
      },
      "ResponseBody": []
    },
    {
      "RequestUri": "https://seannsecanary.blob.core.windows.net/test-filesystem-5314acbd-b97c-9878-cb47-9d21b683547a?restype=container",
      "RequestMethod": "PUT",
      "RequestHeaders": {
        "Authorization": "Sanitized",
        "traceparent": "00-28dd592bd244d3489731e2ef85205716-1cd40a7b16ee2043-00",
        "User-Agent": [
          "azsdk-net-Storage.Files.DataLake/12.3.0-dev.20200727.1",
          "(.NET Core 4.6.29017.01; Microsoft Windows 10.0.18362 )"
        ],
        "x-ms-blob-public-access": "container",
        "x-ms-client-request-id": "6992cf15-da2a-eed0-1db9-3e2f37e8a71e",
        "x-ms-date": "Mon, 27 Jul 2020 17:42:26 GMT",
        "x-ms-return-client-request-id": "true",
        "x-ms-version": "2019-12-12"
      },
      "RequestBody": null,
      "StatusCode": 201,
      "ResponseHeaders": {
        "Content-Length": "0",
        "Date": "Mon, 27 Jul 2020 17:42:28 GMT",
        "ETag": "\u00220x8D832546E75C317\u0022",
        "Last-Modified": "Mon, 27 Jul 2020 17:42:28 GMT",
        "Server": [
          "Windows-Azure-Blob/1.0",
          "Microsoft-HTTPAPI/2.0"
        ],
        "x-ms-client-request-id": "6992cf15-da2a-eed0-1db9-3e2f37e8a71e",
        "x-ms-request-id": "a2e7cf5b-501e-0024-5c3d-64bb00000000",
        "x-ms-version": "2019-12-12"
      },
      "ResponseBody": []
    },
    {
      "RequestUri": "https://seannsecanary.dfs.core.windows.net/test-filesystem-5314acbd-b97c-9878-cb47-9d21b683547a/test-file-2d1409ff-481a-222a-f90a-adf9871aa821?resource=file",
      "RequestMethod": "PUT",
      "RequestHeaders": {
        "Authorization": "Sanitized",
        "traceparent": "00-9e3d8782947c0b4c91f224211a231a5b-160c1b9c8faf584a-00",
        "User-Agent": [
          "azsdk-net-Storage.Files.DataLake/12.3.0-dev.20200727.1",
          "(.NET Core 4.6.29017.01; Microsoft Windows 10.0.18362 )"
        ],
        "x-ms-client-request-id": "e65e13db-8395-cc05-a56f-6f202cd66602",
        "x-ms-date": "Mon, 27 Jul 2020 17:42:26 GMT",
        "x-ms-return-client-request-id": "true",
        "x-ms-version": "2019-12-12"
      },
      "RequestBody": null,
      "StatusCode": 201,
      "ResponseHeaders": {
        "Content-Length": "0",
        "Date": "Mon, 27 Jul 2020 17:42:28 GMT",
        "ETag": "\u00220x8D832546E9A7CBD\u0022",
        "Last-Modified": "Mon, 27 Jul 2020 17:42:28 GMT",
        "Server": [
          "Windows-Azure-HDFS/1.0",
          "Microsoft-HTTPAPI/2.0"
        ],
        "x-ms-client-request-id": "e65e13db-8395-cc05-a56f-6f202cd66602",
        "x-ms-request-id": "de7149e8-b01f-002c-1b3d-64a10f000000",
        "x-ms-version": "2019-12-12"
      },
      "ResponseBody": []
    },
    {
      "RequestUri": "https://seannsecanary.blob.core.windows.net/test-filesystem-5314acbd-b97c-9878-cb47-9d21b683547a/test-file-2d1409ff-481a-222a-f90a-adf9871aa821",
      "RequestMethod": "HEAD",
      "RequestHeaders": {
        "Authorization": "Sanitized",
        "User-Agent": [
          "azsdk-net-Storage.Files.DataLake/12.3.0-dev.20200727.1",
          "(.NET Core 4.6.29017.01; Microsoft Windows 10.0.18362 )"
        ],
        "x-ms-client-request-id": "741ef138-c2bc-128b-793e-41817a2f4f69",
        "x-ms-date": "Mon, 27 Jul 2020 17:42:27 GMT",
        "x-ms-return-client-request-id": "true",
        "x-ms-version": "2019-12-12"
      },
      "RequestBody": null,
      "StatusCode": 200,
      "ResponseHeaders": {
        "Accept-Ranges": "bytes",
        "Content-Length": "0",
        "Content-Type": "application/octet-stream",
        "Date": "Mon, 27 Jul 2020 17:42:28 GMT",
        "ETag": "\u00220x8D832546E9A7CBD\u0022",
        "Last-Modified": "Mon, 27 Jul 2020 17:42:28 GMT",
        "Server": [
          "Windows-Azure-Blob/1.0",
          "Microsoft-HTTPAPI/2.0"
        ],
        "x-ms-access-tier": "Hot",
        "x-ms-access-tier-inferred": "true",
        "x-ms-blob-type": "BlockBlob",
        "x-ms-client-request-id": "741ef138-c2bc-128b-793e-41817a2f4f69",
        "x-ms-creation-time": "Mon, 27 Jul 2020 17:42:28 GMT",
        "x-ms-lease-state": "available",
        "x-ms-lease-status": "unlocked",
        "x-ms-request-id": "a2e7cf90-501e-0024-093d-64bb00000000",
        "x-ms-server-encrypted": "true",
        "x-ms-version": "2019-12-12"
      },
      "ResponseBody": []
    },
    {
      "RequestUri": "https://seannsecanary.blob.core.windows.net/test-filesystem-5314acbd-b97c-9878-cb47-9d21b683547a/test-file-2d1409ff-481a-222a-f90a-adf9871aa821",
      "RequestMethod": "HEAD",
      "RequestHeaders": {
        "Authorization": "Sanitized",
        "If-None-Match": "\u00220x8D832546E9A7CBD\u0022",
        "User-Agent": [
          "azsdk-net-Storage.Files.DataLake/12.3.0-dev.20200727.1",
          "(.NET Core 4.6.29017.01; Microsoft Windows 10.0.18362 )"
        ],
        "x-ms-client-request-id": "22f808c3-cf65-f638-efd6-1085ecf2a090",
        "x-ms-date": "Mon, 27 Jul 2020 17:42:27 GMT",
        "x-ms-return-client-request-id": "true",
        "x-ms-version": "2019-12-12"
      },
      "RequestBody": null,
      "StatusCode": 304,
      "ResponseHeaders": {
        "Content-Length": "0",
        "Date": "Mon, 27 Jul 2020 17:42:28 GMT",
        "Server": [
          "Windows-Azure-Blob/1.0",
          "Microsoft-HTTPAPI/2.0"
        ],
        "x-ms-client-request-id": "22f808c3-cf65-f638-efd6-1085ecf2a090",
        "x-ms-error-code": "ConditionNotMet",
        "x-ms-request-id": "a2e7cf98-501e-0024-0f3d-64bb00000000",
        "x-ms-version": "2019-12-12"
      },
      "ResponseBody": []
    },
    {
      "RequestUri": "https://seannsecanary.blob.core.windows.net/test-filesystem-5314acbd-b97c-9878-cb47-9d21b683547a?restype=container",
      "RequestMethod": "DELETE",
      "RequestHeaders": {
        "Authorization": "Sanitized",
        "traceparent": "00-3aef0fb7a5ca8d4ebe6e35bd02b36c88-b18dda7b7d95d044-00",
        "User-Agent": [
          "azsdk-net-Storage.Files.DataLake/12.3.0-dev.20200727.1",
          "(.NET Core 4.6.29017.01; Microsoft Windows 10.0.18362 )"
        ],
        "x-ms-client-request-id": "0c0fd9de-8c34-9500-c278-e0191c7d9a4f",
        "x-ms-date": "Mon, 27 Jul 2020 17:42:27 GMT",
        "x-ms-return-client-request-id": "true",
        "x-ms-version": "2019-12-12"
      },
      "RequestBody": null,
      "StatusCode": 202,
      "ResponseHeaders": {
        "Content-Length": "0",
        "Date": "Mon, 27 Jul 2020 17:42:28 GMT",
        "Server": [
          "Windows-Azure-Blob/1.0",
          "Microsoft-HTTPAPI/2.0"
        ],
        "x-ms-client-request-id": "0c0fd9de-8c34-9500-c278-e0191c7d9a4f",
        "x-ms-request-id": "a2e7cfa2-501e-0024-113d-64bb00000000",
        "x-ms-version": "2019-12-12"
      },
      "ResponseBody": []
    },
    {
      "RequestUri": "https://seannsecanary.blob.core.windows.net/test-filesystem-500144b7-891f-78d2-68c4-590e3a5c5c3d?restype=container",
      "RequestMethod": "PUT",
      "RequestHeaders": {
        "Authorization": "Sanitized",
        "traceparent": "00-3a48f4a3cbafab448527ecb58fe334b1-0bdc599187ffd24a-00",
        "User-Agent": [
          "azsdk-net-Storage.Files.DataLake/12.3.0-dev.20200727.1",
          "(.NET Core 4.6.29017.01; Microsoft Windows 10.0.18362 )"
        ],
        "x-ms-blob-public-access": "container",
        "x-ms-client-request-id": "552345bc-60af-549a-0796-a46f32f15b66",
        "x-ms-date": "Mon, 27 Jul 2020 17:42:27 GMT",
        "x-ms-return-client-request-id": "true",
        "x-ms-version": "2019-12-12"
      },
      "RequestBody": null,
      "StatusCode": 201,
      "ResponseHeaders": {
        "Content-Length": "0",
        "Date": "Mon, 27 Jul 2020 17:42:30 GMT",
        "ETag": "\u00220x8D832546EFA8778\u0022",
        "Last-Modified": "Mon, 27 Jul 2020 17:42:29 GMT",
        "Server": [
          "Windows-Azure-Blob/1.0",
          "Microsoft-HTTPAPI/2.0"
        ],
        "x-ms-client-request-id": "552345bc-60af-549a-0796-a46f32f15b66",
        "x-ms-request-id": "5ffc3ecf-101e-009c-113d-64e0c6000000",
        "x-ms-version": "2019-12-12"
      },
      "ResponseBody": []
    },
    {
      "RequestUri": "https://seannsecanary.dfs.core.windows.net/test-filesystem-500144b7-891f-78d2-68c4-590e3a5c5c3d/test-file-c5f4a21c-88d5-236c-e718-c8b6b9920ee2?resource=file",
      "RequestMethod": "PUT",
      "RequestHeaders": {
        "Authorization": "Sanitized",
        "traceparent": "00-66254f86bb9dee43ba48d9042bfb7117-3e8bcff2020b894c-00",
        "User-Agent": [
          "azsdk-net-Storage.Files.DataLake/12.3.0-dev.20200727.1",
          "(.NET Core 4.6.29017.01; Microsoft Windows 10.0.18362 )"
        ],
        "x-ms-client-request-id": "c724690d-5191-3376-d8ff-6d9797e39b74",
        "x-ms-date": "Mon, 27 Jul 2020 17:42:28 GMT",
        "x-ms-return-client-request-id": "true",
        "x-ms-version": "2019-12-12"
      },
      "RequestBody": null,
      "StatusCode": 201,
      "ResponseHeaders": {
        "Content-Length": "0",
        "Date": "Mon, 27 Jul 2020 17:42:30 GMT",
        "ETag": "\u00220x8D832546FBED93A\u0022",
        "Last-Modified": "Mon, 27 Jul 2020 17:42:30 GMT",
        "Server": [
          "Windows-Azure-HDFS/1.0",
          "Microsoft-HTTPAPI/2.0"
        ],
        "x-ms-client-request-id": "c724690d-5191-3376-d8ff-6d9797e39b74",
        "x-ms-request-id": "9e98ae88-301f-008b-753d-6449cd000000",
        "x-ms-version": "2019-12-12"
      },
      "ResponseBody": []
    },
    {
      "RequestUri": "https://seannsecanary.blob.core.windows.net/test-filesystem-500144b7-891f-78d2-68c4-590e3a5c5c3d/test-file-c5f4a21c-88d5-236c-e718-c8b6b9920ee2",
      "RequestMethod": "HEAD",
      "RequestHeaders": {
        "Authorization": "Sanitized",
        "User-Agent": [
          "azsdk-net-Storage.Files.DataLake/12.3.0-dev.20200727.1",
          "(.NET Core 4.6.29017.01; Microsoft Windows 10.0.18362 )"
        ],
        "x-ms-client-request-id": "5f5ee652-1c8f-ed24-b80d-4c9715e9c3ef",
        "x-ms-date": "Mon, 27 Jul 2020 17:42:28 GMT",
        "x-ms-lease-id": "9c1150be-1f16-4969-845f-5d30d0684364",
        "x-ms-return-client-request-id": "true",
        "x-ms-version": "2019-12-12"
      },
      "RequestBody": null,
      "StatusCode": 412,
      "ResponseHeaders": {
        "Content-Length": "0",
        "Date": "Mon, 27 Jul 2020 17:42:30 GMT",
        "Server": [
          "Windows-Azure-Blob/1.0",
          "Microsoft-HTTPAPI/2.0"
        ],
        "x-ms-client-request-id": "5f5ee652-1c8f-ed24-b80d-4c9715e9c3ef",
        "x-ms-error-code": "LeaseNotPresentWithBlobOperation",
        "x-ms-request-id": "5ffc3f39-101e-009c-653d-64e0c6000000",
        "x-ms-version": "2019-12-12"
      },
      "ResponseBody": []
    },
    {
      "RequestUri": "https://seannsecanary.blob.core.windows.net/test-filesystem-500144b7-891f-78d2-68c4-590e3a5c5c3d?restype=container",
      "RequestMethod": "DELETE",
      "RequestHeaders": {
        "Authorization": "Sanitized",
        "traceparent": "00-92894a08eb764940b057fb8ac8557d8c-466f87b738d1494d-00",
        "User-Agent": [
          "azsdk-net-Storage.Files.DataLake/12.3.0-dev.20200727.1",
          "(.NET Core 4.6.29017.01; Microsoft Windows 10.0.18362 )"
        ],
        "x-ms-client-request-id": "430d0f45-e173-426f-1960-456ec0d042a1",
        "x-ms-date": "Mon, 27 Jul 2020 17:42:29 GMT",
        "x-ms-return-client-request-id": "true",
        "x-ms-version": "2019-12-12"
      },
      "RequestBody": null,
      "StatusCode": 202,
      "ResponseHeaders": {
        "Content-Length": "0",
        "Date": "Mon, 27 Jul 2020 17:42:30 GMT",
        "Server": [
          "Windows-Azure-Blob/1.0",
          "Microsoft-HTTPAPI/2.0"
        ],
        "x-ms-client-request-id": "430d0f45-e173-426f-1960-456ec0d042a1",
        "x-ms-request-id": "5ffc3f47-101e-009c-703d-64e0c6000000",
        "x-ms-version": "2019-12-12"
      },
      "ResponseBody": []
    }
  ],
  "Variables": {
    "DateTimeOffsetNow": "2020-07-27T12:42:24.3379710-05:00",
    "RandomSeed": "472560298",
    "Storage_TestConfigHierarchicalNamespace": "NamespaceTenant\nseannsecanary\nU2FuaXRpemVk\nhttps://seannsecanary.blob.core.windows.net\nhttps://seannsecanary.file.core.windows.net\nhttps://seannsecanary.queue.core.windows.net\nhttps://seannsecanary.table.core.windows.net\n\n\n\n\nhttps://seannsecanary-secondary.blob.core.windows.net\nhttps://seannsecanary-secondary.file.core.windows.net\nhttps://seannsecanary-secondary.queue.core.windows.net\nhttps://seannsecanary-secondary.table.core.windows.net\n68390a19-a643-458b-b726-408abf67b4fc\nSanitized\n72f988bf-86f1-41af-91ab-2d7cd011db47\nhttps://login.microsoftonline.com/\nCloud\nBlobEndpoint=https://seannsecanary.blob.core.windows.net/;QueueEndpoint=https://seannsecanary.queue.core.windows.net/;FileEndpoint=https://seannsecanary.file.core.windows.net/;BlobSecondaryEndpoint=https://seannsecanary-secondary.blob.core.windows.net/;QueueSecondaryEndpoint=https://seannsecanary-secondary.queue.core.windows.net/;FileSecondaryEndpoint=https://seannsecanary-secondary.file.core.windows.net/;AccountName=seannsecanary;AccountKey=Sanitized\n"
  }
}