[{
    "name": "Hematología",
    "services": [
        "AGLUTININAS ANTI RH",
        "COOMBS DIRECTO",
        "COOMBS INDIRECTO",
        "EOSINOFILOS EN SANGRE",
        "FACTOR DU",
        "FIBRINOGENO",
        "FORMULA Y CONTEO",
        "FROTIS DE SANGRE PERIFERICA",
        "GRUPO SANGUINEO Y RH",
        "HEMATOCRITO - HEMOGLOBINA",
        "HEMATOLOGIA COMPLETA",
        "PLAQUETAS",
        "RETICULOCITOS",
        "RETICULOCITOS",
        "TIEMPO DE PROTOMBINA (PTT)",
        "TIEMPO DE TROMBINA (PT)",
        "VELOCIDAD DE SEDIMENTACION GLOBULAR (VSG)"
    ]
}, {
    "name": "Química",
    "services": [
        "ACIDO FOLICO",
        "ACIDO URICO EN ORINA DE 24H",
        "ACIDO URICO EN ORINA DE 24H",
        "ACIDO URICO EN ORINA PARCIAL",
        "ALBUMINA",
        "AMILASA",
        "AZUCARES REDUCTORES",
        "BILIRRUBINA DIRECTA",
        "BILIRRUBINA INDIRECTA",
        "BILIRRUBINA TOTAL",
        "BUN",
        "CALCIO",
        "CALCIO EN ORINA DE 24 HORAS    mg/24 h"    ,
        "CALCIO EN ORINA DE 24 HORAS",
        "CALCIO EN ORINA PARCIAL",
        "CAPACIDAD DE FIJACION DE HIERRO",
        "CK-MB",
        "CK-MB",
        "CLORO",
        "CLORO EN ORINA DE 24 HORAS",
        "CLORO EN ORINA PARCIAL",
        "COLESTEROL",
        "COLESTEROL HDL",
        "COLESTEROL LDL",
        "COLESTEROL VLDL",
        "CREATININA",
        "CREATININA EN ORINA",
        "CREATININA EN ORINA DE 24 HORAS",
        "CREATININA EN ORINA PARCIAL",
        "CREATININA EN SANGRE",
        "DEPURACIÓN DE CREATININA",
        "DEPURACIÓN DE UREA",
        "ELECTROLITOS EN ORINA DE 24 HORAS",
        "ELECTROLITOS URINARIOS",
        "FOSFATASA ACIDA PROSTATICA",
        "FOSFATASA ACIDA TOTAL",
        "FOSFATASA ALCALINA",
        "FOSFATASA ALCALINA ÓSEA",
        "FOSFATASA ALCALINA ÓSEA",
        "FOSFORO",
        "FOSFORO",
        "FOSFORO EN ORINA",
        "FOSFORO EN ORINA DE 24 HORAS",
        "FOSFORO EN ORINA PARCIAL",
        "GAMMA GLUTAMIL TRANSPEPTIDASA (GGT)",
        "GLICEMIA",
        "GLICEMIA POST-PRANDIAL",
        "HIERRO SERICO",
        "HIERRO SERICO",
        "LDH",
        "LIPASA",
        "LIPIDOS TOTALES",
        "LITIO",
        "MAGNESIO",
        "MAGNESIO EN ORINA DE 24 HORAS",
        "MICROALBUMINURIA",
        "MIOGLOBINA",
        "NITROGENO UREICO",
        "POTASIO",
        "POTASIO EN ORINA",
        "POTASIO EN ORINA DE 24 h",
        "POTASIO EN ORINA PARCIAL",
        "PROTEINA DE BENCE - JONES",
        "PROTEINAS TOTALES",
        "PROTEINAS TOTALES Y FRACCIONADAS",
        "PROTEINURIA",
        "PROTEINURIA EN 24 HORAS",
        "SODIO",
        "SODIO EN ORINA",
        "SODIO EN ORINA DE 24 HORAS",
        "SODIO EN ORINA PARCIAL",
        "TRANSAMINASA OXALACETICA UI/L",
        "TRANSAMINASA PIRUVICA (ALT) UI/L",
        "TRANSFERRINA",
        "TRIGLICERIDOS",
        "UREA EN ORINA",
        "UREA EN ORINA",
        "UREA EN ORINA DE 24h",
        "UREA EN ORINA PARCIAL",
        "UREA EN SANGRE"
    ]
}, {
    "name": "Especiales",
    "services": [
        "17 OH PROGESTERONA P. ESTIMULACIÓN",
        "ACIDO VALPROICO",
        "ADENOVIRUS EN HECES",
        "AGLUTININAS ANTIGENOS FEBRILES (WIDAL)",
        "ALERGENOS (INDIVIDUAL)",
        "ALFAFETOPROTEINAS (AFP) UI/L",
        "ANFETAMINAS (ESTASIS)",
        "ANTICUERPOS ANTI- RUBEOLA IgG",
        "ANTICUERPOS ANTI- RUBEOLA IgM",
        "ANTICUERPOS ANTI-DENGUE IgG",
        "ANTICUERPOS ANTI-DENGUE IgM",
        "ANTIGENO CARCINOEMBRIONARIO(CEA)",
        "ANTIGENO PROSTATICO LIBRE (PSA)",
        "ANTIGENO PROSTATICO TOTAL (PSA)",
        "APOLIPOPROTEINA A-1 (APO A1)",
        "APOLIPOPROTEINA B (APO B)",
        "BENZODIAZEPINAS",
        "BETA - CROSSLAPS ( TELOPEPTIDO CTX )",
        "BETA-2 MICROGLOBULINA",
        "BETA-2 MICROGLOBULINA EN ORINA",
        "CA 125",
        "CA 15-3",
        "CA 19-9",
        "CA 72-4",
        "CARBAMAZEPINA (TEGRETOL)",
        "COCAINA",
        "DIFENILHIDANTOINA (EPAMIN)",
        "ELECTROFORESIS DE COLESTEROL",
        "ELECTROFORESIS DE LIPOPROTEINAS",
        "ELECTROFORESIS DE PROTEINAS",
        "EOSINOFILOS EN MOCO NASAL",
        "ESPERMATOGRAMA",
        "FENOBARBITAL",
        "FERRITINA",
        "FERRITINA",
        "FTA ABS",
        "GONADOTROFINA CORIONICA HCG-CUANTITATIVA",
        "GOTA GRUESA",
        "HELICOBACTER PYLORI CUANTITATIVO",
        "HELICOBACTER PYLORI IgG",
        "HELICOBACTER PYLORI IgM",
        "HEMOGLOBINA GLICOSILADA A1C",
        "HERPES SIMPLEX 1 IgG",
        "HERPES SIMPLEX 1 IgM",
        "HERPES SIMPLEX 2 IgG",
        "HERPES SIMPLEX 2 IgM",
        "HIV",
        "HIV CONFIRMATORIO",
        "HOMOCISTEINA (HCY)",
        "MACHADO GUERREIRO (CHAGAS)",
        "MARIHUANA (CANABINOIDES)",
        "MICOPLASMA PNEUMONIAE IgA",
        "MICOPLASMA PNEUMONIAE IgG",
        "MICOPLASMA PNEUMONIAE IgM",
        "NORWALK LIKE VIRUS (NOROVIRUS)",
        "OPIACEOS (MORFINA, HEROINA)",
        "OSTEOCALCINA",
        "OSTEOCALCINA",
        "P.B.I (PBI)",
        "PANEL DE ALERGIA ALERGENOS INHALANTES",
        "PANEL DE ALERGIA ALIMENTOS",
        "PANEL DE ALERGIA ANALGESICOS",
        "PANEL DE ALERGIA ANESTESICO",
        "PANEL DE ALERGIA ANTIBIOTICOS",
        "PANEL DE ALERGIA PEDIATRICO 1",
        "PANEL DE ALERGIA PEDIATRICO 2",
        "PARATOHORMONA (PTH)",
        "PAROTIDITIS IGG",
        "PAROTIDITIS IGM",
        "PARVOVIRUS IGG",
        "PARVOVIRUS IGM",
        "PCR CUANTITATIVA",
        "PCR LATEX",
        "PCR US",
        "PRUEBA DE EMBARAZO CUALITATIVA",
        "PRUEBA DE EMBARAZO CUANTITATIVA",
        "PSEUDOCOLINESTERASA",
        "RATEST",
        "RATEST CUANTITATIVA NEFELOMETRIA",
        "SARAMEBA",
        "SARAMPION IgG",
        "SARAMPION IgM",
        "SATURACION DE TRANSFERRINA",
        "SEROLOGIA PARA HONGOS",
        "SOMATOMEDINA C",
        "TOXOPLASMOSIS IgG",
        "TOXOPLASMOSIS IgM",
        "V.D.R.L. (VDRL)",
        "V.D.R.L. CUANTITATIVO (VDRL)",
        "VARICELA ZOSTER IgG",
        "VARICELA ZOSTER IgM",
        "VITAMINA B 12"
    ]
}, {
    "name": "Hormonales",
    "services": [
        "ACTH ( HORMONA ADENOCORTICOTROPA )",
        "ALDOSTERONA",
        "ANDROSTENEDIONA",
        "ANDROSTENEDIONA",
        "CORTISOL 4 HORAS",
        "CORTISOL 4 p.m",
        "CORTISOL 8 a.m",
        "CORTISOL 8 HORAS",
        "CORTISOL URINARIO",
        "DEHIDROEPIANDROSTENEDIONA (DHEAS)",
        "DEHIDROEPIANDROSTENEDIONA SULFATO (DHEAS-S)",
        "ESTRADIOL",
        "ESTRIOL",
        "ESTROGENOS",
        "FSH (HORMONA FOLICULO ESTIMULANTE)",
        "HORMONA DE CRECIMIENTO (SOMATOTROPINA STH)",
        "HORMONA PARATOHORMONA (PTH)",
        "HORMONA TIROIDEO ESTIMULANTE (TSH)",
        "INSULINA 120 MIN",
        "INSULINA 180 MIN",
        "INSULINA 240 MIN",
        "INSULINA 30 MIN",
        "INSULINA 300 MIN",
        "INSULINA 60 MIN",
        "INSULINA 90 MIN",
        "INSULINA BASAL",
        "INSULINA POST-PANDRIAL",
        "LH (HORMONA FOLICULO LUTEINIZANTE)",
        "PROGESTERONA",
        "PROLACTINA",
        "PROLACTINA",
        "T3",
        "T3 CAPTACION",
        "T3 LIBRE",
        "T4",
        "T4 LIBRE",
        "TESTOSTERONA LIBRE",
        "TESTOSTERONA TOTAL",
        "TIROGLOBULINA"
    ]
}, {
    "name": "Bacteriología",
    "services": [
        "COLORACIÓN DE GRAM",
        "COLORACIÓN DE ZIEHL-NEELSEN",
        "CULTIVO BK",
        "CULTIVO DE HECES (CORPOCULTIVO)",
        "CULTIVO DE HONGOS",
        "CULTIVO DE SANGRE (HEMOCULTIVO)",
        "CULTIVO EN ORINA (UROCULTIVO)",
        "CULTIVO FARINGEO",
        "CULTIVO OTROS",
        "CULTIVO URETRAL",
        "CULTIVO VAGINAL",
        "CULTURETTE",
        "EXAMEN MICOLOGICO DIRECTO"
    ]
}, {
    "name": "Inmunología",
    "services": [
        "AC. ANTI-CHLAMYDIA PNEUMONIAE IgA",
        "AC. ANTI-CHLAMYDIA PNEUMONIAE IgG",
        "AC. ANTI-CHLAMYDIA PNEUMONIAE IgM",
        "AC. ANTI-CHLAMYDIA TRACOMATIS IgA",
        "AC. ANTI-CHLAMYDIA TRACOMATIS IgG",
        "AC. ANTI-CHLAMYDIA TRACOMATIS IgG",
        "AC. ANTI-CHLAMYDIA TRACOMATIS IgM",
        "Ac. ANTI-FOSFOLIPIDOS IgG/IgM",
        "Ac. ANTI-PARVOVIRUS IgG/IgM",
        "Ac. ANTI-PEROXIDASA (ANTI-TPO)",
        "Ac. ANTI-RUBEOLA IgG/IgM",
        "ANTI-HAV IgG HEPATITIS A",
        "ANTI-HAV IgM HEPATITIS A",
        "ANTI-Hbc ANTICORE HEPATITIS B",
        "ANTI-Hbc IgM ANTICORE HEPATITIS B",
        "ANTI-Hbe",
        "ANTI-Hbs",
        "ANTI-HCV HEPATITIS C",
        "ANTICUERPOS ANTI JO-1",
        "ANTICUERPOS ANTI SM",
        "ANTICUERPOS ANTI SSA (RO)",
        "ANTICUERPOS ANTI SSB (LA)",
        "ANTICUERPOS ANTI-ANTINUCLEARES (ANA)",
        "ANTICUERPOS ANTI-CARDIOLIPINAS IgG",
        "ANTICUERPOS ANTI-CARDIOLIPINAS IgM",
        "ANTICUERPOS ANTI-DNA",
        "ANTICUERPOS ANTI-MICROSOMALES",
        "ANTICUERPOS ANTI-RNP",
        "ANTICUERPOS ANTI-TIROGLOBULINICOS",
        "ANTICUERPOS ANTI-TIROIDEOS (ATT)",
        "ANTICUERPOS ANTI-TOXOPLASMA IgG",
        "ANTICUERPOS ANTI-TOXOPLASMA IgM",
        "ANTICUERPOS EPSTEIN BARR IgG",
        "ANTICUERPOS EPSTEIN BARR IgM",
        "ANTIESTREPTOLISINA O (ASTO)",
        "ANTIGENO DE SUPERFICIO HEPATITIS B",
        "AsBe ANTIGENO E HEPATITIS B",
        "CELULAS L.E.",
        "CHAGAS",
        "CITOMEGALOVIRUS Ig G",
        "CITOMEGALOVIRUS Ig M",
        "COMPLEMENTO C3",
        "COMPLEMENTO C4",
        "COMPLEMENTO CH-50",
        "CRIOAGLUTININAS",
        "CRIOGLOBULINAS"
    ]
}, {
    "name": "General",
    "services": [
        "Uroanálisis",
        "Coproanálisis"
    ]
}]
