{
  "name": "@brewen.dev/front-e2e",
  "$schema": "../../../node_modules/nx/schemas/project-schema.json",
  "sourceRoot": "apps/front/e2e/src",
  "projectType": "application",
  "targets": {
    "e2e": {
      "executor": "@nx/cypress:cypress",
      "options": {
        "cypressConfig": "apps/front/e2e/cypress.config.ts",
        "devServerTarget": "@brewen.dev/front:serve:development",
        "testingType": "e2e"
      },
      "configurations": {
        "production": {
          "devServerTarget": "@brewen.dev/front:serve:production"
        },
        "ci": {
          "devServerTarget": "@brewen.dev/front:serve-static"
        }
      }
    },
    "lint": {
      "executor": "@nx/linter:eslint",
      "outputs": ["{options.outputFile}"],
      "options": {
        "lintFilePatterns": ["apps/front/e2e/**/*.{js,ts}"]
      }
    }
  },
  "tags": [],
  "implicitDependencies": ["@brewen.dev/front"]
}
