<?xml version="1.0" encoding="UTF-8" standalone="no"?>
<!-- Created with Inkscape (http://www.inkscape.org/) -->

<svg
   width="1180"
   height="1180"
   viewBox="0 0 312.20833 312.20833"
   version="1.1"
   id="svg23754"
   xmlns="http://www.w3.org/2000/svg"
   xmlns:svg="http://www.w3.org/2000/svg">
  <defs
     id="defs23751" />
  <g
     id="layer1"
     transform="translate(-15.675568,66.157712)"
     style="opacity:0.18567386">
    <g
       id="g2311"
       transform="matrix(4.5622454,0,0,4.5621863,11538.845,-12410.623)">
      <path
         id="path2025"
         style="fill:#162d50;stroke-width:0.0310532"
         d="m -2514.765,2719.0398 a 31.318387,31.318387 0 0 0 -1.2842,1.5244 l 4.6229,6.9048 a 23.519992,23.519992 0 0 0 -3.0526,7.4022 l -8.1869,1.6205 a 31.318387,31.318387 0 0 0 0,7.0959 l 8.1868,1.6206 a 23.519992,23.519992 0 0 0 3.0526,7.4021 l -4.6229,6.9048 a 31.318387,31.318387 0 0 0 2.3533,2.67 31.318387,31.318387 0 0 0 2.67,2.3533 l 6.9046,-4.623 a 23.519992,23.519992 0 0 0 7.4022,3.0526 l 1.6207,8.1869 a 31.318387,31.318387 0 0 0 7.0957,-1e-4 l 1.6208,-8.1869 a 23.519992,23.519992 0 0 0 7.4022,-3.0524 l 6.9045,4.6228 a 31.318387,31.318387 0 0 0 1.5246,-1.2843 l -10.2416,-10.2415 a 16.868421,16.868421 0 0 1 -22.6861,-1.0451 16.868421,16.868421 0 0 1 -1.0451,-22.6862 z" />
      <path
         id="path2027"
         style="fill:#209cdf;fill-opacity:1;stroke-width:0.0310532"
         d="m -2512.5565,2716.8192 10.2475,10.2475 a 16.868421,16.868421 0 0 1 22.686,1.0452 16.868421,16.868421 0 0 1 1.0538,22.6946 l 10.233,10.233 a 31.318387,31.318387 0 0 0 1.2843,-1.5247 l -4.6228,-6.9044 a 23.519992,23.519992 0 0 0 3.0525,-7.4023 l 8.1867,-1.6205 a 31.318387,31.318387 0 0 0 2e-4,-7.0959 l -8.1869,-1.6205 a 23.519992,23.519992 0 0 0 -3.0527,-7.4023 l 4.623,-6.9046 a 31.318387,31.318387 0 0 0 -2.3533,-2.6701 31.318387,31.318387 0 0 0 -2.6533,-2.3645 l -6.9208,4.6336 a 23.519992,23.519992 0 0 0 -7.4061,-3.0687 l -1.6175,-8.1711 a 31.318387,31.318387 0 0 0 -7.0954,2e-4 l -1.6175,8.1708 a 23.519992,23.519992 0 0 0 -7.4061,3.0689 l -6.9208,-4.6337 a 31.318387,31.318387 0 0 0 -1.5138,1.2895 z" />
    </g>
  </g>
</svg>
