[gd_scene load_steps=6 format=3 uid="uid://1otp0gf2mew7"]

[ext_resource type="Texture2D" uid="uid://b3156t6en0ix0" path="res://icon.png" id="1"]
[ext_resource type="Script" path="res://game.gd" id="2"]
[ext_resource type="Script" path="res://icon.gd" id="3"]

[sub_resource type="Curve" id="Curve_v6t7u"]
_data = [Vector2(0, 0.515789), 0.0, 0.0, 0, 0, Vector2(1, 1), 0.0, 0.0, 0, 0]
point_count = 2

[sub_resource type="Gradient" id="Gradient_1nep3"]
offsets = PackedFloat32Array(0.0123457, 0.540123, 0.935185, 1)
colors = PackedColorArray(0.757918, 0.899565, 1, 1, 0, 0, 1, 1, 0.878431, 0, 0, 1, 0.878431, 0, 0, 0)

[node name="Node2D" type="Node2D"]
script = ExtResource("2")

[node name="Polygon2D" type="Polygon2D" parent="."]
color = Color(0, 0, 0, 1)
polygon = PackedVector2Array(256, 224, 0, 224, 0, 0, 256, 0)

[node name="CPUParticles2D" type="CPUParticles2D" parent="."]
position = Vector2(128, 112)
amount = 351
randomness = 1.0
spread = 180.0
gravity = Vector2(0, 0)
initial_velocity_min = 102.7
initial_velocity_max = 106.41
scale_amount_max = 3.0
scale_amount_curve = SubResource("Curve_v6t7u")
color_ramp = SubResource("Gradient_1nep3")

[node name="Icon" type="Sprite2D" parent="."]
position = Vector2(128, 112)
texture = ExtResource("1")
script = ExtResource("3")
