ZNACKA,MODEL,VERZE,IDVERZE,CENAZANOVY,Cena s DPH,,,,
Porsche,Cayenne Coupe '20 5 dv. SUV,2.9 S Tiptronic Coupé,200351,2222314.05,,,,,
Porsche,718 '19 2 dv. cabrio,2.0 Boxster,195787,1355371.9,,,,,
Porsche,911 VII '18 2 dv. cabrio,3.0 Carrera GTS Cabriolet,169161,3165289.26,,,,,
Porsche,911 VIII '20 2 dv. cabrio,3.0 Carrera Cabriolet,200415,2652066.12,,,,,
