[{
  "segments": [
    {
      "x0": null,
      "x1": null,
      "top": null,
      "bottom": null,
      "shape": [1, 3],
      "lines": [{
          "x0": null,
          "x1": null,
          "top": null,
          "bottom": null,
          "terms": [{
            "x0": null,
            "x1": null,
            "top": null,
            "bottom": null,
            "type": "text",
            "text": "1000,0 Kč",
            "words": []
          }]
        },
        {
          "x0": null,
          "x1": null,
          "top": null,
          "bottom": null,
          "terms": [{
            "x0": null,
            "x1": null,
            "top": null,
            "bottom": null,
            "type": "text",
            "text": "1000,--",
            "words": []
          }]
        },
        {
          "x0": null,
          "x1": null,
          "top": null,
          "bottom": null,
          "terms": [{
            "x0": null,
            "x1": null,
            "top": null,
            "bottom": null,
            "type": "text",
            "text": "1000.00",
            "words": []
          }]
        }]
    },
    {
      "x0": null,
      "x1": null,
      "top": null,
      "bottom": null,
      "shape": [1, 1],
      "lines": [{
        "x0": null,
        "x1": null,
        "top": null,
        "bottom": null,
        "terms": [{
          "x0": null,
          "x1": null,
          "top": null,
          "bottom": null,
          "type": "text",
          "text": "180 00 Praha 4",
          "words": []
        }]
      }]
    }
  ]
}]
