[
  {
    "segments": [
      {
        "x0": null,
        "x1": null,
        "top": null,
        "bottom": null,
        "shape": [4, 1],
        "lines": [
          {
            "x0": null,
            "x1": null,
            "top": null,
            "bottom": null,
            "terms": [{
              "x0": null,
              "x1": null,
              "top": null,
              "bottom": null,
              "type": "text",
              "text": "vertical even1 jméno:",
              "words": []
            }]
          },
          {
            "x0": null,
            "x1": null,
            "top": null,
            "bottom": null,
            "terms": [{
              "x0": null,
              "x1": null,
              "top": null,
              "bottom": null,
              "type": "text",
              "text": "vertical even1 value",
              "words": []
            }]
          },
          {
            "x0": null,
            "x1": null,
            "top": null,
            "bottom": null,
            "terms": [{
              "x0": null,
              "x1": null,
              "top": null,
              "bottom": null,
              "type": "text",
              "text": "vertical even2 key:",
              "words": []
            }]
          },
          {
            "x0": null,
            "x1": null,
            "top": null,
            "bottom": null,
            "terms": [{
              "x0": null,
              "x1": null,
              "top": null,
              "bottom": null,
              "type": "text",
              "text": "vertical even2 value",
              "words": []
            }]
          }
        ]
      },
      {
        "x0": null,
        "x1": null,
        "top": null,
        "bottom": null,
        "shape": [3, 1],
        "lines": [
          {
            "x0": null,
            "x1": null,
            "top": null,
            "bottom": null,
            "terms": [{
              "x0": null,
              "x1": null,
              "top": null,
              "bottom": null,
              "type": "text",
              "text": "vertical odd1 jméno:",
              "words": []
            }]
          },
          {
            "x0": null,
            "x1": null,
            "top": null,
            "bottom": null,
            "terms": [{
              "x0": null,
              "x1": null,
              "top": null,
              "bottom": null,
              "type": "text",
              "text": "vertical odd1 value",
              "words": []
            }]
          },
          {
            "x0": null,
            "x1": null,
            "top": null,
            "bottom": null,
            "terms": [{
              "x0": null,
              "x1": null,
              "top": null,
              "bottom": null,
              "type": "text",
              "text": "vertical odd2 kitty:",
              "words": []
            }]
          }
        ]
      }
    ]
  }
]
