{"applicationID":"30","applicationName":"Application_MKR_1300","deviceName":"MKR1300_1","devEUI":"a8610a3432227205","rxInfo":[{"gatewayID":"b827ebfffe0cbdc2","name":"lorabox04","time":"2019-05-16T11:48:28.386524Z","rssi":-118,"loRaSNR":-10.2,"location":{"latitude":48.52574,"longitude":7.73782,"altitude":160}}],"txInfo":{"frequency":868300000,"dr":0},"adr":true,"fCnt":0,"fPort":2,"data":"AWg2AmcA+g==","object":{"temperatureSensor":{"2":25},"humiditySensor":{"1":27}}}


