<!-- Generated by IcoMoon.io -->
<svg version="1.1" xmlns="http://www.w3.org/2000/svg" width="50" height="50" viewBox="0 0 50 50">
<title>chevron-right</title>
<path fill="#fff" d="M20.223 38.973l12.5-12.5c0.815-0.815 0.815-2.133 0-2.946l-12.5-12.5c-0.815-0.815-2.133-0.815-2.946 0s-0.815 2.133 0 2.946l11.027 11.027-11.027 11.027c-0.815 0.815-0.815 2.133 0 2.946s2.133 0.815 2.946 0z"></path>
</svg>
