{
  "title": "CredentialsFile",
  "description": "Credentials file data model",
  "type": "object",
  "properties": {
    "kind": {
      "title": "Kind",
      "enum": [
        "Credentials"
      ],
      "type": "string"
    },
    "metadata": {
      "title": "Metadata",
      "description": "Metadata for the file",
      "allOf": [
        {
          "$ref": "#/definitions/HopprMetadata"
        }
      ]
    },
    "schemaVersion": {
      "title": "Schema Version",
      "default": "v1",
      "type": "string"
    },
    "credential_required_services": {
      "title": "Credential Required Services",
      "description": "List of CredentialRequiredService objects to provide authentication to remote repositories and/or registries",
      "default": [],
      "uniqueItems": true,
      "type": "array",
      "items": {
        "$ref": "#/definitions/CredentialRequiredService"
      }
    }
  },
  "required": [
    "kind"
  ],
  "additionalProperties": false,
  "definitions": {
    "HopprMetadata": {
      "title": "HopprMetadata",
      "description": "Metadata data model",
      "type": "object",
      "properties": {
        "name": {
          "title": "Name",
          "type": "string"
        },
        "version": {
          "title": "Version",
          "anyOf": [
            {
              "type": "string"
            },
            {
              "type": "integer"
            }
          ]
        },
        "description": {
          "title": "Description",
          "type": "string"
        }
      },
      "required": [
        "name",
        "version",
        "description"
      ]
    },
    "CredentialRequiredService": {
      "title": "CredentialRequiredService",
      "description": "CredentialRequiredService data model",
      "type": "object",
      "properties": {
        "url": {
          "title": "Url",
          "type": "string"
        },
        "user_env": {
          "title": "User Env",
          "type": "string"
        },
        "pass_env": {
          "title": "Pass Env",
          "type": "string"
        },
        "user": {
          "title": "User",
          "type": "string"
        },
        "password": {
          "title": "Password",
          "anyOf": [
            {
              "type": "string"
            },
            {
              "type": "string",
              "writeOnly": true,
              "format": "password"
            }
          ]
        }
      },
      "required": [
        "url",
        "pass_env",
        "user"
      ],
      "additionalProperties": false
    }
  }
}