<?xml version="1.0" standalone="no"?>
<!DOCTYPE svg PUBLIC "-//W3C//DTD SVG 20010904//EN"
 "http://www.w3.org/TR/2001/REC-SVG-20010904/DTD/svg10.dtd">
<svg version="1.0" xmlns="http://www.w3.org/2000/svg"
 width="700.000000pt" height="700.000000pt" viewBox="0 0 700.000000 700.000000"
 preserveAspectRatio="xMidYMid meet">
<metadata>
Created by potrace 1.11, written by Peter Selinger 2001-2013
</metadata>
<g transform="translate(0.000000,700.000000) scale(0.100000,-0.100000)"
fill="#000000" stroke="none">
<path d="M3497 6854 c-1 -1 -42 -4 -92 -8 -96 -6 -135 -11 -230 -26 -102 -17
-117 -20 -215 -45 -365 -93 -712 -274 -998 -520 -119 -102 -261 -249 -326
-335 -22 -30 -46 -59 -53 -65 -27 -24 -171 -256 -233 -378 -105 -206 -191
-456 -225 -660 -3 -18 -8 -39 -10 -47 -2 -8 -7 -40 -11 -70 -3 -30 -10 -82
-14 -115 -19 -159 -2 -547 30 -682 5 -22 13 -58 16 -80 9 -58 70 -262 103
-348 29 -75 29 -76 11 -113 -37 -77 -101 -289 -126 -417 -2 -11 -8 -42 -13
-70 -20 -104 -24 -145 -26 -315 -2 -193 11 -329 51 -509 133 -596 463 -1109
949 -1472 337 -253 809 -434 1215 -466 149 -12 424 -6 515 11 11 2 43 7 70 10
66 9 275 60 367 90 171 56 365 146 524 242 117 71 152 96 336 245 19 14 16 19
-69 105 -49 49 -147 160 -217 247 -70 86 -131 157 -136 157 -5 0 -13 -6 -17
-13 -12 -18 -137 -128 -183 -159 -92 -65 -172 -114 -238 -147 -140 -70 -353
-141 -471 -157 -25 -3 -48 -8 -52 -9 -3 -2 -39 -7 -80 -11 -134 -14 -378 -8
-469 11 -14 3 -41 8 -60 11 -52 8 -202 51 -275 79 -403 151 -750 486 -929 895
-58 132 -104 278 -122 390 -2 14 -6 34 -9 46 -17 77 -28 445 -13 459 3 3 32
-21 64 -53 76 -75 188 -170 278 -236 696 -509 1577 -628 2366 -319 328 129
611 313 866 568 215 213 343 388 480 652 110 211 211 524 240 738 3 28 8 53
10 56 7 11 18 219 18 334 -1 114 -10 277 -19 320 -3 11 -7 38 -10 60 -26 184
-95 421 -177 610 -286 656 -844 1164 -1523 1387 -81 26 -220 63 -285 74 -14 2
-47 9 -75 14 -107 19 -234 30 -393 34 -62 1 -114 1 -115 0z m258 -738 c148
-13 258 -37 405 -86 482 -160 872 -521 1066 -986 44 -107 84 -232 97 -304 3
-14 8 -36 11 -50 19 -82 29 -195 30 -335 0 -161 -8 -239 -48 -440 -24 -121
-124 -361 -211 -505 -137 -229 -383 -474 -605 -604 -252 -148 -480 -223 -790
-261 -137 -16 -342 -2 -515 36 -445 99 -825 358 -1086 741 -22 31 -39 64 -39
72 0 33 190 255 305 356 121 105 260 204 364 258 93 49 219 94 291 105 19 3
46 8 60 11 140 29 362 30 490 2 203 -45 334 -115 494 -266 88 -83 172 -221
191 -315 15 -76 23 -131 19 -137 -2 -4 0 -9 5 -12 11 -7 99 83 164 170 121
160 194 358 211 565 5 64 4 67 -27 101 -18 19 -57 61 -87 94 -220 241 -644
443 -1005 480 -22 2 -58 7 -80 10 -86 13 -329 6 -430 -12 -16 -3 -39 -7 -50
-9 -88 -13 -158 -30 -279 -70 -60 -19 -117 -35 -126 -35 -9 0 -42 -16 -74 -35
-32 -19 -60 -35 -62 -35 -11 0 -214 -123 -291 -176 -83 -58 -252 -191 -278
-218 -5 -6 -23 -22 -39 -36 l-28 -25 5 180 c3 99 7 191 10 205 2 14 8 48 12
75 4 28 14 77 22 110 8 33 16 67 18 75 15 64 83 239 130 332 235 464 651 800
1145 927 112 28 139 33 265 47 33 3 61 7 62 8 5 4 210 -2 278 -8z"/>
</g>
</svg>
