%YAML 1.1
%TAG !u! tag:unity3d.com,2011:
--- !u!21 &2100000
Material:
  serializedVersion: 6
  m_ObjectHideFlags: 0
  m_CorrespondingSourceObject: {fileID: 0}
  m_PrefabInstance: {fileID: 0}
  m_PrefabAsset: {fileID: 0}
  m_Name: Sprites_Glitch_VFX_enemies
  m_Shader: {fileID: 4800000, guid: 67fb0b6d96bb4394db5ef367676c4815, type: 3}
  m_ShaderKeywords: PIXELSNAP_ON _COLORGLITCHON_ON _DISPGLITCHON_ON
  m_LightmapFlags: 4
  m_EnableInstancingVariants: 0
  m_DoubleSidedGI: 0
  m_CustomRenderQueue: -1
  stringTagMap: {}
  disabledShaderPasses: []
  m_SavedProperties:
    serializedVersion: 3
    m_TexEnvs:
    - _MainTex:
        m_Texture: {fileID: 2800000, guid: 86adae1101d6ca345a35c15f25732b23, type: 3}
        m_Scale: {x: 1, y: 1}
        m_Offset: {x: 0, y: 0}
    m_Floats:
    - PixelSnap: 1
    - _ColorGlitchOn: 1
    - _ColorIntensity: 0.33
    - _ColorProbability: 0.27
    - _DispGlitchOn: 1
    - _DispIntensity: 0.57
    - _DispProbability: 0.08
    - _GlitchInterval: 0.002
    - _WrapDispCoords: 0
    m_Colors:
    - _Color: {r: 1, g: 1, b: 1, a: 1}
  m_BuildTextureStacks: []
