%YAML 1.1
%TAG !u! tag:unity3d.com,2011:
--- !u!21 &2100000
Material:
  serializedVersion: 6
  m_ObjectHideFlags: 0
  m_CorrespondingSourceObject: {fileID: 0}
  m_PrefabInstance: {fileID: 0}
  m_PrefabAsset: {fileID: 0}
  m_Name: Custom_CrystalShineGrabPassSingleRimVertexShadows
  m_Shader: {fileID: 4800000, guid: 982a87c3ef5477244997c911e47c9b18, type: 3}
  m_ShaderKeywords: 
  m_LightmapFlags: 4
  m_EnableInstancingVariants: 0
  m_DoubleSidedGI: 0
  m_CustomRenderQueue: -1
  stringTagMap: {}
  disabledShaderPasses: []
  m_SavedProperties:
    serializedVersion: 3
    m_TexEnvs:
    - _AlphaTex:
        m_Texture: {fileID: 2800000, guid: c9286794140a5c845960f5e68258ab0d, type: 3}
        m_Scale: {x: 1, y: 1}
        m_Offset: {x: 0, y: 0}
    - _MainTex:
        m_Texture: {fileID: 0}
        m_Scale: {x: 1, y: 1}
        m_Offset: {x: 0, y: 0}
    - _ShineTex:
        m_Texture: {fileID: 2800000, guid: 1a0a161e26366274f9d3022dd2964776, type: 3}
        m_Scale: {x: 1, y: 1}
        m_Offset: {x: 0, y: 0}
    m_Floats:
    - _Distorsion: 0.1
    - _FresnelPower: 2.43
    - _FresnelWeight: 2.68
    - _ShineStrength: 0.583
    m_Colors:
    - _Color: {r: 1, g: 0, b: 0.90588236, a: 1}
    - _FresnelCol: {r: 1, g: 1, b: 1, a: 1}
  m_BuildTextureStacks: []
