Division,WeightClassKg,Place,Name,Team,BodyweightKg,Best3SquatKg,Best3BenchKg,Best3DeadliftKg,TotalKg,Equipment,Event,Sex
Boys,55.79,1,Jason Ayers,Lampasas,51.72,136.08,74.84,158.76,369.68,Single-ply,SBD,M
Boys,51.71,2,Wrenn Bagley,Salado,51.3,111.13,65.77,133.81,310.71,Single-ply,SBD,M
Boys,51.71,3,Cj Gloria,Marble Falls,50.37,113.4,63.5,131.54,308.44,Single-ply,SBD,M
Boys,51.71,4,Cesar Montano,Stephenville,49.94,111.13,72.57,106.59,290.3,Single-ply,SBD,M
Boys,51.71,5,Robert Zapata,Sonora,49.9,97.52,56.7,124.74,278.96,Single-ply,SBD,M
Boys,51.71,6,Caleb Ritchey,Sonora,47.64,68.04,45.36,95.25,208.65,Single-ply,SBD,M
Boys,51.71,DQ,Brian Elliston,Brady,51.35,99.79,54.43,,,Single-ply,SBD,M
Boys,55.79,1,Daniel Rosales,San Saba,54.88,113.4,72.57,156.49,342.46,Single-ply,SBD,M
Boys,55.79,2,Dakota Cavazos,Lampasas,55.38,127.01,79.38,129.27,335.66,Single-ply,SBD,M
Boys,55.79,3,Henry Ramos,Sonora,55.35,122.47,70.31,136.08,328.85,Single-ply,SBD,M
Boys,55.79,4,Tye'Rus Jones,Brownwood,52.62,117.93,68.04,136.08,322.05,Single-ply,SBD,M
Boys,55.79,5,Jacob Delafuente,Brady,54.43,115.67,70.31,136.08,322.05,Single-ply,SBD,M
Boys,55.79,6,Payton Johnson #1,San Saba,52.21,115.67,70.31,131.54,317.51,Single-ply,SBD,M
Boys,55.79,7,Garrett Schwertner,Brady,52.62,90.72,52.16,124.74,267.62,Single-ply,SBD,M
Boys,55.79,8,Jordin Belmarez,Burnet,53.99,95.25,47.63,92.99,235.87,Single-ply,SBD,M
Boys,55.79,DQ,Lucas Diaz,Santa Anna,55.43,,,,,Single-ply,SBD,M
Boys,55.79,DQ,Chase Harwell,Salado,54.44,,,,,Single-ply,SBD,M
Boys,55.79,DQ,Johnathan Flores,Lampasas,53.12,124.74,86.18,,,Single-ply,SBD,M
Boys,59.87,DQ,Gabriel Spikes,Lago Vista,55.83,,,,,Single-ply,SBD,M
Boys,59.87,1,Dalton Dewveall,Llano,59.47,154.22,90.72,161.03,405.97,Single-ply,SBD,M
Boys,59.87,2,Keith Ray,Stephenville,59.01,142.88,81.65,142.88,367.41,Single-ply,SBD,M
Boys,59.87,3,Anthony Montes,Lampasas,58.55,131.54,83.91,147.42,362.87,Single-ply,SBD,M
Boys,59.87,4,Cutter Hudgens,Salado,56.25,108.86,58.97,142.88,310.71,Single-ply,SBD,M
Boys,59.87,5,Jose Briggs,Burnet,57.7,99.79,58.97,136.08,294.84,Single-ply,SBD,M
Boys,59.87,6,Reese Haile,Hamilton,57.2,61.23,43.09,70.31,174.63,Single-ply,SBD,M
Boys,59.87,DQ,Noah McVicker,Lago Vista,58.06,,,,,Single-ply,SBD,M
Boys,59.87,DQ,Connor Reighley,Lago Vista,59.47,,,,,Single-ply,SBD,M
Boys,67.13,1,Christian Rodriques,Llano,66.72,188.24,113.4,183.7,485.34,Single-ply,SBD,M
Boys,67.13,2,Kevin Martinez,Sonora,65.81,172.37,95.25,185.97,453.59,Single-ply,SBD,M
Boys,67.13,3,Dorian Jimenez,Brady,64.68,170.1,90.72,188.24,449.06,Single-ply,SBD,M
Boys,67.13,4,John Heflin,Llano,65.32,174.63,90.72,167.83,433.18,Single-ply,SBD,M
Boys,74.84,5,Brent Greenwood,Llano,67.14,167.83,104.33,138.35,410.5,Single-ply,SBD,M
Boys,67.13,6,Parker Plumley,Junction,61.26,151.95,88.45,167.83,408.23,Single-ply,SBD,M
Boys,67.13,7,John Watson,San Saba,65.68,142.88,81.65,181.44,405.97,Single-ply,SBD,M
Boys,67.13,8,Danny Perez,Junction,66.27,138.35,95.25,158.76,392.36,Single-ply,SBD,M
Boys,67.13,9,Shiloh Fraughton,Lampasas,63.51,145.15,77.11,131.54,353.8,Single-ply,SBD,M
Boys,67.13,10,Chance Goodgion,Brownwood,65.36,111.13,65.77,142.88,319.78,Single-ply,SBD,M
Boys,67.13,11,Austin Rosales,Coleman,66.27,102.06,70.31,136.08,308.44,Single-ply,SBD,M
Boys,67.13,12,Juan Tovias,San Saba,65.78,99.79,72.57,113.4,285.76,Single-ply,SBD,M
Boys,74.84,13,Eric Davilla,San Saba,67.18,74.84,52.16,70.31,197.31,Single-ply,SBD,M
Boys,67.13,DQ,Cade Depoy,Salado,64.9,136.08,,,,Single-ply,SBD,M
Boys,67.13,DQ,Brandon Epers,Marble Falls,61.72,108.86,,,,Single-ply,SBD,M
Boys,67.13,DQ,Gino Morris,Coleman,64.46,131.54,,,,Single-ply,SBD,M
Boys,67.13,DQ,Nathan Briley,Gordon,61.24,,,,,Single-ply,SBD,M
Boys,67.13,DQ,Eloy Castillo,Brownwood,61.7,122.47,,,,Single-ply,SBD,M
Boys,67.13,DQ,Patrick Nash,Brownwood,65.78,129.27,79.38,,,Single-ply,SBD,M
Boys,67.13,DQ,Rico Rodriquez,Sonora,60.37,,,,,Single-ply,SBD,M
Boys,74.84,1,Trevor Penny,Llano,70.35,185.97,111.13,199.58,496.68,Single-ply,SBD,M
Boys,74.84,2,Ryan Hill #1,Lago Vista,70.81,201.85,111.13,170.1,483.08,Single-ply,SBD,M
Boys,82.1,3,Brock Foster,Burnet,74.89,170.1,106.59,204.12,480.81,Single-ply,SBD,M
Boys,74.84,4,Mark DeLeon,Brady,70.13,176.9,113.4,188.24,478.54,Single-ply,SBD,M
Boys,82.1,5,Tyler Stairs,Salado,74.85,188.24,102.06,179.17,469.47,Single-ply,SBD,M
Boys,74.84,6,Isaac Fraire,Sonora,73.07,185.97,104.33,172.37,462.66,Single-ply,SBD,M
Boys,74.84,7,Coby Chambliss,Salado,70.17,183.7,102.06,170.1,455.86,Single-ply,SBD,M
Boys,82.1,8,Imanol Martinez,Brady,74.93,176.9,83.91,188.24,449.06,Single-ply,SBD,M
Boys,74.84,9,Mason Greenwood,Llano,72.17,158.76,108.86,163.29,430.91,Single-ply,SBD,M
Boys,74.84,10,Nathan Keese,Lampasas,69.44,158.76,95.25,158.76,412.77,Single-ply,SBD,M
Boys,74.84,11,Jarron Kirklin,Brady,69.4,147.42,81.65,179.17,408.23,Single-ply,SBD,M
Boys,74.84,12,Abram Ruiz,Brady,74.48,142.88,72.57,176.9,392.36,Single-ply,SBD,M
Boys,74.84,13,Martin Najera,Hamilton,71.21,147.42,83.91,158.76,390.09,Single-ply,SBD,M
Boys,74.84,14,Jacob Herrod,Santa Anna,70.76,149.69,83.91,149.69,383.29,Single-ply,SBD,M
Boys,74.84,15,Stone Sealy,San Saba,70.81,131.54,79.38,170.1,381.02,Single-ply,SBD,M
Boys,74.84,16,Gabe Torres,Marble Falls,72.17,136.08,97.52,145.15,378.75,Single-ply,SBD,M
Boys,74.84,17,Cooper Womack,Salado,74.39,151.95,68.04,158.76,378.75,Single-ply,SBD,M
Boys,74.84,18,Michael Nguyen #15,Lampasas,72.17,142.88,68.04,163.29,374.21,Single-ply,SBD,M
Boys,74.84,19,Moe Bryson,Lago Vista,69.44,136.08,70.31,163.29,369.68,Single-ply,SBD,M
Boys,74.84,20,Mark Chavez,Sonora,72.12,136.08,86.18,142.88,365.14,Single-ply,SBD,M
Boys,74.84,21,Caleb Wagner,Hamilton,69.44,111.13,52.16,113.4,276.69,Single-ply,SBD,M
Boys,74.84,22,Cole Tupia,San Saba,72.62,81.65,56.7,90.72,229.06,Single-ply,SBD,M
Boys,74.84,DQ,Kaden Trice,Salado,68.99,183.7,,,,Single-ply,SBD,M
Boys,74.84,DQ,Jacob Metcalf,Marble Falls,71.23,158.76,,,,Single-ply,SBD,M
Boys,74.84,DQ,Dakota Pratt,Burnet,72.12,129.27,,,,Single-ply,SBD,M
Boys,74.84,DQ,Jacob Carpeno,Lago Vista,73.52,,,,,Single-ply,SBD,M
Boys,82.1,DQ,Joe Torres #6,Brady,75.02,142.88,,,,Single-ply,SBD,M
Boys,82.1,1,Chase Mackey,Gordon,80.38,208.65,111.13,229.06,548.85,Single-ply,SBD,M
Boys,82.1,2,Drake Hall,Burnet,79.38,185.97,127.01,190.51,503.49,Single-ply,SBD,M
Boys,89.81,3,Javier Hernandez,Brady,82.28,185.97,106.59,210.92,503.49,Single-ply,SBD,M
Boys,82.1,4,Jace Hankins,Lampasas,80.78,181.44,117.93,199.58,498.95,Single-ply,SBD,M
Boys,82.1,5,Hayden Ebeling,Salado,81.2,174.63,111.13,208.65,494.42,Single-ply,SBD,M
Boys,82.1,6,Mason Campbell,Burnet,78.11,181.44,102.06,190.51,474,Single-ply,SBD,M
Boys,82.1,7,Zac Menkin,Lago Vista,80.3,165.56,102.06,188.24,455.86,Single-ply,SBD,M
Boys,82.1,8,Chase Walston,Brady,76.2,167.83,117.93,158.76,444.52,Single-ply,SBD,M
Boys,82.1,9,Bradley Yarbrough,Salado,79.39,174.63,92.99,170.1,437.72,Single-ply,SBD,M
Boys,82.1,10,Aubrey Bucholz,Brady,81.19,163.29,104.33,170.1,437.72,Single-ply,SBD,M
Boys,82.1,11,Ben Walling,Llano,81.22,147.42,81.65,176.9,405.97,Single-ply,SBD,M
Boys,82.1,12,Seth Cozby,Marble Falls,78.03,163.29,88.45,149.69,401.43,Single-ply,SBD,M
Boys,82.1,13,John Berry #3,Brady,79.83,129.27,81.65,145.15,356.07,Single-ply,SBD,M
Boys,82.1,14,Richard DeLaCruz,Sonora,79.42,136.08,56.7,154.22,347,Single-ply,SBD,M
Boys,82.1,15,Micah Trull,Brady,78.02,140.61,68.04,136.08,344.73,Single-ply,SBD,M
Boys,82.1,16,Branson Armstrong,Hamilton,76.7,136.08,65.77,124.74,326.59,Single-ply,SBD,M
Boys,82.1,17,Hunter Whaley,Stephenville,76.67,113.4,86.18,120.2,319.78,Single-ply,SBD,M
Boys,89.81,18,Kevin Lunsford,Brady,82.19,113.4,56.7,127.01,297.1,Single-ply,SBD,M
Boys,82.1,19,Josh Petty,Llano,75.34,99.79,70.31,122.47,292.57,Single-ply,SBD,M
Boys,82.1,20,Wyatt Catoe,Hamilton,76.67,106.59,70.31,113.4,290.3,Single-ply,SBD,M
Boys,82.1,21,Dakota Castro,Sonora,75.31,108.86,72.57,90.72,272.16,Single-ply,SBD,M
Boys,82.1,DQ,Ricky Sampson,Salado,75.3,,,,,Single-ply,SBD,M
Boys,89.81,1,Jared McHazlett,Burnet,89.04,226.8,117.93,235.87,580.6,Single-ply,SBD,M
Boys,89.81,2,Jerry Trejo,Brady,84.82,215.46,136.08,213.19,564.72,Single-ply,SBD,M
Boys,89.81,3,Lio Garcia,Stephenville,87.1,183.7,140.61,215.46,539.77,Single-ply,SBD,M
Boys,89.81,4,Isaiah Regeon,Brady,89.63,213.19,124.74,188.24,526.17,Single-ply,SBD,M
Boys,89.81,5,Cullen Ferrill,Burnet,86.18,210.92,113.4,199.58,523.9,Single-ply,SBD,M
Boys,89.81,6,Jesse Estrada,Brady,86.64,204.12,113.4,206.38,523.9,Single-ply,SBD,M
Boys,89.81,7,Devonte Evetts,Brownwood,88.95,170.1,127.01,208.65,505.76,Single-ply,SBD,M
Boys,89.81,8,Shay Tompkins,Brownwood,87.09,204.12,104.33,192.78,501.22,Single-ply,SBD,M
Boys,89.81,9,Cody Carrow,Lago Vista,87.59,183.7,140.61,174.63,498.95,Single-ply,SBD,M
Boys,89.81,10,James Nash,Brownwood,83.96,181.44,117.93,185.97,485.34,Single-ply,SBD,M
Boys,99.79,11,Russell Sweet,Lago Vista,89.86,172.37,106.59,172.37,451.32,Single-ply,SBD,M
Boys,89.81,12,Colin Mayne,Llano,87.14,170.1,106.59,158.76,435.45,Single-ply,SBD,M
Boys,89.81,13,Blake Carr,Lago Vista,89.36,170.1,104.33,161.03,435.45,Single-ply,SBD,M
Boys,89.81,14,Daven Manning,Marble Falls,88.04,154.22,108.86,154.22,417.3,Single-ply,SBD,M
Boys,89.81,15,Rieken Douglas,Stephenville,88.46,165.56,92.99,158.76,417.3,Single-ply,SBD,M
Boys,89.81,16,Josue Olvera,Stephenville,88.04,163.29,97.52,154.22,415.04,Single-ply,SBD,M
Boys,89.81,17,Kyle Builts,Coleman,85.77,154.22,83.91,161.03,399.16,Single-ply,SBD,M
Boys,89.81,18,Tristan Briggs,Burnet,89.36,140.61,95.25,158.76,394.63,Single-ply,SBD,M
Boys,89.81,19,Austin Davis,Burnet,82.55,136.08,72.57,172.37,381.02,Single-ply,SBD,M
Boys,89.81,20,Daniel Sparks,Marble Falls,82.59,142.88,79.38,154.22,376.48,Single-ply,SBD,M
Boys,89.81,21,Darren DiDinato,Lago Vista,83.94,115.67,81.65,124.74,322.05,Single-ply,SBD,M
Boys,89.81,DQ,Colen Cackburn,Lampasas,87.59,,,,,Single-ply,SBD,M
Boys,89.81,DQ,Gabe Kane,Salado,88.95,149.69,,,,Single-ply,SBD,M
Boys,89.81,DQ,Tate Hill,Salado,83.02,176.9,,,,Single-ply,SBD,M
Boys,89.81,DQ,Jason Flynn,Salado,85.28,,,,,Single-ply,SBD,M
Boys,89.81,DQ,Joe Ables,Coleman,87.13,,,,,Single-ply,SBD,M
Boys,89.81,DQ,Tanner Jump,Gordon,87.14,,,,,Single-ply,SBD,M
Boys,89.81,DQ,Christian Ramon,Sonora,82.6,,,,,Single-ply,SBD,M
Boys,89.81,DQ,Ragan Wood,Stephenville,85.77,226.8,61.23,,,Single-ply,SBD,M
Boys,99.79,1,Cj Camarillo,Brady,96.16,213.19,142.88,192.78,548.85,Single-ply,SBD,M
Boys,99.79,2,Adam Prado,Lampasas,99.38,215.46,140.61,183.7,539.77,Single-ply,SBD,M
Boys,99.79,3,Chris Carter #3,Marble Falls,94.82,204.12,129.27,170.1,503.49,Single-ply,SBD,M
Boys,99.79,4,Dakoda Trull,Llano,95.26,181.44,111.13,181.44,474,Single-ply,SBD,M
Boys,99.79,5,Michael Harris,Burnet,98.07,165.56,104.33,204.12,474,Single-ply,SBD,M
Boys,99.79,6,Noah Von Benzerath,Lampasas,93,181.44,99.79,181.44,462.66,Single-ply,SBD,M
Boys,99.79,7,Miguel Leon,Brady,92.99,147.42,122.47,163.29,433.18,Single-ply,SBD,M
Boys,99.79,8,Sam Johnson #4,Hamilton,94.8,142.88,77.11,142.88,362.87,Single-ply,SBD,M
Boys,99.79,DQ,Will Bridgwater,Hamilton,96.21,145.15,83.91,,,Single-ply,SBD,M
Boys,99.79,DQ,David Modesto,Junction,96.65,,,,,Single-ply,SBD,M
Boys,99.79,DQ,Ethan Reed #1,Marble Falls,92.12,142.88,,,,Single-ply,SBD,M
Boys,99.79,DQ,Lance Spakes,Salado,95.26,208.65,113.4,,,Single-ply,SBD,M
Boys,99.79,DQ,Conner Warmerdam,Stephenville,98.93,181.44,,,,Single-ply,SBD,M
Boys,109.77,1,Ryan Lewis,Brownwood,105.28,238.14,122.47,231.33,591.94,Single-ply,SBD,M
Boys,109.77,2,Jacob Martin,Stephenville,105.25,226.8,133.81,204.12,564.72,Single-ply,SBD,M
Boys,109.77,3,Anthony Hallmark,Marble Falls,103.89,204.12,115.67,195.04,514.83,Single-ply,SBD,M
Boys,109.77,4,Bryndon Robles,Sonora,109.36,199.58,142.88,172.37,514.83,Single-ply,SBD,M
Boys,109.77,5,Julian Guerra,Sonora,109.36,158.76,140.61,167.83,467.2,Single-ply,SBD,M
Boys,109.77,6,Rudy Cruz,Marble Falls,100.74,185.97,95.25,181.44,462.66,Single-ply,SBD,M
Boys,109.77,7,Dakota Taylor,Coleman,104.79,172.37,99.79,181.44,453.59,Single-ply,SBD,M
Boys,109.77,8,Alan Gold,Junction,109.77,181.44,120.2,149.69,451.32,Single-ply,SBD,M
Boys,109.77,9,Michael Patterson,Brady,104.78,131.54,81.65,140.61,353.8,Single-ply,SBD,M
Boys,109.77,DQ,Kirkland Weaver,Brady,108.05,,,,,Single-ply,SBD,M
Boys,109.77,DQ,Xavier Torres,Brady,108.41,,,,,Single-ply,SBD,M
Boys,109.77,DQ,Cody Wilson #6,Hamilton,100.29,142.88,,192.78,,Single-ply,SBD,M
Boys,109.77,DQ,Ethan Patlan,Sonora,104.79,226.8,170.1,,,Single-ply,SBD,M
Boys,124.74,1,Austin Northcutt,Stephenville,115.25,238.14,147.42,240.4,625.96,Single-ply,SBD,M
Boys,124.74,2,Elijah Cross,Sonora,110.27,235.87,154.22,213.19,603.28,Single-ply,SBD,M
Boys,124.74,3,Hayden Day,Brownwood,118.84,226.8,136.08,235.87,598.74,Single-ply,SBD,M
Boys,124.74,4,Juan Mungia,Llano,112.06,183.7,124.74,179.17,487.61,Single-ply,SBD,M
Boys,124.74,5,Matthew Downey,Marble Falls,116.17,188.24,92.99,183.7,464.93,Single-ply,SBD,M
Boys,124.74,6,Jacob Scott,Burnet,112.99,172.37,92.99,158.76,424.11,Single-ply,SBD,M
Boys,124.74,7,Kyle Krueger,Hamilton,116.17,156.49,86.18,136.08,378.75,Single-ply,SBD,M
Boys,124.74+,1,Jake Dibble,Lampasas,156.08,294.84,183.7,260.82,739.36,Single-ply,SBD,M
Boys,124.74+,2,Chris Nix,Lampasas,127.94,199.58,129.27,215.46,544.31,Single-ply,SBD,M
Boys,124.74+,3,Garrett Carlson,Llano,135.67,208.65,136.08,197.31,542.04,Single-ply,SBD,M
Boys,124.74+,4,Colton Center,Llano,129.28,190.51,120.2,204.12,514.83,Single-ply,SBD,M
Boys,124.74+,5,Jacob Lopez,Stephenville,136.53,206.38,106.59,197.31,510.29,Single-ply,SBD,M
Boys,124.74+,6,Michael Hall,Marble Falls,133.38,226.8,99.79,181.44,508.02,Single-ply,SBD,M
Boys,124.74+,7,Joseph Absher,Sonora,154.71,170.1,113.4,174.63,458.13,Single-ply,SBD,M
Boys,124.74+,8,Taydon Benson,Coleman,162.89,181.44,90.72,170.1,442.25,Single-ply,SBD,M
Boys,124.74+,DQ,Ray Kimbrell,Sonora,128.41,,,,,Single-ply,SBD,M
