Division,WeightClassKg,Place,Name,Team,BodyweightKg,Best3SquatKg,Best3BenchKg,Best3DeadliftKg,TotalKg,Equipment,Event,Sex,BirthDate
Boys,51.71,1,Jose Cuellar,Celina,51.71,142.88,102.06,142.88,387.82,Unlimited,SBD,M,
Boys,51.71,2,Brian Usrey,Bells,50.17,129.27,99.79,133.81,362.87,Unlimited,SBD,M,
Boys,51.71,3,Marcelo Patino,Frisco Emerson,50.53,120.2,68.04,117.93,306.17,Unlimited,SBD,M,
Boys,51.71,4,Cole Krouskup,Pilot Point,51.26,104.33,65.77,131.54,301.64,Unlimited,SBD,M,
Boys,51.71,5,Ian Yang,Prosper,49.8,104.33,56.7,108.86,269.89,Unlimited,SBD,M,
Boys,51.71,6,Jayden Matthews,Farmersville,48.35,99.79,58.97,104.33,263.08,Unlimited,SBD,M,
Boys,51.71,7,Evan Ewton,Denison,47.63,83.91,61.23,90.72,235.87,Unlimited,SBD,M,
Boys,51.71,8,Andre Nordie,Ponder,48.9,83.91,43.09,83.91,210.92,Unlimited,SBD,M,
Boys,51.71,DQ,Christian Southard,Aubrey,49.35,124.74,79.38,,,Unlimited,SBD,M,
Boys,55.79,1,Trey Shirey,Prosper,55.43,192.78,127.01,188.24,508.02,Unlimited,SBD,M,
Boys,55.79,2,Sebastian Ortega,Celeste,54.52,142.88,90.72,161.03,394.63,Unlimited,SBD,M,
Boys,55.79,3,Ryan Dearmond,Tom Bean,54.25,147.42,72.57,165.56,385.55,Unlimited,SBD,M,
Boys,55.79,4,Colby Murphey,Ponder,54.79,136.08,95.25,154.22,385.55,Unlimited,SBD,M,
Boys,55.79,5,Asher Apodaca,Little Elm,52.71,131.54,68.04,127.01,326.59,Unlimited,SBD,M,
Boys,55.79,6,Dominic Escalante,Pilot Point,55.79,117.93,72.57,136.08,326.59,Unlimited,SBD,M,
Boys,55.79,7,Seth Gallardo,Melissa,55.79,117.93,83.91,120.2,322.05,Unlimited,SBD,M,
Boys,55.79,8,Jayce Lehde,Sadler S & S Consolidated,54.88,111.13,61.23,111.13,283.5,Unlimited,SBD,M,
Boys,55.79,9,Connor Grady,Leonard,55.79,97.52,58.97,117.93,274.42,Unlimited,SBD,M,
Boys,55.79,10,Tommy Thomas,Bells,55.79,90.72,61.23,122.47,274.42,Unlimited,SBD,M,
Boys,59.87,1,Nick Michka,Celeste,59.33,179.17,124.74,185.97,489.88,Unlimited,SBD,M,
Boys,59.87,2,Daniel Ruiz,Tom Bean,59.87,165.56,86.18,197.31,449.06,Unlimited,SBD,M,
Boys,59.87,3,Conner Bakken,Farmersville,59.51,181.44,92.99,167.83,442.25,Unlimited,SBD,M,
Boys,59.87,4,Anthony Rosales,Princeton,59.15,165.56,95.25,170.1,430.91,Unlimited,SBD,M,
Boys,59.87,5,Jeremiah Dunn,Prosper,58.97,167.83,108.86,147.42,424.11,Unlimited,SBD,M,
Boys,59.87,6,Hayden Vo,Prosper Rock Hill,58.88,149.69,97.52,172.37,419.57,Unlimited,SBD,M,
Boys,59.87,7,Mathew Evans,Lucas Lovejoy,59.15,156.49,97.52,165.56,419.57,Unlimited,SBD,M,
Boys,59.87,8,Christian Phillips,Van Alstyne,59.51,151.95,102.06,158.76,412.77,Unlimited,SBD,M,
Boys,59.87,9,Ayush Mitra,Frisco Lebanon Trail,58.15,140.61,99.79,161.03,401.43,Unlimited,SBD,M,
Boys,59.87,10,Vivaan Sharma,Frisco,58.51,136.08,83.91,147.42,367.41,Unlimited,SBD,M,
Boys,59.87,11,Conner Peterson,Frisco Heritage,59.15,142.88,88.45,136.08,367.41,Unlimited,SBD,M,
Boys,59.87,12,Dylan Childs,Sherman,58.6,136.08,83.91,129.27,349.27,Unlimited,SBD,M,
Boys,59.87,13,Blaze Kinkade,Leonard,59.51,129.27,70.31,136.08,335.66,Unlimited,SBD,M,
Boys,59.87,14,Caden Murphy,Ponder,55.97,115.67,65.77,120.2,301.64,Unlimited,SBD,M,
Boys,59.87,15,Aiden Day,Melissa,56.34,102.06,70.31,115.67,288.03,Unlimited,SBD,M,
Boys,59.87,DQ,Sydney Robinson,Little Elm,57.7,95.25,,,,Unlimited,SBD,M,
Boys,59.87,DQ,Payton Hulett,Prosper,59.78,204.12,,,,Unlimited,SBD,M,
Boys,67.13,1,Emmanuel Martinez,Princeton,67.13,222.26,163.29,215.46,601.01,Unlimited,SBD,M,
Boys,67.13,2,Michael Lopez,Princeton,66.13,226.8,127.01,195.04,548.85,Unlimited,SBD,M,
Boys,67.13,3,Rafe McComack,Farmersville,64.23,199.58,142.88,204.12,546.58,Unlimited,SBD,M,
Boys,67.13,4,Nathan Haines,Prosper,66.22,199.58,129.27,201.85,530.7,Unlimited,SBD,M,
Boys,67.13,5,Zander Paton,Melissa,64.86,192.78,115.67,217.72,526.17,Unlimited,SBD,M,
Boys,67.13,6,Angelo Yeck,Prosper,66.77,190.51,142.88,183.7,517.1,Unlimited,SBD,M,
Boys,67.13,7,Tripp Ford,Celina,65.41,165.56,113.4,174.63,453.59,Unlimited,SBD,M,
Boys,67.13,8,Roman Lopez,Prosper Walnut Grove,66.59,161.03,108.86,170.1,439.98,Unlimited,SBD,M,
Boys,67.13,9,Luke Wymer,Leonard,66.95,179.17,102.06,149.69,430.91,Unlimited,SBD,M,
Boys,67.13,10,Case Carson,Van Alstyne,65.32,158.76,90.72,167.83,417.3,Unlimited,SBD,M,
Boys,67.13,11,Hamza Ali,Little Elm,65.95,129.27,111.13,172.37,412.77,Unlimited,SBD,M,
Boys,67.13,12,Nicolas Gennette,Farmersville,66.22,145.15,90.72,174.63,410.5,Unlimited,SBD,M,
Boys,67.13,13,Tyler Stuckey,Aubrey,59.92,142.88,104.33,147.42,394.63,Unlimited,SBD,M,
Boys,67.13,14,Diego Comer,Prosper Walnut Grove,63.23,136.08,95.25,154.22,385.55,Unlimited,SBD,M,
Boys,67.13,15,Urban Casper,Princeton,64.23,156.49,83.91,142.88,383.29,Unlimited,SBD,M,
Boys,67.13,16,Aaron Johnson,Leonard,64.59,147.42,79.38,142.88,369.68,Unlimited,SBD,M,
Boys,67.13,17,Jonah Lanz,Melissa,63.78,133.81,83.91,149.69,367.41,Unlimited,SBD,M,
Boys,67.13,18,Caleb Coleman,Van Alstyne,64.23,140.61,83.91,142.88,367.41,Unlimited,SBD,M,
Boys,67.13,19,Gabriel Méndez,Little Elm,64.68,124.74,83.91,149.69,358.34,Unlimited,SBD,M,
Boys,67.13,20,Jeremiah Robertson,North Crowley,60.87,147.42,79.38,124.74,351.53,Unlimited,SBD,M,
Boys,67.13,21,Eli Colunga,Bells,61.69,129.27,70.31,142.88,342.46,Unlimited,SBD,M,
Boys,67.13,22,Bradeon Williamson,Aubrey,64.23,124.74,68.04,138.35,331.12,Unlimited,SBD,M,
Boys,67.13,23,Izak Tumey,Tom Bean,66.13,124.74,63.5,142.88,331.12,Unlimited,SBD,M,
Boys,67.13,DQ,Jayden Vega,Sadler S & S Consolidated,67.13,142.88,,,,Unlimited,SBD,M,
Boys,67.13,DQ,Evan Rodgers,Celina,66.22,206.38,,,,Unlimited,SBD,M,
Boys,67.13,DQ,Tuma Johnson,North Crowley,66.13,170.1,,,,Unlimited,SBD,M,
Boys,67.13,DQ,Jack Hicks,North Crowley,67.13,129.27,,,,Unlimited,SBD,M,
Boys,74.84,1,Ethan Hunt,Denison,72.94,215.46,156.49,251.74,623.69,Unlimited,SBD,M,
Boys,74.84,2,Leo Anguiano,Prosper,73.48,222.26,147.42,222.26,591.94,Unlimited,SBD,M,
Boys,74.84,3,Besnik Hysenaj,Little Elm,73.48,210.92,154.22,204.12,569.26,Unlimited,SBD,M,
Boys,74.84,4,Austin Stutts,Frisco Wakeland,73.75,213.19,138.35,213.19,564.72,Unlimited,SBD,M,
Boys,74.84,5,Kale Jones #1,Ponder,74.21,224.53,129.27,208.65,562.45,Unlimited,SBD,M,
Boys,74.84,6,Grady Ford,Celeste,72.12,192.78,142.88,206.38,542.04,Unlimited,SBD,M,
Boys,74.84,7,Cole Riley,Melissa,73.39,204.12,115.67,204.12,523.9,Unlimited,SBD,M,
Boys,74.84,8,Remingten Wyatt,Leonard,72.57,192.78,124.74,183.7,501.22,Unlimited,SBD,M,
Boys,74.84,9,Jaxon Brown,Bells,72.76,183.7,120.2,188.24,492.15,Unlimited,SBD,M,
Boys,74.84,10,Tanner Poltl,Lucas Lovejoy,72.76,183.7,120.2,188.24,492.15,Unlimited,SBD,M,
Boys,74.84,11,Corbin Hood,Ponder,74.84,176.9,108.86,192.78,478.54,Unlimited,SBD,M,
Boys,74.84,12,Makson Allred,Ponder,71.85,179.17,106.59,167.83,453.59,Unlimited,SBD,M,
Boys,74.84,13,Reese Prince,Prosper Walnut Grove,73.75,158.76,108.86,179.17,446.79,Unlimited,SBD,M,
Boys,74.84,14,Justin Petty,Sadler S & S Consolidated,73.12,170.1,95.25,174.63,439.98,Unlimited,SBD,M,
Boys,74.84,15,Luke McGehee,Bells,72.48,165.56,77.11,185.97,428.64,Unlimited,SBD,M,
Boys,74.84,16,Antony Rivera,Farmersville,72.12,167.83,79.38,170.1,417.3,Unlimited,SBD,M,
Boys,74.84,17,Jaxon Deramus,Aubrey,68.04,151.95,92.99,158.76,403.7,Unlimited,SBD,M,
Boys,74.84,18,Luke Mateer,Little Elm,73.66,142.88,104.33,151.95,399.16,Unlimited,SBD,M,
Boys,74.84,19,Jesse Mercado,Bells,72.48,149.69,83.91,156.49,390.09,Unlimited,SBD,M,
Boys,74.84,20,Jackson Paul,Prosper Walnut Grove,73.57,142.88,104.33,138.35,385.55,Unlimited,SBD,M,
Boys,74.84,21,Kendall Schneyer,Little Elm,73.75,142.88,74.84,156.49,374.21,Unlimited,SBD,M,
Boys,74.84,22,Chance Skinner,Van Alstyne,73.84,154.22,72.57,147.42,374.21,Unlimited,SBD,M,
Boys,74.84,23,Karir Wortham,North Crowley,68.4,124.74,81.65,145.15,351.53,Unlimited,SBD,M,
Boys,74.84,24,Alex Moreno,Leonard,72.21,131.54,90.72,122.47,344.73,Unlimited,SBD,M,
Boys,74.84,25,Joshua Martinez,Pilot Point,67.31,102.06,77.11,149.69,328.85,Unlimited,SBD,M,
Boys,74.84,26,Daniel Monsalvez,Celeste,73.94,106.59,72.57,131.54,310.71,Unlimited,SBD,M,
Boys,74.84,DQ,Brandon Moore,Celeste,72.57,147.42,,,,Unlimited,SBD,M,
Boys,74.84,DQ,Hayden Halzworth,Aubrey,71.85,122.47,,,,Unlimited,SBD,M,
Boys,74.84,DQ,Jose Cerntes,Pilot Point,69.85,106.59,,,,Unlimited,SBD,M,
Boys,74.84,DQ,Aaron Freyer,Aubrey,73.66,242.67,138.35,215.46,,Unlimited,SBD,M,
Boys,74.84,DQ,Leonardo Anguiano,Prosper,74.48,183.7,108.86,,,Unlimited,SBD,M,
Boys,82.1,1,Bailey Ohrn,Frisco Emerson,79.11,254.01,197.31,247.21,698.53,Unlimited,SBD,M,
Boys,82.1,2,Michael Griger,Denison,80.65,242.67,165.56,265.35,673.58,Unlimited,SBD,M,
Boys,82.1,3,Toby Davis,Aubrey,81.01,267.62,145.15,249.48,662.24,Unlimited,SBD,M,
Boys,82.1,4,Chase Hodges,Celina,80.29,238.14,183.7,226.8,648.64,Unlimited,SBD,M,
Boys,82.1,5,Will Ngyuen,Princeton,81.47,231.33,188.24,222.26,641.83,Unlimited,SBD,M,
Boys,82.1,6,Cooper Stevens,Prosper,80.29,226.8,147.42,215.46,589.67,Unlimited,SBD,M,
Boys,82.1,7,Marcus Agustin,Prosper Rock Hill,78.74,206.38,138.35,208.65,553.38,Unlimited,SBD,M,
Boys,82.1,8,Connor Valley,Little Elm,80.92,195.04,133.81,224.53,553.38,Unlimited,SBD,M,
Boys,82.1,9,Jackson Pierce,Prosper Walnut Grove,80.2,190.51,158.76,192.78,542.04,Unlimited,SBD,M,
Boys,82.1,10,Grady Upchurch,Princeton,77.56,210.92,124.74,201.85,537.51,Unlimited,SBD,M,
Boys,82.1,11,Tanner Williams,Princeton,78.56,215.46,127.01,192.78,535.24,Unlimited,SBD,M,
Boys,82.1,12,Nathan Le,Frisco Liberty,80.38,183.7,147.42,185.97,517.1,Unlimited,SBD,M,
Boys,82.1,13,Max Dimarco,Lucas Lovejoy,78.65,151.95,147.42,188.24,487.61,Unlimited,SBD,M,
Boys,82.1,14,Ryan Church,Prosper Walnut Grove,79.47,183.7,120.2,174.63,478.54,Unlimited,SBD,M,
Boys,82.1,15,Noah Rondeau,Sadler S & S Consolidated,80.74,170.1,113.4,170.1,453.59,Unlimited,SBD,M,
Boys,82.1,16,Keagon Brinton,Prosper Rock Hill,76.75,158.76,115.67,174.63,449.06,Unlimited,SBD,M,
Boys,82.1,17,Westin Landeros,Van Alstyne,81.28,190.51,97.52,161.03,449.06,Unlimited,SBD,M,
Boys,82.1,18,Alex Walker,Celina,80.92,147.42,102.06,138.35,387.82,Unlimited,SBD,M,
Boys,82.1,19,Zane Young,Tom Bean,81.56,133.81,70.31,154.22,358.34,Unlimited,SBD,M,
Boys,82.1,20,Titus Tillman,Prosper Rock Hill,79.2,117.93,70.31,136.08,324.32,Unlimited,SBD,M,
Boys,82.1,21,Wyatt Arnold,Pilot Point,81.47,102.06,74.84,142.88,319.78,Unlimited,SBD,M,
Boys,82.1,DQ,Keaton Anderson,Prosper Walnut Grove,79.2,183.7,,,,Unlimited,SBD,M,
Boys,82.1,DQ,Jose Monroy,Sherman,80.47,204.12,158.76,201.85,,Unlimited,SBD,M,
Boys,89.81,1,Devon Jeffries,Denison,88.36,290.3,158.76,249.48,698.53,Unlimited,SBD,M,
Boys,89.81,2,Luke Susman,Lucas Lovejoy,88.36,278.96,165.56,226.8,671.32,Unlimited,SBD,M,
Boys,89.81,3,Ben Susman,Lucas Lovejoy,87.82,240.4,183.7,215.46,639.57,Unlimited,SBD,M,
Boys,89.81,4,Daniel Tyutyunnik,Princeton,85.46,224.53,124.74,244.94,594.21,Unlimited,SBD,M,
Boys,89.81,5,Josh Cordell,Bells,86.82,235.87,124.74,226.8,587.4,Unlimited,SBD,M,
Boys,89.81,6,Austin Crawley,Denison,86.55,213.19,149.69,199.58,562.45,Unlimited,SBD,M,
Boys,89.81,7,Jaxon Watjen,Princeton,86,224.53,115.67,215.46,555.65,Unlimited,SBD,M,
Boys,89.81,8,Jonathan Walters,Princeton,88,231.33,129.27,190.51,551.11,Unlimited,SBD,M,
Boys,89.81,9,Damian Gonzalez,Farmersville,84.37,206.38,133.81,201.85,542.04,Unlimited,SBD,M,
Boys,89.81,10,Cody Ngyuen,Ponder,88.18,217.72,129.27,172.37,519.36,Unlimited,SBD,M,
Boys,89.81,11,Mike Collins,Sherman,84.37,183.7,127.01,204.12,514.83,Unlimited,SBD,M,
Boys,89.81,12,Michael Naderi,Prosper Walnut Grove,88.09,188.24,113.4,185.97,487.61,Unlimited,SBD,M,
Boys,89.81,13,Dash Hewitt,Bells,86.82,170.1,88.45,183.7,442.25,Unlimited,SBD,M,
Boys,89.81,14,Braylon Turner,North Crowley,84.64,158.76,102.06,163.29,424.11,Unlimited,SBD,M,
Boys,89.81,15,Landen Floyd,Leonard,86.09,158.76,102.06,142.88,403.7,Unlimited,SBD,M,
Boys,89.81,16,Tannor Kuhn,Sherman,87.09,161.03,70.31,129.27,360.61,Unlimited,SBD,M,
Boys,89.81,DQ,Miles Morrison,Melissa,84.64,206.38,,,,Unlimited,SBD,M,
Boys,99.79,1,Braylin Garcia,Leonard,97.98,267.62,192.78,213.19,673.58,Unlimited,SBD,M,
Boys,99.79,2,Cj Hubbard,Celina,96.07,238.14,174.63,244.94,657.71,Unlimited,SBD,M,
Boys,99.79,3,Caden King,Bells,94.8,240.4,158.76,242.67,641.83,Unlimited,SBD,M,
Boys,99.79,4,Ty Smith,Lucas Lovejoy,97.43,224.53,183.7,226.8,635.03,Unlimited,SBD,M,
Boys,99.79,5,Maliek Harris,Leonard,96.25,244.94,156.49,222.26,623.69,Unlimited,SBD,M,
Boys,99.79,6,Armando Mendez,Celina,93.98,215.46,165.56,224.53,605.55,Unlimited,SBD,M,
Boys,99.79,7,Gabe McMillen,Denison,91.26,226.8,138.35,204.12,569.26,Unlimited,SBD,M,
Boys,99.79,8,Cristian Castro,Farmersville,97.61,224.53,127.01,215.46,566.99,Unlimited,SBD,M,
Boys,99.79,9,John Robin,Prosper Walnut Grove,98.61,183.7,129.27,204.12,517.1,Unlimited,SBD,M,
Boys,99.79,10,Jax Woods,Melissa,94.44,206.38,113.4,183.7,503.49,Unlimited,SBD,M,
Boys,99.79,11,Leonel Terrazas,Sherman,98.79,188.24,113.4,181.44,483.08,Unlimited,SBD,M,
Boys,99.79,12,Kade Mathis,Van Alstyne,93.26,192.78,102.06,165.56,460.4,Unlimited,SBD,M,
Boys,99.79,13,Blaine LaRue,Aubrey,95.98,151.95,102.06,154.22,408.23,Unlimited,SBD,M,
Boys,99.79,14,Micheal Juarez,Farmersville,94.35,145.15,104.33,156.49,405.97,Unlimited,SBD,M,
Boys,99.79,15,Shan Patel,Van Alstyne,99.52,142.88,90.72,151.95,385.55,Unlimited,SBD,M,
Boys,99.79,16,Rylan McFarland,Celeste,91.44,151.95,83.91,147.42,383.29,Unlimited,SBD,M,
Boys,99.79,17,Cayden Coffey,Celeste,90.26,124.74,90.72,151.95,367.41,Unlimited,SBD,M,
Boys,99.79,18,Jackson Ferrier,Celeste,92.35,120.2,90.72,131.54,342.46,Unlimited,SBD,M,
Boys,99.79,DQ,Malakai Meyer,Frisco Heritage,99.16,229.06,138.35,,,Unlimited,SBD,M,
Boys,99.79,DQ,Rylan McSpedden,Sadler S & S Consolidated,98.52,176.9,104.33,,,Unlimited,SBD,M,
Boys,109.77,1,Josh Turner,Denison,100.79,254.01,172.37,224.53,650.91,Unlimited,SBD,M,
Boys,109.77,2,Kamden Dyess,Frisco Heritage,107.5,249.48,176.9,215.46,641.83,Unlimited,SBD,M,
Boys,109.77,3,Grant Frazier,Prosper Walnut Grove,104.96,231.33,161.03,208.65,601.01,Unlimited,SBD,M,
Boys,109.77,4,Kaden Sabonis,Prosper Rock Hill,107.14,231.33,138.35,231.33,601.01,Unlimited,SBD,M,
Boys,109.77,5,Houston Beebe,Leonard,104.05,226.8,147.42,197.31,571.53,Unlimited,SBD,M,
Boys,109.77,6,Danny Lopez,Sherman,100.24,226.8,147.42,192.78,566.99,Unlimited,SBD,M,
Boys,109.77,7,Saxon Neise,Prosper,109.13,188.24,158.76,183.7,530.7,Unlimited,SBD,M,
Boys,109.77,8,Cason Cox,Ponder,107.41,204.12,115.67,199.58,519.36,Unlimited,SBD,M,
Boys,109.77,9,Jasen Amix,Farmersville,109.77,190.51,131.54,197.31,519.36,Unlimited,SBD,M,
Boys,109.77,10,Carson Thompson,Leonard,107.05,213.19,140.61,163.29,517.1,Unlimited,SBD,M,
Boys,109.77,11,Mohammad Taha,Prosper Rock Hill,100.61,192.78,115.67,201.85,510.29,Unlimited,SBD,M,
Boys,109.77,12,Cameron Lucas,Prosper Rock Hill,105.96,192.78,115.67,181.44,489.88,Unlimited,SBD,M,
Boys,109.77,13,John Hudson,Prosper Rock Hill,108.95,172.37,108.86,181.44,462.66,Unlimited,SBD,M,
Boys,109.77,14,Gio Cobarrubio,Farmersville,107.95,167.83,106.59,167.83,442.25,Unlimited,SBD,M,
Boys,109.77,15,Marshall Gatlin,Lucas Lovejoy,100.15,142.88,83.91,183.7,410.5,Unlimited,SBD,M,
Boys,109.77,16,Payton Evans,Tom Bean,102.87,133.81,70.31,142.88,347,Unlimited,SBD,M,
Boys,109.77,DQ,Lucas Herrera,Pilot Point,102.87,158.76,,,,Unlimited,SBD,M,
Boys,109.77,DQ,Nick Garza,Little Elm,105.23,,,,,Unlimited,SBD,M,
Boys,109.77,DQ,Hans Randall,Prosper Walnut Grove,105.87,249.48,154.22,224.53,,Unlimited,SBD,M,
Boys,109.77,DQ,Blaine Turner,Ponder,100.61,219.99,117.93,219.99,,Unlimited,SBD,M,
Boys,124.74,1,Jake Brown,Melissa,120.47,285.76,179.17,226.8,691.73,Unlimited,SBD,M,
Boys,124.74,2,Dc Thompson,North Crowley,114.85,244.94,183.7,254.01,682.66,Unlimited,SBD,M,
Boys,124.74,3,Jason Boyd,Bells,111.49,285.76,163.29,231.33,680.39,Unlimited,SBD,M,
Boys,124.74,4,Jake Johnson,Prosper,122.02,219.99,188.24,226.8,635.03,Unlimited,SBD,M,
Boys,124.74,5,Caleb Cox,Denison,113.31,249.48,151.95,226.8,628.23,Unlimited,SBD,M,
Boys,124.74,6,Orasio Juarez,Farmersville,110.5,219.99,158.76,219.99,598.74,Unlimited,SBD,M,
Boys,124.74,7,McKay Young,Tom Bean,113.49,210.92,151.95,233.6,596.47,Unlimited,SBD,M,
Boys,124.74,8,Jose Garcia,Celeste,122.83,229.06,165.56,192.78,587.4,Unlimited,SBD,M,
Boys,124.74,9,Amjad Khazem,Frisco Heritage,121.83,260.82,131.54,188.24,580.6,Unlimited,SBD,M,
Boys,124.74,10,Caleb Akins,Denison,117.48,215.46,165.56,183.7,564.72,Unlimited,SBD,M,
Boys,124.74,11,Jharoski Bingham,Princeton,123.1,210.92,122.47,192.78,526.17,Unlimited,SBD,M,
Boys,124.74,12,Gage Harmon,Celeste,111.95,188.24,161.03,170.1,519.36,Unlimited,SBD,M,
Boys,124.74,13,Diego Gonzales,Little Elm,119.02,181.44,117.93,208.65,508.02,Unlimited,SBD,M,
Boys,124.74,14,Cole Stephens,Prosper,123.83,151.95,102.06,151.95,405.97,Unlimited,SBD,M,
Boys,124.74,15,Landon Robinson,Sherman,115.76,133.81,102.06,163.29,399.16,Unlimited,SBD,M,
Boys,124.74,DQ,Shane Brown,Ponder,121.29,204.12,117.93,,,Unlimited,SBD,M,
Boys,124.74,DQ,Juan Mendoza,Pilot Point,111.77,249.48,120.2,,,Unlimited,SBD,M,
Boys,124.74,DQ,Andy Diaz,Little Elm,118.39,183.7,,,,Unlimited,SBD,M,
Boys,124.74,DQ,Orlando Sain,North Crowley,112.85,,,,,Unlimited,SBD,M,
Boys,124.74,DQ,Derrick Gleason,North Crowley,123.47,181.44,,,,Unlimited,SBD,M,
Boys,124.74,DQ,Cooper Duce,Denison,113.4,,,,,Unlimited,SBD,M,
Boys,139.71,1,Mark Vasquez,Farmersville,125.92,249.48,161.03,233.6,644.1,Unlimited,SBD,M,
Boys,139.71,2,Sean Stover,Prosper,127.46,242.67,181.44,219.99,644.1,Unlimited,SBD,M,
Boys,139.71,3,Nathan Woods,Denison,135.99,249.48,170.1,215.46,635.03,Unlimited,SBD,M,
Boys,139.71,4,Noah Roten,Denison,135.08,235.87,181.44,192.78,610.08,Unlimited,SBD,M,
Boys,139.71,5,Gavin Vecchione,Aubrey,125.55,149.69,117.93,165.56,433.18,Unlimited,SBD,M,
Boys,139.71,DQ,Tyler Spangler,Celina,132.36,219.99,,,,Unlimited,SBD,M,
Boys,139.71,DQ,Cashious McDonald,Ponder,131.45,195.04,,,,Unlimited,SBD,M,
Boys,139.71+,1,Owen Hollenbeck,Melissa,154.58,294.84,206.38,235.87,737.09,Unlimited,SBD,M,
Boys,139.71+,2,Manny Segundo,Celina,152.41,306.17,183.7,226.8,716.68,Unlimited,SBD,M,
Boys,139.71+,3,Christian Chavez,Pilot Point,162.2,195.04,136.08,195.04,526.17,Unlimited,SBD,M,
