Division,WeightClassKg,Place,Name,Team,BodyweightKg,Best3SquatKg,Best3BenchKg,Best3DeadliftKg,TotalKg,Equipment,Event,Sex,BirthDate
Girls,44.23,1,Cooper Marcee,Quitman,43.27,92.99,56.7,95.25,244.94,Unlimited,SBD,F,
Girls,44.23,2,Sydnee Pack,Hawkins,40.37,52.16,31.75,63.5,147.42,Unlimited,SBD,F,
Girls,51.94,1,Henessy Villalvazo,Commerce,49.08,99.79,49.9,99.79,249.48,Unlimited,SBD,F,
Girls,51.94,2,Melody Scruggs,Jacksonville,51.26,77.11,40.82,104.33,222.26,Unlimited,SBD,F,
Girls,51.94,3,Channing Muller,Diana New Diana,50.89,74.84,34.02,92.99,201.85,Unlimited,SBD,F,
Girls,56.02,1,Alondra Rangel,Jacksonville,55.52,131.54,70.31,108.86,310.71,Unlimited,SBD,F,
Girls,56.02,2,Maliah Lankford,Quitman,55.79,113.4,72.57,117.93,303.91,Unlimited,SBD,F,
Girls,56.02,3,Evelyn Garcia,Jacksonville,53.89,102.06,38.56,136.08,276.69,Unlimited,SBD,F,
Girls,56.02,4,Elizabeth Rodgers,Hawkins,55.34,102.06,63.5,79.38,244.94,Unlimited,SBD,F,
Girls,56.02,5,Yoselin Rameriz,Quitman,55.97,81.65,40.82,104.33,226.8,Unlimited,SBD,F,
Girls,56.02,6,Addison Wagner,Lone Oak,54.07,88.45,34.02,95.25,217.72,Unlimited,SBD,F,
Girls,56.02,7,Samantha Ruiz,Palestine,55.52,72.57,29.48,81.65,183.7,Unlimited,SBD,F,
Girls,60.1,1,Shayla Ramirez,Jacksonville,59.96,106.59,74.84,108.86,290.3,Unlimited,SBD,F,
Girls,60.1,2,Deseray Maria,Commerce,58.06,102.06,65.77,108.86,276.69,Unlimited,SBD,F,
Girls,60.1,3,Jordyn Dowdy,Commerce,60.06,97.52,47.63,124.74,269.89,Unlimited,SBD,F,
Girls,60.1,4,Alexandra Rebollar,Commerce,59.78,106.59,56.7,104.33,267.62,Unlimited,SBD,F,
Girls,60.1,5,Kimberly Reyes,Quitman,58.51,108.86,43.09,108.86,260.82,Unlimited,SBD,F,
Girls,60.1,6,Shyanne Henderson,Quitman,58.51,90.72,52.16,113.4,256.28,Unlimited,SBD,F,
Girls,60.1,7,Elizabeth Mojica,Commerce,58.24,79.38,36.29,108.86,224.53,Unlimited,SBD,F,
Girls,60.1,8,Leslie Suarez,New Summerfield,58.33,79.38,45.36,79.38,204.12,Unlimited,SBD,F,
Girls,60.1,DQ,Ayanna Kelley,Commerce,58.69,83.91,40.82,,,Unlimited,SBD,F,
Girls,67.36,1,Mckenzie Guiette,Wolfe City,66.68,120.2,92.99,120.2,333.39,Unlimited,SBD,F,
Girls,67.36,2,Caitlyn Deupree,Frankston,65.32,127.01,61.23,117.93,306.17,Unlimited,SBD,F,
Girls,67.36,3,Emma Gossett,Commerce,65.05,102.06,65.77,108.86,276.69,Unlimited,SBD,F,
Girls,67.36,4,Paisley Sloan,Commerce,61.87,88.45,45.36,113.4,247.21,Unlimited,SBD,F,
Girls,67.36,5,Cali Leon,Jacksonville,63.05,65.77,38.56,97.52,201.85,Unlimited,SBD,F,
Girls,67.36,6,Yareli Zavata,New Summerfield,63.05,70.31,36.29,68.04,174.63,Unlimited,SBD,F,
Girls,67.36,DQ,Journey Dillard,Quitman,61.14,79.38,,,,Unlimited,SBD,F,
Girls,75.07,1,Mattie Fuller,Lone Oak,69.13,154.22,81.65,99.79,335.66,Unlimited,SBD,F,
Girls,75.07,2,Lauryn Bailey,Commerce,74.66,115.67,56.7,136.08,308.44,Unlimited,SBD,F,
Girls,75.07,3,Morgan Myers,Canton,73.94,122.47,63.5,120.2,306.17,Unlimited,SBD,F,
Girls,75.07,4,Emily Marks,Wolfe City,68.67,124.74,56.7,108.86,290.3,Unlimited,SBD,F,
Girls,75.07,5,Mina Samford,Commerce,68.13,108.86,56.7,104.33,269.89,Unlimited,SBD,F,
Girls,75.07,6,Kaylee Dodson,Wolfe City,71.21,102.06,65.77,102.06,269.89,Unlimited,SBD,F,
Girls,75.07,7,Lynlee Taylor,Quitman,67.49,86.18,45.36,117.93,249.48,Unlimited,SBD,F,
Girls,75.07,8,Ally Molina,Quitman,72.39,90.72,43.09,106.59,240.4,Unlimited,SBD,F,
Girls,75.07,9,Kaiylee Taylor,Winona,69.67,92.99,54.43,90.72,238.14,Unlimited,SBD,F,
Girls,75.07,10,Caydence Doty,Lone Oak,67.77,79.38,31.75,72.57,183.7,Unlimited,SBD,F,
Girls,82.33,1,Catherine Egbe,Palestine,76.38,140.61,61.23,142.88,344.73,Unlimited,SBD,F,
Girls,82.33,2,Avery Haddock,Commerce,79.65,122.47,74.84,122.47,319.78,Unlimited,SBD,F,
Girls,82.33,3,Londyn Wilson,Hawkins,79.11,108.86,77.11,120.2,306.17,Unlimited,SBD,F,
Girls,82.33,4,Laney Reid,Canton,75.21,113.4,54.43,127.01,294.84,Unlimited,SBD,F,
Girls,82.33,5,Valeria Hernandez,Winona,79.47,115.67,58.97,115.67,290.3,Unlimited,SBD,F,
Girls,82.33,6,Kendall Saulters,Lone Oak,76.75,106.59,54.43,111.13,272.16,Unlimited,SBD,F,
Girls,82.33,7,Jalyn Jackson #2,Commerce,77.38,95.25,52.16,99.79,247.21,Unlimited,SBD,F,
Girls,82.33,8,Angelique Lopez,Jacksonville,77.93,83.91,45.36,115.67,244.94,Unlimited,SBD,F,
Girls,82.33,9,Jemerykah Dryden,Palestine,80.2,72.57,34.02,86.18,192.78,Unlimited,SBD,F,
Girls,90.04,1,Abby Day,Quitman,82.46,190.51,102.06,147.42,439.98,Unlimited,SBD,F,
Girls,90.04,2,Jasmine Ramirez,Commerce,88.54,154.22,68.04,136.08,358.34,Unlimited,SBD,F,
Girls,90.04,3,Allyson Mathews,Hawkins,86.73,131.54,86.18,117.93,335.66,Unlimited,SBD,F,
Girls,90.04,4,Za'Rayah Ross,Diana New Diana,87.91,154.22,52.16,124.74,331.12,Unlimited,SBD,F,
Girls,90.04,5,Jayden Osenbaugh,Commerce,82.74,95.25,56.7,104.33,256.28,Unlimited,SBD,F,
Girls,90.04,6,Sereinity Banda,Lone Oak,85.91,99.79,38.56,92.99,231.33,Unlimited,SBD,F,
Girls,90.04,7,Addison Mohan,Palestine,88.9,97.52,45.36,83.91,226.8,Unlimited,SBD,F,
Girls,100.02,1,Serenity Foster,Frankston,98.97,176.9,74.84,131.54,383.29,Unlimited,SBD,F,
Girls,100.02,2,Cloe Rosonke,Hawkins,94.53,127.01,68.04,122.47,317.51,Unlimited,SBD,F,
Girls,100.02,3,Jacelyn Van Syckle,Canton,92.35,97.52,77.11,99.79,274.42,Unlimited,SBD,F,
Girls,100.02,4,Maria Calvillo,Jacksonville,97.25,70.31,38.56,113.4,222.26,Unlimited,SBD,F,
Girls,100.02,5,Anaya Williams,Palestine,98.61,88.45,45.36,72.57,206.38,Unlimited,SBD,F,
Girls,110,1,Lexi Stanbery,Wolfe City,103.78,172.37,92.99,122.47,387.82,Unlimited,SBD,F,
Girls,110,2,Taylor Walters #2,Wolfe City,106.78,127.01,74.84,129.27,331.12,Unlimited,SBD,F,
Girls,110,DQ,Yuritzy Castillo,Winona,101.24,136.08,,,,Unlimited,SBD,F,
Girls,110+,1,Anajah White,Jacksonville,137.8,147.42,65.77,142.88,356.07,Unlimited,SBD,F,
Girls,110+,2,Gabi Ferretiz,Palestine,115.39,167.83,54.43,111.13,333.39,Unlimited,SBD,F,
Girls,110+,3,Mya White,Jacksonville,127.37,142.88,65.77,122.47,331.12,Unlimited,SBD,F,
Girls,110+,4,Makayla Ard,Hawkins,110.13,136.08,56.7,129.27,322.05,Unlimited,SBD,F,
Girls,,NS,Carrie Bixler,Hawkins,,,,,,Unlimited,SBD,F,
Girls,,NS,Danica Marsh,Hawkins,,,,,,Unlimited,SBD,F,
Girls,,NS,Ella Hale,Wolfe City,,,,,,Unlimited,SBD,F,
Girls,,NS,Emilee Dismukes,Wolfe City,,,,,,Unlimited,SBD,F,
Girls,,NS,Lauren Alonzo,Lone Oak,,,,,,Unlimited,SBD,F,
Girls,,NS,Reyna Espinoza,Palestine,,,,,,Unlimited,SBD,F,
Girls,,NS,Alexis Young,Lone Oak,,,,,,Unlimited,SBD,F,
Girls,,NS,Braxtyn Gore,Lone Oak,,,,,,Unlimited,SBD,F,
