.................
----------------------------------------------------------------------
Ran 17 tests in 0.266s

OK
Name             Stmts   Miss Branch BrPart  Cover   Missing
------------------------------------------------------------
Collatz.py          47      0     16      0   100%
TestCollatz.py      73      0      0      0   100%
------------------------------------------------------------
TOTAL              120      0     16      0   100%
