1 999999 525
2 2 2
12002 19999 279
62549 66214 330
905837 904690 383
261826 259662 345
471477 470023 307
984239 982239 383
155977 157165 383
181701 181907 316
434510 434600 325
377493 379001 361
328381 324544 384
272415 268021 407
148292 142809 357
461232 459767 307
712971 708094 411
474301 475309 351
662879 656835 398
717050 712333 411
236661 236210 337
135532 138125 331
885425 881009 370
865196 872605 432
747287 739602 393
627112 632189 385
984530 983810 352
147255 153674 370
404282 400088 387
691499 697335 442
342245 345041 353
969359 965984 365
769609 762875 468
550370 555532 421
877869 870680 432
722800 726336 380
637710 636594 354
214454 214068 293
944713 953826 414
254875 260027 363
422938 426070 418
172090 173726 347
236557 241015 368
711334 714036 411
872410 873100 326
19062 15048 279
873357 868760 432
319439 321868 371
497739 497065 289
462720 468631 413
109335 112547 323
139971 132083 344
663030 667053 442
785073 781696 362
350900 342389 441
32666 27526 285
157219 161667 370
469786 468470 382
443405 446090 338
462133 470447 413
481022 483802 382
687565 682016 398
333336 336719 366
601967 601084 403
52023 45151 314
267642 267842 301
879713 886696 370
77300 78744 307
462431 468137 413
229212 228652 275
25591 30752 308
309237 302338 371
872745 869911 432
670829 678460 385
370296 378359 423
620450 623716 372
609368 610734 341
86641 93852 333
996196 995143 365
157923 160533 370
172012 172568 303
220235 219909 293
719227 723631 411
734350 734242 287
611337 613839 354
692960 694947 367
529824 525379 408
484514 484010 276
91263 99396 333
992018 993146 352
968526 963656 383
176988 174317 334
649765 646511 385
698529 694769 367
325976 330404 353
657260 656223 429
531815 530336 346
465747 468614 413
792896 794338 375
36986 36229 249
914544 916639 370
