.......................
----------------------------------------------------------------------
Ran 23 tests in 0.172s

OK
Name             Stmts   Miss Branch BrPart  Cover   Missing
------------------------------------------------------------
Collatz.py          62      1     26      1    98%   65, 64->65
TestCollatz.py      96      0      0      0   100%
------------------------------------------------------------
TOTAL              158      1     26      1    99%
