1 10 20
100 200 125
201 210 89
900 1000 174
1 501 144
10 2 20
999000 999999 396
20 20 8
6501 7001 257
13001 13501 276
19501 20001 274
26001 26501 277
32501 33001 267
39001 39501 275
45501 46001 239
52001 52501 278
58501 59001 273
65001 65501 224
71501 72001 250
78001 78501 307
84501 85001 289
91001 91501 333
97501 98001 297
104001 104501 297
110501 111001 292
117001 117501 274
123501 124001 318
130001 130501 300
136501 137001 313
143001 143501 282
149501 150001 326
156001 156501 383
162501 163001 339
169001 169501 334
175501 176001 272
182001 182501 316
188501 189001 285
195001 195501 360
201501 202001 311
208001 208501 280
214501 215001 280
221001 221501 355
227501 228001 337
234001 234501 381
240501 241001 368
247001 247501 350
253501 254001 332
260001 260501 319
266501 267001 314
273001 273501 283
279501 280001 283
286001 286501 283
292501 293001 296
299001 299501 327
305501 306001 265
312001 312501 384
318501 319001 353
325001 325501 340
331501 332001 291
338001 338501 335
344501 345001 304
351001 351501 379
357501 358001 273
364001 364501 286
370501 371001 304
377001 377501 286
383501 384001 299
390001 390501 299
396501 397001 299
403001 403501 255
409501 410001 281
416001 416501 387
422501 423001 325
429001 429501 281
435501 436001 281
442001 442501 294
448501 449001 338
455001 455501 263
461501 462001 307
468001 468501 382
474501 475001 351
481001 481501 369
487501 488001 338
494001 494501 307
500501 501001 333
507001 507501 333
513501 514001 351
520001 520501 302
526501 527001 333
533001 533501 377
539501 540001 346
546001 546501 284
552501 553001 315
559001 559501 284
565501 566001 284
572001 572501 284
578501 579001 315
585001 585501 359
591501 592001 403
598001 598501 341
604501 605001 297
611001 611501 354
617501 618001 372
624001 624501 341
630501 631001 310
637001 637501 354
643501 644001 279
650001 650501 341
656501 657001 429
663001 663501 292
669501 670001 336
676001 676501 336
682501 683001 305
689001 689501 336
695501 696001 336
702001 702501 274
708501 709001 349
715001 715501 305
721501 722001 367
728001 728501 287
734501 735001 287
741001 741501 318
747501 748001 362
754001 754501 287
760501 761001 331
767001 767501 318
773501 774001 331
780001 780501 344
786501 787001 300
793001 793501 375
799501 800001 375
806001 806501 300
812501 813001 344
819001 819501 300
825501 826001 344
832001 832501 282
838501 839001 344
845001 845501 401
851501 852001 344
858001 858501 282
864501 865001 326
871001 871501 282
877501 878001 357
884001 884501 295
890501 891001 326
897001 897501 339
903501 904001 295
910001 910501 476
916501 917001 308
923001 923501 308
929501 930001 339
936001 936501 321
942501 943001 339
949001 949501 277
955501 956001 339
962001 962501 370
968501 969001 308
975001 975501 321
981501 982001 321
988001 988501 321
994501 995001 290
