......................
----------------------------------------------------------------------
Ran 22 tests in 0.723s

OK
Name             Stmts   Miss Branch BrPart  Cover   Missing
------------------------------------------------------------
Collatz.py          53      0     18      0   100%
TestCollatz.py      98      0      0      0   100%
------------------------------------------------------------
TOTAL              151      0     18      0   100%
