1 10 20
100 200 125
201 210 89
900 1000 174
10 1 20
75 800 171
1 1000 179
1 10000 262
1 100000 351
1 1000000 525
92244 500 351
285 15 128
500 500 111
350 700 145
12345 54321 340
135 987 179
523 897 179
314 456 144
1 1 1
9999 9999 92
9 900 179
20 2000 182
5352 100 238
304 304 25
102938 918273 525
15 78 116
3 4 8
700 800 171
90 12 116
56 300 128
35 13 112
67 100 119
878 1000 174
834 800 135
633 336 142
1732 43 182
1893 345 182
589 23 144
54 45 113
12 12 10
12345 12345 51
408 1234 182
653 1667 182
35 12 112
467 4356 238
46 23 112
10 50 112
60 100 119
150 300 128
122 144 122
12 144 122
799 23 171
23 799 171
57 33 113
18 5 21
538 235 144
3564 1000 217
864 944 179
765 567 171
443 344 134
90 91 93
1000 1001 143
95 59 116
8723 13535 276
1830 1565 180
467 24 144
894 235 179
764 45 171
23 67 113
67 23 113
946 326 179
437 3 144
5624 356 238
653 23 145
668 9135 262
752 725 140
275 851 171
853 13 171
98 9 119
200 40 125
148 851 171
642 643 26
872 362 179
3964 156 238
1356 35675 324
86453 267 351
6561 13 262
5 500 144
501 41 144
546 832 171
725 391 171
411 911 179
532 86 144
46 1 112
467 764 171
7552 24678 282
4673 442 238
6578 46453 324
557 24 144
6537 4673 262
64432 24677 340
1245 5421 238
435 8645 262
64 8 113
