module gitlab.com/brd.com/coinify

require (
	gitlab.com/breadwallet/backend v0.0.0-20180919164106-9675e043d4e5
	// github.com/gin-gonic/gin v0.0.0-20170702112826-d459835d2b07
	google.golang.org/grpc v1.15.0
)
