<template>
	<svg width="36" height="36" version="1.1" id="Layer_1-mdl" xmlns="http://www.w3.org/2000/svg" xmlns:xlink="http://www.w3.org/1999/xlink" x="0px" y="0px" viewBox="0 0 36 36" style="enable-background:new 0 0 36 36;" xml:space="preserve">
    <style type="text/css">
      .cls-1-mdl{fill:#ffd201;}
      .cls-2-mdl{fill:#fff;}
    </style>
    <rect class="cls-1-mdl" width="36" height="36" rx="4"/>
    <path class="cls-2-mdl" d="M15.34,8.32V26.07H25.92v2.24H12.68v-20Z"/>
  </svg>
</template>
