<template>
	<svg width="36" height="36" version="1.1" id="Layer_1-uyu" xmlns="http://www.w3.org/2000/svg" xmlns:xlink="http://www.w3.org/1999/xlink" x="0px" y="0px" viewBox="0 0 36 36" style="enable-background:new 0 0 36 36;" xml:space="preserve">
    <style type="text/css">
      .cls-1-uyu{fill:#0038a8;}
      .cls-2-uyu{fill:#fff;}
    </style>
    <rect class="cls-1-uyu" width="36" height="36" rx="4"/>
    <path class="cls-2-uyu" d="M7.28,23.63A4.33,4.33,0,0,0,9.67,24.8V18.44a16.6,16.6,0,0,1-2.2-.68,5.78,5.78,0,0,1-1.54-.89A3.17,3.17,0,0,1,5,15.61a5.08,5.08,0,0,1-.28-1.8,4.92,4.92,0,0,1,1.42-3.54,4.79,4.79,0,0,1,1.56-1,5.93,5.93,0,0,1,1.94-.46V7.19H11v1.6a5,5,0,0,1,3.09,1.44,6.87,6.87,0,0,1,1.63,3.32h-2A3.19,3.19,0,0,0,11,10.76v5.91l1.44.38a6.43,6.43,0,0,1,1.12.42,5.13,5.13,0,0,1,1.25.83,4.56,4.56,0,0,1,1,1.32,4,4,0,0,1,.42,1.89,5.26,5.26,0,0,1-.39,2.09,4.74,4.74,0,0,1-1.1,1.57,5.18,5.18,0,0,1-1.65,1A7.75,7.75,0,0,1,11,26.7v2H9.67v-2A6,6,0,0,1,5.85,25a6.08,6.08,0,0,1-1.61-4h2A3.6,3.6,0,0,0,7.28,23.63Zm.43-12.11a2.59,2.59,0,0,0-.8,2.07,2.46,2.46,0,0,0,.2,1.07,2,2,0,0,0,.58.75,3.5,3.5,0,0,0,.87.51,9.57,9.57,0,0,0,1.11.39V10.69A3.45,3.45,0,0,0,7.71,11.52Zm4.51,13a2.83,2.83,0,0,0,1-.56,2.42,2.42,0,0,0,.64-.94,3.37,3.37,0,0,0,.23-1.33,2.52,2.52,0,0,0-.24-1.16,2.43,2.43,0,0,0-.65-.81,3.7,3.7,0,0,0-1-.56c-.38-.15-.79-.29-1.22-.42v6A4.71,4.71,0,0,0,12.22,24.56Z"/>
    <path class="cls-2-uyu" d="M29.59,25.05a7,7,0,0,1-5,1.65,7.82,7.82,0,0,1-5.17-1.57q-1.86-1.57-1.86-5V9.18h2.28V20.12a4.62,4.62,0,0,0,1.23,3.49,4.81,4.81,0,0,0,3.52,1.19,4.37,4.37,0,0,0,3.33-1.19,4.84,4.84,0,0,0,1.14-3.49V9.18h2.28V20.12A6.47,6.47,0,0,1,29.59,25.05Z"/>
  </svg>
</template>
