<template>
	<svg width="36" height="36" version="1.1" id="Layer_1-eur" xmlns="http://www.w3.org/2000/svg" xmlns:xlink="http://www.w3.org/1999/xlink" x="0px" y="0px" viewBox="0 0 36 36" style="enable-background:new 0 0 36 36;" xml:space="preserve">
    <style type="text/css">
      .cls-1-eur{fill:#039;}
      .cls-2-eur{fill:#ffcc01;}
    </style>
    <rect class="cls-1-eur" width="36" height="36" rx="4"/>
    <path class="cls-2-eur" d="M24.76,11.52a6,6,0,0,0-4.15-2A4.36,4.36,0,0,0,17,11.38a9.48,9.48,0,0,0-1.62,3.88H23.6L22.81,17H15.19a3.71,3.71,0,0,0,0,.47v.75a1.43,1.43,0,0,0,0,.29h7.22l-.76,1.77H15.33c.64,4.16,2.48,6.23,5.51,6.23A5.32,5.32,0,0,0,23.31,26a10.1,10.1,0,0,0,2-1.53v3a8.13,8.13,0,0,1-4.47,1.25q-7.11,0-8.32-8.44H10.29l.78-1.77H12.4a1.43,1.43,0,0,1,0-.29v-.78a3,3,0,0,1,0-.44H10.29L11,15.26h1.57a11,11,0,0,1,2.64-5.62,7.26,7.26,0,0,1,5.59-2.35,9.09,9.09,0,0,1,5.25,1.83Z"/>
  </svg>
</template>
