{
    "development":{
        "username": "root",
        "password": "root",
        "database": "prueba3",
        "host": "localhost",
        "dialect": "mysql"
    },
    "staging":{
        "username": "root",
         "password": "root",
        "database": "prueba3",
        "host": "localhost",
        "dialect": "mysql"
    }
  
}
