Library\Bee\artifacts\mvdfrm\Unity.XR.ARSubsystems.ref.dll_46AC1CE864089236.mvfrm
Library\Bee\artifacts\mvdfrm\Unity.XR.Management.ref.dll_2CC2F0B9CB7419B4.mvfrm
Library\Bee\artifacts\mvdfrm\UnityEngine.SpatialTracking.ref.dll_E3484C16F227CFFA.mvfrm
Library\Bee\artifacts\mvdfrm\UnityEngine.UI.ref.dll_AFC2E85BC2EDBC0B.mvfrm
Library\Bee\artifacts\mvdfrm\Unity.Compat.dll_BF1C3A400F471BD4.mvfrm
Library\Bee\artifacts\mvdfrm\Unity.Tasks.dll_E59340E2C7414818.mvfrm
Library\Bee\artifacts\mvdfrm\UnityEngine.AccessibilityModule.dll_3CCB2698AE90E19C.mvfrm
Library\Bee\artifacts\mvdfrm\UnityEngine.AIModule.dll_B08430CE9D7FBC1E.mvfrm
Library\Bee\artifacts\mvdfrm\UnityEngine.AndroidJNIModule.dll_DD69350B594E90DC.mvfrm
Library\Bee\artifacts\mvdfrm\UnityEngine.AnimationModule.dll_62BAFE2F5869F942.mvfrm
Library\Bee\artifacts\mvdfrm\UnityEngine.ARModule.dll_69F6F5D1FA9D1AE7.mvfrm
Library\Bee\artifacts\mvdfrm\UnityEngine.AssetBundleModule.dll_0FC73873D832ACB0.mvfrm
Library\Bee\artifacts\mvdfrm\UnityEngine.AudioModule.dll_F0F8D72789E839B4.mvfrm
Library\Bee\artifacts\mvdfrm\UnityEngine.ClothModule.dll_57E1342264051898.mvfrm
Library\Bee\artifacts\mvdfrm\UnityEngine.CoreModule.dll_611E1A254FBD5635.mvfrm
Library\Bee\artifacts\mvdfrm\UnityEngine.CrashReportingModule.dll_D398A3E293A75CED.mvfrm
Library\Bee\artifacts\mvdfrm\UnityEngine.DirectorModule.dll_399F037949A70992.mvfrm
Library\Bee\artifacts\mvdfrm\UnityEngine.dll_8274A072301E9D50.mvfrm
Library\Bee\artifacts\mvdfrm\UnityEngine.DSPGraphModule.dll_3EF064E2BC07DAB3.mvfrm
Library\Bee\artifacts\mvdfrm\UnityEngine.GameCenterModule.dll_07B67F261F8F81CD.mvfrm
Library\Bee\artifacts\mvdfrm\UnityEngine.GIModule.dll_48C079DC392EA438.mvfrm
Library\Bee\artifacts\mvdfrm\UnityEngine.GridModule.dll_3E8F36136811EC2C.mvfrm
Library\Bee\artifacts\mvdfrm\UnityEngine.HotReloadModule.dll_E403BC35339D14C4.mvfrm
Library\Bee\artifacts\mvdfrm\UnityEngine.ImageConversionModule.dll_6704F44B70DC9C4F.mvfrm
Library\Bee\artifacts\mvdfrm\UnityEngine.IMGUIModule.dll_2958768E5019CD95.mvfrm
Library\Bee\artifacts\mvdfrm\UnityEngine.InputLegacyModule.dll_A10C5392702462A1.mvfrm
Library\Bee\artifacts\mvdfrm\UnityEngine.InputModule.dll_576E9ED800205E58.mvfrm
Library\Bee\artifacts\mvdfrm\UnityEngine.JSONSerializeModule.dll_9CE2AFD4ADCC4226.mvfrm
Library\Bee\artifacts\mvdfrm\UnityEngine.LocalizationModule.dll_847839BED3FBE47F.mvfrm
Library\Bee\artifacts\mvdfrm\UnityEngine.ParticleSystemModule.dll_26AAED2F01B8E87B.mvfrm
Library\Bee\artifacts\mvdfrm\UnityEngine.PerformanceReportingModule.dll_0C88F3011B1E5FF4.mvfrm
Library\Bee\artifacts\mvdfrm\UnityEngine.Physics2DModule.dll_AF60EE1FF966F0D7.mvfrm
Library\Bee\artifacts\mvdfrm\UnityEngine.PhysicsModule.dll_1F7201B9EF0AE305.mvfrm
Library\Bee\artifacts\mvdfrm\UnityEngine.ProfilerModule.dll_6BE53CAFE300909F.mvfrm
Library\Bee\artifacts\mvdfrm\UnityEngine.RuntimeInitializeOnLoadManagerInitializerModule.dll_AA851F02E1648FA0.mvfrm
Library\Bee\artifacts\mvdfrm\UnityEngine.ScreenCaptureModule.dll_B6CA5D59C2386E88.mvfrm
Library\Bee\artifacts\mvdfrm\UnityEngine.SharedInternalsModule.dll_EB163320E80A979F.mvfrm
Library\Bee\artifacts\mvdfrm\UnityEngine.SpriteMaskModule.dll_F0E2F1B640FF1747.mvfrm
Library\Bee\artifacts\mvdfrm\UnityEngine.SpriteShapeModule.dll_292865CE8DD4E4BA.mvfrm
Library\Bee\artifacts\mvdfrm\UnityEngine.StreamingModule.dll_174FEB7FA7F1B080.mvfrm
Library\Bee\artifacts\mvdfrm\UnityEngine.SubstanceModule.dll_F3FAFFC8F344AE8E.mvfrm
Library\Bee\artifacts\mvdfrm\UnityEngine.SubsystemsModule.dll_5B9058180F46FF5A.mvfrm
Library\Bee\artifacts\mvdfrm\UnityEngine.TerrainModule.dll_39B87D28C4C92BF3.mvfrm
Library\Bee\artifacts\mvdfrm\UnityEngine.TerrainPhysicsModule.dll_272596021AFBE308.mvfrm
Library\Bee\artifacts\mvdfrm\UnityEngine.TextCoreFontEngineModule.dll_7C55087FCF6A4813.mvfrm
Library\Bee\artifacts\mvdfrm\UnityEngine.TextCoreTextEngineModule.dll_C43D3EF15EEE0131.mvfrm
Library\Bee\artifacts\mvdfrm\UnityEngine.TextRenderingModule.dll_E009CF64796FEE7D.mvfrm
Library\Bee\artifacts\mvdfrm\UnityEngine.TilemapModule.dll_D8B4E4A9DC860CFC.mvfrm
Library\Bee\artifacts\mvdfrm\UnityEngine.TLSModule.dll_171721C93CA16A99.mvfrm
Library\Bee\artifacts\mvdfrm\UnityEngine.UIElementsModule.dll_5FCEB98012733B51.mvfrm
Library\Bee\artifacts\mvdfrm\UnityEngine.UIElementsNativeModule.dll_03AE19334483C008.mvfrm
Library\Bee\artifacts\mvdfrm\UnityEngine.UIModule.dll_ABF7CEFBF9C6C1CA.mvfrm
Library\Bee\artifacts\mvdfrm\UnityEngine.UmbraModule.dll_6BCD8340170EE527.mvfrm
Library\Bee\artifacts\mvdfrm\UnityEngine.UNETModule.dll_F3C4620E9CCC4BAE.mvfrm
Library\Bee\artifacts\mvdfrm\UnityEngine.UnityAnalyticsModule.dll_464A5DF8ADE03A77.mvfrm
Library\Bee\artifacts\mvdfrm\UnityEngine.UnityConnectModule.dll_B3EE7E6585801F6B.mvfrm
Library\Bee\artifacts\mvdfrm\UnityEngine.UnityCurlModule.dll_95D79F60C87DEB2F.mvfrm
Library\Bee\artifacts\mvdfrm\UnityEngine.UnityTestProtocolModule.dll_C66C34A33F00971D.mvfrm
Library\Bee\artifacts\mvdfrm\UnityEngine.UnityWebRequestAssetBundleModule.dll_BF721CC60214DE88.mvfrm
Library\Bee\artifacts\mvdfrm\UnityEngine.UnityWebRequestAudioModule.dll_848546DFA1892A8C.mvfrm
Library\Bee\artifacts\mvdfrm\UnityEngine.UnityWebRequestModule.dll_78A3FBF57BD136CE.mvfrm
Library\Bee\artifacts\mvdfrm\UnityEngine.UnityWebRequestTextureModule.dll_EE0A7EBDABC3C9E1.mvfrm
Library\Bee\artifacts\mvdfrm\UnityEngine.UnityWebRequestWWWModule.dll_8EFF844D4EADBD9D.mvfrm
Library\Bee\artifacts\mvdfrm\UnityEngine.VehiclesModule.dll_B161FCF8C3D0D92D.mvfrm
Library\Bee\artifacts\mvdfrm\UnityEngine.VFXModule.dll_97F5BA38130ED406.mvfrm
Library\Bee\artifacts\mvdfrm\UnityEngine.VideoModule.dll_16025B924C7A5559.mvfrm
Library\Bee\artifacts\mvdfrm\UnityEngine.VRModule.dll_FEC9F5819B814742.mvfrm
Library\Bee\artifacts\mvdfrm\UnityEngine.WindModule.dll_D76CF54DE0F3D49E.mvfrm
Library\Bee\artifacts\mvdfrm\UnityEngine.XRModule.dll_3188B88624BB94A0.mvfrm
Library\Bee\artifacts\mvdfrm\Unity.VisualScripting.Antlr3.Runtime.dll_DC3B7A3D07E08090.mvfrm