{
  "project_info": {
    "project_number": "500660352144",
    "project_id": "esnutriapp-96597",
    "storage_bucket": "esnutriapp-96597.appspot.com"
  },
  "client": [
    {
      "client_info": {
        "mobilesdk_app_id": "1:500660352144:android:b61e06a2193bd9501a5415",
        "android_client_info": {
          "package_name": "com.unlSistemas.esnutri3d"
        }
      },
      "oauth_client": [
        {
          "client_id": "500660352144-r5ur74vqr1e3s0tb8d1f00o2dgsdr1ao.apps.googleusercontent.com",
          "client_type": 3
        }
      ],
      "api_key": [
        {
          "current_key": "AIzaSyC41UfjemIxlZ2BR2lS7nnTOF1TXb_TEvA"
        }
      ],
      "services": {
        "appinvite_service": {
          "other_platform_oauth_client": [
            {
              "client_id": "500660352144-r5ur74vqr1e3s0tb8d1f00o2dgsdr1ao.apps.googleusercontent.com",
              "client_type": 3
            }
          ]
        }
      }
    }
  ],
  "configuration_version": "1"
}