<?xml version="1.0" encoding="UTF-8"?>
<svg width="30px" height="30px" viewBox="0 0 30 30" version="1.1" xmlns="http://www.w3.org/2000/svg" xmlns:xlink="http://www.w3.org/1999/xlink">
    <!-- Generator: Sketch 46.2 (44496) - http://www.bohemiancoding.com/sketch -->
    <title>Icon / trash white</title>
    <desc>Created with Sketch.</desc>
    <defs></defs>
    <g id="Symbols" stroke="none" stroke-width="1" fill="none" fill-rule="evenodd">
        <g id="mypresentation/overlay-close" transform="translate(-121.000000, -85.000000)" fill="#FFFFFF">
            <g id="Icon-/-trash-white">
                <g transform="translate(117.000000, 76.000000)">
                    <polygon id="Shape" points="34 12.0214286 30.9785714 9 19 20.9785714 7.02142857 9 4 12.0214286 15.9785714 24 4 35.9785714 7.02142857 39 19 27.0214286 30.9785714 39 34 35.9785714 22.0214286 24"></polygon>
                </g>
            </g>
        </g>
    </g>
</svg>