G04 #@! TF.GenerationSoftware,KiCad,Pcbnew,5.0.0-rc2-unknown-03fa645~65~ubuntu16.04.1*
G04 #@! TF.CreationDate,2018-06-25T11:29:46+12:00*
G04 #@! TF.ProjectId,Shake_Table_PCB,5368616B655F5461626C655F5043422E,rev?*
G04 #@! TF.SameCoordinates,Original*
G04 #@! TF.FileFunction,Soldermask,Top*
G04 #@! TF.FilePolarity,Negative*
%FSLAX46Y46*%
G04 Gerber Fmt 4.6, Leading zero omitted, Abs format (unit mm)*
G04 Created by KiCad (PCBNEW 5.0.0-rc2-unknown-03fa645~65~ubuntu16.04.1) date Mon Jun 25 11:29:46 2018*
%MOMM*%
%LPD*%
G01*
G04 APERTURE LIST*
%ADD10C,0.100000*%
%ADD11C,3.400000*%
%ADD12R,2.000000X2.000000*%
%ADD13O,2.000000X2.000000*%
%ADD14C,2.000000*%
%ADD15R,2.200000X2.200000*%
%ADD16C,2.200000*%
%ADD17R,3.900000X3.900000*%
%ADD18C,3.900000*%
%ADD19R,2.150000X2.150000*%
%ADD20C,2.150000*%
%ADD21O,2.200000X2.200000*%
%ADD22C,2.600000*%
%ADD23C,2.100000*%
%ADD24C,5.000000*%
%ADD25R,2.400000X2.400000*%
%ADD26C,2.400000*%
%ADD27C,2.900000*%
G04 APERTURE END LIST*
D10*
G04 #@! TO.C,SW2*
X217557322Y-51121932D02*
G75*
G03X217557322Y-51121932I-444500J0D01*
G01*
X217557322Y-55621932D02*
G75*
G03X217557322Y-55621932I-444500J0D01*
G01*
X215247822Y-56871932D02*
G75*
G03X215247822Y-56871932I-635000J0D01*
G01*
X215247822Y-49871932D02*
G75*
G03X215247822Y-49871932I-635000J0D01*
G01*
G04 #@! TO.C,SW3*
X215247822Y-59767932D02*
G75*
G03X215247822Y-59767932I-635000J0D01*
G01*
X215247822Y-66767932D02*
G75*
G03X215247822Y-66767932I-635000J0D01*
G01*
X217557322Y-65517932D02*
G75*
G03X217557322Y-65517932I-444500J0D01*
G01*
X217557322Y-61017932D02*
G75*
G03X217557322Y-61017932I-444500J0D01*
G01*
G04 #@! TO.C,SW4*
X215247822Y-39945932D02*
G75*
G03X215247822Y-39945932I-635000J0D01*
G01*
X215247822Y-46945932D02*
G75*
G03X215247822Y-46945932I-635000J0D01*
G01*
X217557322Y-45695932D02*
G75*
G03X217557322Y-45695932I-444500J0D01*
G01*
X217557322Y-41195932D02*
G75*
G03X217557322Y-41195932I-444500J0D01*
G01*
G04 #@! TO.C,SW5*
X217574500Y-86594000D02*
G75*
G03X217574500Y-86594000I-444500J0D01*
G01*
X217574500Y-91094000D02*
G75*
G03X217574500Y-91094000I-444500J0D01*
G01*
X215265000Y-92344000D02*
G75*
G03X215265000Y-92344000I-635000J0D01*
G01*
X215265000Y-85344000D02*
G75*
G03X215265000Y-85344000I-635000J0D01*
G01*
G04 #@! TD*
D11*
G04 #@! TO.C,SW1*
X217170000Y-109220000D03*
X217170000Y-104140000D03*
X204470000Y-111380000D03*
X204470000Y-106680000D03*
X204470000Y-101980000D03*
G04 #@! TD*
D12*
G04 #@! TO.C,A1*
X204470000Y-81280000D03*
D13*
X189230000Y-48260000D03*
X204470000Y-78740000D03*
X189230000Y-50800000D03*
X204470000Y-76200000D03*
X189230000Y-53340000D03*
X204470000Y-73660000D03*
X189230000Y-55880000D03*
X204470000Y-71120000D03*
X189230000Y-58420000D03*
X204470000Y-68580000D03*
X189230000Y-60960000D03*
X204470000Y-66040000D03*
X189230000Y-63500000D03*
X204470000Y-63500000D03*
X189230000Y-66040000D03*
X204470000Y-60960000D03*
X189230000Y-68580000D03*
X204470000Y-58420000D03*
X189230000Y-71120000D03*
X204470000Y-55880000D03*
X189230000Y-73660000D03*
X204470000Y-53340000D03*
X189230000Y-76200000D03*
X204470000Y-50800000D03*
X189230000Y-78740000D03*
X204470000Y-48260000D03*
X189230000Y-81280000D03*
X204470000Y-45720000D03*
X189230000Y-45720000D03*
G04 #@! TD*
D12*
G04 #@! TO.C,C1*
X191770000Y-110490000D03*
D14*
X193770000Y-110490000D03*
G04 #@! TD*
D15*
G04 #@! TO.C,D2*
X217170000Y-97790000D03*
D16*
X217170000Y-95250000D03*
G04 #@! TD*
D17*
G04 #@! TO.C,J1*
X206090000Y-119380000D03*
D10*
G36*
X213023315Y-117434093D02*
X213105827Y-117446333D01*
X213186742Y-117466601D01*
X213265281Y-117494702D01*
X213340687Y-117530367D01*
X213412235Y-117573251D01*
X213479234Y-117622941D01*
X213541041Y-117678959D01*
X213597059Y-117740766D01*
X213646749Y-117807765D01*
X213689633Y-117879313D01*
X213725298Y-117954719D01*
X213753399Y-118033258D01*
X213773667Y-118114173D01*
X213785907Y-118196685D01*
X213790000Y-118280000D01*
X213790000Y-120480000D01*
X213785907Y-120563315D01*
X213773667Y-120645827D01*
X213753399Y-120726742D01*
X213725298Y-120805281D01*
X213689633Y-120880687D01*
X213646749Y-120952235D01*
X213597059Y-121019234D01*
X213541041Y-121081041D01*
X213479234Y-121137059D01*
X213412235Y-121186749D01*
X213340687Y-121229633D01*
X213265281Y-121265298D01*
X213186742Y-121293399D01*
X213105827Y-121313667D01*
X213023315Y-121325907D01*
X212940000Y-121330000D01*
X211240000Y-121330000D01*
X211156685Y-121325907D01*
X211074173Y-121313667D01*
X210993258Y-121293399D01*
X210914719Y-121265298D01*
X210839313Y-121229633D01*
X210767765Y-121186749D01*
X210700766Y-121137059D01*
X210638959Y-121081041D01*
X210582941Y-121019234D01*
X210533251Y-120952235D01*
X210490367Y-120880687D01*
X210454702Y-120805281D01*
X210426601Y-120726742D01*
X210406333Y-120645827D01*
X210394093Y-120563315D01*
X210390000Y-120480000D01*
X210390000Y-118280000D01*
X210394093Y-118196685D01*
X210406333Y-118114173D01*
X210426601Y-118033258D01*
X210454702Y-117954719D01*
X210490367Y-117879313D01*
X210533251Y-117807765D01*
X210582941Y-117740766D01*
X210638959Y-117678959D01*
X210700766Y-117622941D01*
X210767765Y-117573251D01*
X210839313Y-117530367D01*
X210914719Y-117494702D01*
X210993258Y-117466601D01*
X211074173Y-117446333D01*
X211156685Y-117434093D01*
X211240000Y-117430000D01*
X212940000Y-117430000D01*
X213023315Y-117434093D01*
X213023315Y-117434093D01*
G37*
D11*
X212090000Y-119380000D03*
D10*
G36*
X210160567Y-112734695D02*
X210255213Y-112748734D01*
X210348028Y-112771983D01*
X210438116Y-112804217D01*
X210524612Y-112845127D01*
X210606681Y-112894317D01*
X210683533Y-112951315D01*
X210754429Y-113015571D01*
X210818685Y-113086467D01*
X210875683Y-113163319D01*
X210924873Y-113245388D01*
X210965783Y-113331884D01*
X210998017Y-113421972D01*
X211021266Y-113514787D01*
X211035305Y-113609433D01*
X211040000Y-113705000D01*
X211040000Y-115655000D01*
X211035305Y-115750567D01*
X211021266Y-115845213D01*
X210998017Y-115938028D01*
X210965783Y-116028116D01*
X210924873Y-116114612D01*
X210875683Y-116196681D01*
X210818685Y-116273533D01*
X210754429Y-116344429D01*
X210683533Y-116408685D01*
X210606681Y-116465683D01*
X210524612Y-116514873D01*
X210438116Y-116555783D01*
X210348028Y-116588017D01*
X210255213Y-116611266D01*
X210160567Y-116625305D01*
X210065000Y-116630000D01*
X208115000Y-116630000D01*
X208019433Y-116625305D01*
X207924787Y-116611266D01*
X207831972Y-116588017D01*
X207741884Y-116555783D01*
X207655388Y-116514873D01*
X207573319Y-116465683D01*
X207496467Y-116408685D01*
X207425571Y-116344429D01*
X207361315Y-116273533D01*
X207304317Y-116196681D01*
X207255127Y-116114612D01*
X207214217Y-116028116D01*
X207181983Y-115938028D01*
X207158734Y-115845213D01*
X207144695Y-115750567D01*
X207140000Y-115655000D01*
X207140000Y-113705000D01*
X207144695Y-113609433D01*
X207158734Y-113514787D01*
X207181983Y-113421972D01*
X207214217Y-113331884D01*
X207255127Y-113245388D01*
X207304317Y-113163319D01*
X207361315Y-113086467D01*
X207425571Y-113015571D01*
X207496467Y-112951315D01*
X207573319Y-112894317D01*
X207655388Y-112845127D01*
X207741884Y-112804217D01*
X207831972Y-112771983D01*
X207924787Y-112748734D01*
X208019433Y-112734695D01*
X208115000Y-112730000D01*
X210065000Y-112730000D01*
X210160567Y-112734695D01*
X210160567Y-112734695D01*
G37*
D18*
X209090000Y-114680000D03*
G04 #@! TD*
D19*
G04 #@! TO.C,Motor*
X191770000Y-124460000D03*
D20*
X191770000Y-121960000D03*
G04 #@! TD*
D15*
G04 #@! TO.C,Q1*
X190500000Y-104140000D03*
D21*
X193040000Y-104140000D03*
X195580000Y-104140000D03*
G04 #@! TD*
D22*
G04 #@! TO.C,SW2*
X214612822Y-56871932D03*
X214612822Y-49871932D03*
D23*
X217112822Y-55621932D03*
X217112822Y-51121932D03*
G04 #@! TD*
G04 #@! TO.C,SW3*
X217112822Y-61017932D03*
X217112822Y-65517932D03*
D22*
X214612822Y-59767932D03*
X214612822Y-66767932D03*
G04 #@! TD*
D23*
G04 #@! TO.C,SW4*
X217112822Y-41195932D03*
X217112822Y-45695932D03*
D22*
X214612822Y-39945932D03*
X214612822Y-46945932D03*
G04 #@! TD*
D15*
G04 #@! TO.C,D1*
X190500000Y-116840000D03*
D21*
X198120000Y-116840000D03*
G04 #@! TD*
D16*
G04 #@! TO.C,RV1*
X215900000Y-73740000D03*
X215900000Y-76240000D03*
X215900000Y-78740000D03*
D24*
X212600000Y-71240000D03*
X212600000Y-81240000D03*
G04 #@! TD*
D22*
G04 #@! TO.C,SW5*
X214630000Y-92344000D03*
X214630000Y-85344000D03*
D23*
X217130000Y-91094000D03*
X217130000Y-86594000D03*
G04 #@! TD*
D13*
G04 #@! TO.C,R1*
X214630000Y-96520000D03*
D14*
X207010000Y-96520000D03*
G04 #@! TD*
G04 #@! TO.C,R2*
X196596000Y-98806000D03*
D13*
X188976000Y-98806000D03*
G04 #@! TD*
D14*
G04 #@! TO.C,R3*
X210566000Y-47244000D03*
D13*
X210566000Y-39624000D03*
G04 #@! TD*
D14*
G04 #@! TO.C,R4*
X210566000Y-49530000D03*
D13*
X210566000Y-57150000D03*
G04 #@! TD*
D14*
G04 #@! TO.C,R5*
X210566000Y-67056000D03*
D13*
X210566000Y-59436000D03*
G04 #@! TD*
D25*
G04 #@! TO.C,C2*
X203200000Y-92710000D03*
D26*
X198200000Y-92710000D03*
G04 #@! TD*
D27*
G04 #@! TO.C,MK1*
X215900000Y-35560000D03*
G04 #@! TD*
G04 #@! TO.C,MK2*
X215900000Y-127000000D03*
G04 #@! TD*
M02*
