G04 #@! TF.GenerationSoftware,KiCad,Pcbnew,5.0.0-rc2-unknown-03fa645~65~ubuntu16.04.1*
G04 #@! TF.CreationDate,2018-06-25T11:29:46+12:00*
G04 #@! TF.ProjectId,Shake_Table_PCB,5368616B655F5461626C655F5043422E,rev?*
G04 #@! TF.SameCoordinates,Original*
G04 #@! TF.FileFunction,Profile,NP*
%FSLAX46Y46*%
G04 Gerber Fmt 4.6, Leading zero omitted, Abs format (unit mm)*
G04 Created by KiCad (PCBNEW 5.0.0-rc2-unknown-03fa645~65~ubuntu16.04.1) date Mon Jun 25 11:29:46 2018*
%MOMM*%
%LPD*%
G01*
G04 APERTURE LIST*
%ADD10C,0.150000*%
G04 APERTURE END LIST*
D10*
X219710000Y-127000000D02*
X219710000Y-35560000D01*
X190500000Y-130810000D02*
X215900000Y-130810000D01*
X190500000Y-130810000D02*
G75*
G02X186690000Y-127000000I0J3810000D01*
G01*
X186690000Y-35560000D02*
X186690000Y-127000000D01*
X186690000Y-35560000D02*
G75*
G02X190500000Y-31750000I3810000J0D01*
G01*
X215900000Y-31750000D02*
X190500000Y-31750000D01*
X219710000Y-127000000D02*
G75*
G02X215900000Y-130810000I-3810000J0D01*
G01*
X215900000Y-31750000D02*
G75*
G02X219710000Y-35560000I0J-3810000D01*
G01*
M02*
