<?xml version="1.0" encoding="utf-8"?>
<!-- Generator: Adobe Illustrator 16.0.0, SVG Export Plug-In . SVG Version: 6.00 Build 0)  -->
<!DOCTYPE svg PUBLIC "-//W3C//DTD SVG 1.0//EN" "http://www.w3.org/TR/2001/REC-SVG-20010904/DTD/svg10.dtd">
<svg version="1.0" id="Layer_1" xmlns="http://www.w3.org/2000/svg" xmlns:xlink="http://www.w3.org/1999/xlink" x="0px" y="0px"
	 width="595.28px" height="841.89px" viewBox="0 0 595.28 841.89" enable-background="new 0 0 595.28 841.89" xml:space="preserve">
<g>
	<defs>
		<rect id="SVGID_1_" x="299.677" y="344.795" width="60.017" height="88.098"/>
	</defs>
	<clipPath id="SVGID_2_">
		<use xlink:href="#SVGID_1_"  overflow="visible"/>
	</clipPath>
	<path clip-path="url(#SVGID_2_)" d="M327.111,408.817c0,1.896-0.155,3.101-0.464,3.598c-0.475,0.675-1.579,1.009-3.312,1.009
		h-9.563v-44.713h13.34V408.817z M353.121,366.644v5.05h-6.198v-20.803h6.198v5.034h6.572v-6.633c0-1.245-0.488-2.311-1.457-3.207
		c-0.948-0.863-2.075-1.29-3.39-1.29h-9.633c-1.314,0-2.449,0.427-3.406,1.29c-0.956,0.896-1.437,1.961-1.437,3.207v12.156
		c-0.517-1.123-1.261-2.161-2.271-3.097c-2.039-1.847-4.473-2.771-7.299-2.771H310.08c-2.826,0-5.26,0.924-7.3,2.771
		c-2.067,1.929-3.102,4.232-3.102,6.922v51.554c0,2.71,1.034,5.021,3.102,6.918c2.04,1.88,4.474,2.816,7.3,2.816h16.485
		c0.362,0.643,0.546,1.343,0.546,2.092v4.24h14.09v-4.24c0-3.663-1.168-6.805-3.516-9.434c2.348-2.938,3.516-6.405,3.516-10.401
		V375.67c0.195,0.269,0.342,0.565,0.606,0.806c0.957,0.883,2.092,1.318,3.406,1.318h9.633c1.314,0,2.441-0.436,3.39-1.318
		c0.969-0.875,1.457-1.933,1.457-3.178v-6.654H353.121z"/>
</g>
</svg>
