{
    "results": [
        {
            "name": "Brandon Lam",
            "img": "brandonl.jpg",
            "about_me": "I am a junior at the University of Texas at Austin majoring in Computer Science. Outside of school, I play violin and video games for fun!",
            "responsibilities": "Developer, Team Lead",
            "commits": "36",
            "issues": "10",
            "unit_tests": "27"
        },
        {
            "name": "Blake Senn",
            "img": "blake.png",
            "about_me": "I am a senior at the University of Texas at Austin pursuing a degree in Computer Science and a minor in Economics. I am interested in full-stack development and machine learning. Outside of school I enjoy hiking, golf, and video games.",
            "responsibilities": "Developer - FE & BE, Researcher",
            "commits": "17",
            "issues": "8",
            "unit_tests": "0"
        },
        {
            "name": "Eileen Wang",
            "img": "eileen.png",
            "about_me": "I\"m a third year Computer Science student at The University of Texas at Austin, pursuing a minor in Economics and a certificate in Applied Statistical Modeling. Outside of school, I enjoy reading, skating, and playing video games.",
            "responsibilities": "Developer",
            "commits": "9",
            "issues": "3",
            "unit_tests": "0"
        },
        {
            "name": "Jincheng Cao",
            "img": "Jincheng.png",
            "about_me": "I am a senior at University of Texas at Austin in Mathematics. I am interested in theory and applications of machine learning. Outside of school I enjoy playing basketball, skiing, and cooking.",
            "responsibilities": "Developer",
            "commits": "4",
            "issues": "2",
            "unit_tests": "0"
        },
        {
            "name": "Eder Martinez",
            "img": "eder.png",
            "about_me": "I am a third year Computer Science student. I want to pursue a minor in the Arabic language. When I have time, I enjoy playing video games.",
            "responsibilities": "Developer",
            "commits": "8",
            "issues": "0",
            "unit_tests": "0"
        },
        {
            "name": "Euie Son",
            "img": "euie.png",
            "about_me": "I\"m Euie, a 3rd year Computer Science student at the University of Texas at Austin, pursuing minors in Critical Disability Studies and Korean. I love art and playing music.",
            "responsibilities": "Developer",
            "commits": "9",
            "issues": "1",
            "unit_tests": "0"
        }
    ]
}