SEGAAGES	15.0	3	Sega	It takes AGES to be as good as SEGA! And it won't take AGES for you to redeem this 15% discount!
DONCHAN	50.0	1	Rhythm	Get into the beat! Get In The Groove! Get this beat-tastic half off discount on all rhythm games!
BAMCO	75.0	2	Bandai Namco Entertainment	It's the BANDAI NAMCO Publisher sale! Get big discounts on titles like Klonoa and Tekken!
HOLY22	10.0	0		It's the hollidays! Please take advantage of thie 10% storewide discount so we can appease the Claus.
