G001	Rivals of Aether	33.99	0.0	30	Dan Fornace	Fighting
G002	ZeroRanger	13.49	0.0	30	System Erasure	Shoot 'em up
G003	Half-Life 2	12.99	15.0	30	Valve	First Person Shooter
G004	Fuga: Melodies of Steel	45.49	0.0	30	CyberConnect2	RPG
G005	CrossCode	21.99	0.0	30	Radical Fish Games	Action RPG
G006	Arcaea	54.0	5.0	30	lowiro	Rhythm
G007	DJMAX RESPEXT V	56.99	75.0	30	NEOWIZ	Rhythm
G008	Undertale	19.99	0.0	30	tobyfox	RPG
G009	ULTRAKILL	28.99	0.0	30	New Blood Interactive	Shooter
G010	Eschatos	16.99	0.0	30	Qute	Shoot 'em up
G011	killer7	22.79	0.0	30	Capcom	Action
G012	TEKKEN7	49.99	0.0	30	Bandai Namco Entertainment	Fighting
G013	Quake 3 Arena	19.99	0.0	30	id Software	Shooter
G014	Klonoa Phantasy Reverie Series	53.49	0.0	30	Bandai Namco Entertainment	Platformer
G015	Solatorobo: Red The Hunter	159.17	0.0	5	CyberConnect2	Action RPG
G016	Portal 2	12.99	0.0	30	Valve	Puzzle
G017	Postal 2	10.99	90.0	30	Running With Scissors	Shooter
G018	Fortnite	21.99	0.0	30	Epic Games	Shooter
G019	Monolith	8.79	0.0	30	Team D-13	Roguelike
C001	Nintendo Switch	299.99	0	30	Nintendo	8
C002	Wii U	299	0	30	Nintendo	8
C003	Playstation 4	399.99	0	30	Sony	8
C004	Playstation 3	499.99	0	30	Sony	7
C005	Playstation 2	299	0	30	Sony	6
C006	Playstation	299	0	30	Sony	5
C007	Playstation 5	499.99	0	0	Sony	9
C008	Xbox	299	0	30	Microsoft	6
C009	Xbox 360	399.99	0	30	Microsoft	7
C010	Xbox One	499	0	30	Microsoft	8
C011	Xbox Series X	499	0	30	Microsoft	9
C012	Nintendo GameCube	199	0	30	Nintendo	6
C013	Nintendo 64	199.99	0	30	Nintendo	5
C014	Wii	249.99	0	90	Nintendo	7
C015	Dreamcast	199	0	30	Sega	6
C016	Saturn	399	0	30	Sega	5
C017	Genesis	189	0	30	Sega	4
C018	Neo Geo	649	0	30	SNK	4
C019	Super Nintendo Entertainment System	199	0	30	Nintendo	4
C020	Nintendo Entertainment System	199	0	30	Nintendo	3
C021	Turbo-Grafx-16	199	0	30	NEC	4
C022	Nintendo DS	149.99	0	30	Nintendo	7
C023	Nintendo 3DS	199.99	0	30	Nintendo	8
C024	Game Boy Advance	99.99	0	30	Nintendo	6
C025	Playstation Portable	249.99	0	30	Sony	7
C026	Playstation Vita	249.99	0	30	Sony	8
C027	Steam Deck	659	0	30	Valve	9
C028	WonderSwan	48.11	0	30	Bandai	6