{
  "project_info": {
    "project_number": "532905911419",
    "firebase_url": "https://panic-open-pucp.firebaseio.com",
    "project_id": "panic-open-pucp",
    "storage_bucket": "panic-open-pucp.appspot.com"
  },
  "client": [
    {
      "client_info": {
        "mobilesdk_app_id": "1:532905911419:android:80970759cba93292",
        "android_client_info": {
          "package_name": "com.example.panic_app"
        }
      },
      "oauth_client": [
        {
          "client_id": "532905911419-t8s1r0j2cnkqiuokinqlebdng102u7ac.apps.googleusercontent.com",
          "client_type": 3
        }
      ],
      "api_key": [
        {
          "current_key": "AIzaSyBPeiFwMgdIA7ka5W8S7rqdspJmb9S1pv4"
        }
      ],
      "services": {
        "appinvite_service": {
          "other_platform_oauth_client": [
            {
              "client_id": "532905911419-t8s1r0j2cnkqiuokinqlebdng102u7ac.apps.googleusercontent.com",
              "client_type": 3
            }
          ]
        }
      }
    }
  ],
  "configuration_version": "1"
}