  [
    {
      "identifier": "CS356-2104A-01",
      "name": "Foundations of Big Data Analytics",
      "description": "This course explores the fundamental computer technologies that are required for utilizing a big data analytics applications, including how to store, pre-process, query and visualize big data, as well as how to extract the useful business information through various highly efficient data analysis techniques running on various types of computer platforms connected by various types of communication networks.",
      "start_date": "2021-09-14",
      "end_date": "2021-10-21",
      "capacity": 20
    },
    {
      "identifier": "CS349-2104A-02",
      "name": "Software Engineering",
      "description": "The course explains the traditional Software Development Life Cycle (SDLC) encompassing requirements collection and analysis, design, implementation, testing and the maintenance phases. The course also introduces principles and techniques supporting topics such as software development project management, people management, software requirements, system models, software design, verification and validation, software maintenance and enhancements, and ethical responsibilities.",
      "start_date": "2021-09-14",
      "end_date": "2021-10-21",
      "capacity": 20
    },
    {
      "identifier": "CS311-2103B-01",
      "name": "Mobile Programming",
      "description": "The course illustrates the commonalities and differences between the development process and workflow, application design methodology and principles, as well as the implementation tools for mobile computing as contrasted with those for desktop computing.",
      "start_date": "2021-08-03",
      "end_date": "2021-09-09",
      "capacity": 20
    },
    {
      "identifier": "CS341-2103B-01",
      "name": "Principles of Operating Systems",
      "description": "In this course, students are introduced to the design and the implementation concepts of modern operating systems. The topics covered include basic capabilities of operating systems, virtual memory, resource allocation and management, concurrent processes and threads, deadlock detection and prevention, protection and security, I/O and file systems, batch and interactive subsystems.",
      "start_date": "2021-08-03",
      "end_date": "2021-09-09",
      "capacity": 20
    },
    {
      "identifier": "CS228-2103A-01",
      "name": "C++ Programming",
      "description": "This course provides students an opportunity to learn C++, another object-oriented programming (OOP) language, through the development of a software application. Students will apply C++ language features to create classes and objects; and also apply object-oriented features such as inheritance, operator overloading, polymorphism, and templates to construct solutions.",
      "start_date": "2021-06-22",
      "end_date": "2021-07-29",
      "capacity": 20
    }
  ]