{
    "extensionDescription": {
        "message": "KeePassXC integration for modern web browsers",
        "description": "Name of the extension."
    },
    "addSitePreferenceButtonTitle": {
        "message": "Add Site Preferences for this URL.",
        "description": "Add button title text on Site Preferences tab."
    },
    "allowIframeButtonTitle": {
        "message": "Allows Cross-Origin iframes for the current page.",
        "description": "Allow Cross-Origin iframes button title text."
    },
    "connectButtonTitle": {
        "message": "Connect current active database to KeePassXC-Browser.",
        "description": "Connect button title text."
    },
    "copyDebugInfoButtonTitle": {
        "message": "Copy debug info to clipboard.",
        "description": "Copy debug info button title text on About tab."
    },
    "dismissHttpAuthButtonTitle": {
        "message": "Dismisses Basic HTTP Auth.",
        "description": "Dismiss HTTP Auth button title text."
    },
    "reconnectButtonTitle": {
        "message": "Reconnect current active database to KeePassXC-Browser.",
        "description": "Reconnect button title text."
    },
    "redetectButtonTitle": {
        "message": "Redetects all input fields on the page.",
        "description": "Redetect login fields button title text."
    },
    "reloadButtonTitle": {
        "message": "Reloads the extension and reconnects to KeePassXC.",
        "description": "Reload button title text."
    },
    "removeConnectedDatabaseButtonTitle": {
        "message": "Remove connected database from KeePassXC-Browser.",
        "description": "Remove button title on Connected Databases tab."
    },
    "removeCustomLoginFieldsButtonTitle": {
        "message": "Remove Custom Login Fields for this URL.",
        "description": "Remove button title on Custom Login Fields tab."
    },
    "removeSitePreferencesButtonTitle": {
        "message": "Remove Site Preferences for this URL.",
        "description": "Remove button title on Site Preferences tab."
    },
    "reopenDatabaseButtonTitle": {
        "message": "Reopen current active database.",
        "description": "Reopen database button title text."
    },
    "usernameButtonTitle": {
        "message": "Adds Username-only Detection to the current page.",
        "description": "Add Username-only detection button title text."
    },
    "contextMenuFillUsernameAndPassword": {
        "message": "Fill Username and Password",
        "description": "Context menu item for filling both username and password."
    },
    "contextMenuFillPassword": {
        "message": "Fill Password Only",
        "description": "Context menu item for filling password."
    },
    "contextMenuFillTOTP": {
        "message": "Fill TOTP",
        "description": "Context menu item for filling Time-based One Time Password."
    },
    "contextMenuShowPasswordGeneratorIcons": {
        "message": "Show Password Generator Icons",
        "description": "Show password generator icon on every password input field."
    },
    "contextMenuSaveCredentials": {
        "message": "Save Credentials",
        "description": "Save credentials using the credential banner."
    },
    "contextMenuShowPasswordGenerator": {
        "message": "Show Password Generator",
        "description": "Show password generator text."
    },
    "contextMenuFillAttribute": {
        "message": "Fill Attribute…",
        "description": "Context menu parent item for filling a custom attribute."
    },
    "contextMenuRequestGlobalAutoType": {
        "message": "Request Global Auto-Type",
        "description": "Global Auto-Type shortcut text."
    },
    "multipleCredentialsDetected": {
        "message": "HTTP authentication with multiple credentials detected. Click on the extension icon to choose the correct one.",
        "description": "Notification when HTTP Authentication has multiple credentials detected."
    },
    "errorMessageUnknown": {
        "message": "Unknown error.",
        "description": "Unknown error."
    },
    "errorMessageDatabaseNotOpened": {
        "message": "Database not opened.",
        "description": "Database not opened."
    },
    "errorMessageDatabaseHash": {
        "message": "Database hash not received.",
        "description": "Database hash not received."
    },
    "errorMessageClientPublicKey": {
        "message": "Client public key not received.",
        "description": "Client public key not received."
    },
    "errorMessageDecrypt": {
        "message": "Cannot decrypt message.",
        "description": "Cannot decrypt message."
    },
    "errorMessageTimeout": {
        "message": "Cannot connect to KeePassXC. Check that browser integration is enabled in KeePassXC settings.",
        "description": "Cannot connect to KeePassXC. Check that browser integration is enabled in KeePassXC settings."
    },
    "errorMessageCanceled": {
        "message": "Action canceled or denied.",
        "description": "Action canceled or denied."
    },
    "errorMessageEncrypt": {
        "message": "Message encryption failed. Is KeePassXC running?",
        "description": "Message encryption failed. Is KeePassXC running?"
    },
    "errorMessageAssociate": {
        "message": "KeePassXC association failed, try again.",
        "description": "KeePassXC association failed, try again."
    },
    "errorMessageKeyExchange": {
        "message": "Key exchange was not successful.",
        "description": "Key exchange was not successful."
    },
    "errorMessageEncryptionKey": {
        "message": "Encryption key is not recognized.",
        "description": "Encryption key is not recognized."
    },
    "errorMessageSavedDatabases": {
        "message": "No saved databases found.",
        "description": "No saved databases found."
    },
    "errorMessageIncorrectAction": {
        "message": "Incorrect action.",
        "description": "Incorrect action."
    },
    "errorMessageEmptyMessage": {
        "message": "Empty message received.",
        "description": "Empty message received."
    },
    "errorMessageNoURL": {
        "message": "No URL provided.",
        "description": "No URL provided."
    },
    "errorMessageNoLogins": {
        "message": "No logins found.",
        "description": "No logins found."
    },
    "errorMessagePaswordLengthExceeded": {
        "message": "Filled password is longer than field's allowed max length.",
        "description": "Error notification text shown when filled password is longer than defined maxLength of the input field."
    },
    "errorMessageNoGroupsFound": {
        "message": "No groups found.",
        "description": "No groups found."
    },
    "errorMessageCannotCreateNewGroup": {
        "message": "Cannot create new group.",
        "description": "Cannot create new group."
    },
    "errorMessageNoValidUuidProvided": {
        "message": "No valid UUID provided.",
        "description": "No valid UUID provided."
    },
    "errorMessageAccessToAllEntriesDenied": {
        "message": "Access to all entries denied.",
        "description": "Access to all entries denied."
    },
    "errorMessagePasskeysAttestationNotSupported": {
        "message": "Attestation not supported.",
        "description": "Attestation not supported."
    },
    "errorMessagePasskeysCredentialIsExcluded": {
        "message": "Credential is excluded.",
        "description": "Credential is excluded."
    },
    "errorMessagePasskeysRequestCanceled": {
        "message": "Passkeys request canceled.",
        "description": "Passkeys request canceled."
    },
    "errorMessagePasskeysInvalidUserVerification": {
        "message": "Invalid user verification.",
        "description": "Invalid user verification."
    },
    "errorMessagePasskeysEmptyPublicKey": {
        "message": "Empty public key.",
        "description": "Empty public key."
    },
    "errorMessagePasskeysInvalidUrlProvided": {
        "message": "Invalid URL provided.",
        "description": "Invalid URL provided."
    },
    "errorMessagePasskeysOriginNotAllowed": {
        "message": "Origin is empty or not allowed.",
        "description": "Origin is empty or not allowed."
    },
    "errorMessagePasskeysDomainNotValid": {
        "message": "Effective domain is not a valid domain.",
        "description": "Effective domain is not a valid domain."
    },
    "errorMessagePasskeysDomainRpIdMismatch": {
        "message": "Origin and RP ID do not match.",
        "description": "Origin and RP ID do not match."
    },
    "errorMessagePasskeysNoSupportedAlgorithms": {
        "message": "No supported algorithms were provided.",
        "description": "No supported algorithms were provided."
    },
    "errorMessagePasskeysWaitforLifeTimer": {
        "message": "Wait for timer to expire.",
        "description": "Wait for timer to expire."
    },
    "errorMessagePasskeysUnknownError": {
        "message": "Unknown passkeys error.",
        "description": "Unknown passkeys error."
    },
    "errorMessagePasskeysInvalidChallenge": {
        "message": "Challenge is shorter than required minimum length.",
        "description": "Challenge is shorter than required minimum length."
    },
    "errorMessagePasskeysInvalidUserId": {
        "message": "user.id does not match the required length.",
        "description": "user.id does not match the required length."
    },
    "errorMessagePasskeysContextIsNotSecure": {
        "message": "Context is not secure.",
        "description": "Context is not secure."
    },
    "errorNotConnected": {
        "message": "Not connected to KeePassXC.",
        "description": "Error notification shown when not connected to KeePassXC."
    },
    "errorCurrentDatabaseNotConnected": {
        "message": "Current database is not connected.",
        "description": "Error notification shown when current database is not connected during action."
    },
    "passwordGeneratorErrorTooLong": {
        "message": "Error: The generated password is longer than the allowed length!",
        "description": "A warning text shown in the password generator."
    },
    "passwordGeneratorErrorTooLongCut": {
        "message": "It has been cut to fit the length.",
        "description": "A warning text shown in the password generator."
    },
    "passwordGeneratorErrorTooLongRemember": {
        "message": "Please remember the new password!",
        "description": "A warning text shown in the password generator."
    },
    "passwordGeneratorGenerateText": {
        "message": "Generate password.",
        "description": "Password icon title text."
    },
    "passwordGeneratorNotSupported": {
        "message": "Launching the password generator is not supported in this KeePassXC version. Please update KeePassXC to a newer version."
    },
    "usernameFieldText": {
        "message": "Fill credentials from KeePassXC.",
        "description": "Username field icon hover text."
    },
    "usernameFieldTextNoCredentials": {
        "message": "No credentials to fill.",
        "description": "Username field icon hover text when no credentials are."
    },
    "usernameLockedFieldText": {
        "message": "Database is locked.",
        "description": "Username field icon hover text when database is locked."
    },
    "usernameDisconnectedFieldText": {
        "message": "KeePassXC is disconnected.",
        "description": "Username field icon hover text when KeePassXC is disconnected."
    },
    "totp": {
        "message": "TOTP",
        "description": "TOTP text."
    },
    "totpFieldText": {
        "message": "Fill TOTP from KeePassXC",
        "description": "OTP field icon hover text."
    },
    "defineClose": {
        "message": "Close",
        "description": "Close button text when choosing Custom Login Fields."
    },
    "defineSkip": {
        "message": "Skip",
        "description": "Skip button text when choosing Custom Login Fields."
    },
    "defineMore": {
        "message": "Show more",
        "description": "More button text when choosing Custom Login Fields."
    },
    "defineReset": {
        "message": "Reset",
        "description": "Reset button text when choosing Custom Login Fields."
    },
    "defineConfirm": {
        "message": "Confirm",
        "description": "Confirm button text when choosing Custom Login Fields."
    },
    "defineAlreadySelected": {
        "message": "Login fields for this page are already selected and will be overwritten.",
        "description": "A text shown when custom credentials fields are already set for the page."
    },
    "defineClearData": {
        "message": "Clear saved data",
        "description": "Clear save data button text when choosing Custom Login Fields."
    },
    "defineStringField": {
        "message": "String field",
        "description": "Text for string field."
    },
    "defineChooseUsername": {
        "message": "Choose a username field",
        "description": "Choosing a username field text when choosing Custom Login Fields."
    },
    "defineChoosePassword": {
        "message": "Choose a password field",
        "description": "Choosing a password field text when choosing Custom Login Fields."
    },
    "defineChooseTOTP": {
        "message": "Choose a TOTP field",
        "description": "Choosing a TOTP field text when choosing Custom Login Fields."
    },
    "defineChooseStringFields": {
        "message": "Choose String Fields",
        "description": "Choose String Fields a selection text when choosing Custom Login Fields."
    },
    "defineHelpText": {
        "message": "Please confirm your selection or choose more fields as String fields.",
        "description": "Confirm a selection text when choosing Custom Login Fields which contains string fields."
    },
    "defineKeyboardText": {
        "message": "You can also use the numbers to choose the input fields from keyboard.",
        "description": "Help text when choosing Custom Login Fields."
    },
    "defineChooseCustomLoginFieldText": {
        "message": "Choose a Custom Login Field",
        "description": "Help text for Custom Login Field banner."
    },
    "username": {
        "message": "Username",
        "description": "General text for username."
    },
    "password": {
        "message": "Password",
        "description": "General text for password."
    },
    "stringFields": {
        "message": "String Fields",
        "description": "General text for a String Fields."
    },
    "credentialsNoUsername": {
        "message": "- no username -",
        "description": "Shown when no username is set in the credentials."
    },
    "credentialsNoLoginsFound": {
        "message": "No logins found.",
        "description": "Shown when no credentials are found for the current page."
    },
    "credentialsMultipleFound": {
        "message": "More than one login was found in KeePassXC!",
        "description": "Alert message when trying to fill username and/or password when multiple credentials are found."
    },
    "credentialsMultipleFoundSecondLine": {
        "message": "Click the KeePassXC-Browser icon for more options.",
        "description": "Alert message when trying to fill username and/or password when multiple credentials are found."
    },
    "credentialsNoUsernameFound": {
        "message": "No credentials for the given username found.",
        "description": "Alert message when no credentials are found for the given username."
    },
    "credentialsNoTOTPFound": {
        "message": "No TOTP found.",
        "description": "Alert message when no TOTP is found."
    },
    "credentialExpired": {
        "message": "Expired",
        "description": "If a credential is expired, this is appended to the title label."
    },
    "fieldsFill": {
        "message": "Error: Cannot find fields to fill in.",
        "description": "Alert message when no fields are found to fill in."
    },
    "fieldsNoPasswordField": {
        "message": "Error: Unable to find a password field.",
        "description": "Message shown when no password fields are found."
    },
    "fieldsPasswordFillNotAccepted": {
        "message": "Filling password to a plain text field is prevented.",
        "description": "Message shown when password fill to a plain text field is prevented."
    },
    "rememberNothingChanged": {
        "message": "Error: Could not detect changed credentials.",
        "description": "Message shown when trying to save credentials that haven't changed."
    },
    "popupTitle": {
        "message": "KeePassXC - Popup",
        "description": "Popup window title."
    },
    "popupSettingsText": {
        "message": "Settings",
        "description": "Popup Settings button text."
    },
    "popupChooseCredentialsText": {
        "message": "Choose Custom Login Fields",
        "description": "Popup credential choosing button text."
    },
    "popupConnectButton": {
        "message": "Connect",
        "description": "Popup Connect button text."
    },
    "popupReconnectButton": {
        "message": "Reconnect",
        "description": "Popup Reconnect button text."
    },
    "popupRedetectButton": {
        "message": "Redetect login fields",
        "description": "Popup Redetect login fields button text."
    },
    "popupReloadButton": {
        "message": "Reload",
        "description": "Popup Reload button text."
    },
    "popupReopenButton": {
        "message": "Reopen database",
        "description": "Popup reopen database button text."
    },
    "popupUsernameButton": {
        "message": "Add Username-only option for the site",
        "description": "Button text for adding Username-only option."
    },
    "popupAllowIframeButton": {
        "message": "Allow Cross-Origin iframes for the site",
        "description": "Button text for allowing Cross-Origin iframes option."
    },
    "popupErrorEncountered": {
        "message": "KeePassXC-Browser has encountered an error:",
        "description": "A text shown above error message in the popup."
    },
    "popupUpdateAvailable": {
        "message": "You are using an old version of KeePassXC.",
        "description": "Popup warning message about old version of KeePassXC."
    },
    "popupDownloadNewVersion": {
        "message": "Please download the latest version from keepassxc.org",
        "description": "Popup warning message link when KeePassXC version is not up-to-date."
    },
    "popupGettingStartedText": {
        "message": "Are you a first time user? Please check our Getting Started Guide.",
        "description": "Popup information message about Getting Started Guide."
    },
    "popupGettingStartedLinkText": {
        "message": "Getting Started Guide - Setup Browser Integration",
        "description": "Popup Getting Started Guide link text."
    },
    "popupAlertHide": {
        "message": "Hide and don't show again.",
        "description": "Hide alert close button title."
    },
    "popupTroubleshootingText": {
        "message": "Cannot connect to KeePassXC? Maybe our wiki page could help.",
        "description": "Popup information message about Troubleshooting Guide."
    },
    "popupTroubleshootingLinkText": {
        "message": "Troubleshooting Guide",
        "description": "Popup Troubleshooting Guide link text."
    },
    "popupCheckingStatus": {
        "message": "Checking status...",
        "description": "Checking status message in popup."
    },
    "popupNotConfigured": {
        "message": "KeePassXC-Browser has not been configured. Click the connect button to pair with KeePassXC.",
        "description": "A popup message shown when the extension has not been connected to KeePassXC."
    },
    "popupNeedReconfigure": {
        "message": "KeePassXC-Browser has been disconnected from KeePassXC.",
        "description": "A popup message shown when the extension has been disconnected from KeePassXC."
    },
    "popupNeedReconfigureMessage": {
        "message": "Click the reconnect button to establish a new connection.",
        "description": "A popup message shown when reconnect is needed."
    },
    "popupConfiguredNotAssociated": {
        "message": "KeePassXC-Browser has not yet connected to KeePassXC but has been configured using the identifier: $1",
        "description": "A popup message shown when KeePassXC is not connected but configured."
    },
    "popupConfiguredAndAssociated": {
        "message": "KeePassXC-Browser is connected to KeePassXC and has been configured using the following identifier: $1",
        "description": "A popup message when a connection to KeePassXC is successful."
    },
    "popupUsernameFieldDetected": {
        "message": "Only a single username field was detected. Add the URL to Site Preferences with Username-only option enabled?",
        "description": "Text shown when page can be added to Site Preferences with Username-only option enabled."
    },
    "popupIframeDetected": {
        "message": "A Cross-Origin iframe was detected. Add the URL to Site Preferences with Allow Cross-Origin iframes option enabled?",
        "description": "Text shown when page can be added to Site Preferences with Allow Cross-Origin iframes option enabled."
    },
    "rememberInfoText": {
        "message": "Username or password changed! Save it?",
        "description": "Message when username or password has changed."
    },
    "rememberSaving": {
        "message": "Credentials will be saved in connected database with identifier $1",
        "description": "A message when saving or updating credentials."
    },
    "rememberNewUsername": {
        "message": "The following username is currently not saved: $1",
        "description": "A message shown when a new username is detected when saving credentials."
    },
    "rememberUsernameExists": {
        "message": "The credentials with the used username are marked bold: $1",
        "description": "A message shown when an existing username is detected when saving credentials."
    },
    "rememberChooseCredentials": {
        "message": "Please choose the credentials you want to update.",
        "description": "A message shown choosing what credentials user wants to update."
    },
    "rememberChooseGroup": {
        "message": "Please choose a group to store new credentials.",
        "description": "A message shown choosing what group user wants to use for new credentials."
    },
    "rememberInfoDefaultGroupNotFound": {
        "message": "Default group created in connected database.",
        "description": "Info message shown when default group set cannot be found."
    },
    "rememberErrorCreatingNewGroup": {
        "message": "New group(s) cannot be created.",
        "description": "Error message shown when new groups cannot be created."
    },
    "rememberErrorPasswordNotChanged": {
        "message": "Credentials not updated. The password has not been changed.",
        "description": "Error message shown when credential password is not changed."
    },
    "rememberErrorCannotSaveCredentials": {
        "message": "Credentials cannot be saved or updated.",
        "description": "Error message shown when credentials cannot be saved or updated."
    },
    "rememberErrorDatabaseClosed": {
        "message": "Credentials cannot be saved or updated to a closed database.",
        "description": "Error message shown when credentials cannot be saved or updated and the database is closed."
    },
    "rememberCredentialsNotSaved": {
        "message": "Operation cancelled. Credentials are not updated.",
        "description": "Message shown when saving operation was cancelled."
    },
    "rememberCredentialsSaved": {
        "message": "New credentials with username $1 saved.",
        "description": "Message shown when new credentials are saved."
    },
    "rememberCredentialsUpdated": {
        "message": "Credentials with username $1 updated.",
        "description": "Message shown when new credentials are successfully updated."
    },
    "rememberCredentialsExists": {
        "message": "Identical credentials already exists. Nothing to update.",
        "description": "Message shown when new credentials already found in database."
    },
    "rememberEmptyUsername": {
        "message": "(empty)",
        "description": "Means an empty username."
    },
    "rememberNoPassword": {
        "message": "Please fill the password field before saving credentials.",
        "description": "Message shown when no password is set when saving credentials."
    },
    "popupLoginText": {
        "message": "Select the login information you would like to get entered into the page.",
        "description": "A popup message shown when one or multiple credentials are present."
    },
    "popupFilterText": {
        "message": "Filter:",
        "description": "Text for login credentials quick filter."
    },
    "popupAuthText": {
        "message": "Select the login information you would like to get logged in with.",
        "description": "A popup message shown when doing HTTP Authentication with multiple credentials present."
    },
    "popupMultiplePasswordFields": {
        "message": "More than one password field found on this page. Right-click one of the password fields, and choose one of:",
        "description": "A popup message shown when web page has multiple password fields."
    },
    "popupUsername": {
        "message": "Username:",
        "description": "A username field name shown on credential update."
    },
    "popupButtonNew": {
        "message": "New",
        "description": "New button text in popup when updating credentials."
    },
    "popupButtonUpdate": {
        "message": "Update",
        "description": "Update button text in popup when updating credentials."
    },
    "popupButtonCancel": {
        "message": "Cancel",
        "description": "Cancel button text in popup when updating credentials."
    },
    "popupButtonBack": {
        "message": "Back",
        "description": "Back button text in popup when updating credentials."
    },
    "popupButtonIgnore": {
        "message": "Don't ask again for this site",
        "description": "Ignore button text in popup or in notification when updating credentials."
    },
    "popupButtonClose": {
        "message": "Close",
        "description": "Close button text in popup or in notification."
    },
    "popupButtonDismissHttpAuth": {
        "message": "Dismiss and show the default authentication dialog",
        "description": "Dismiss button text when in HTTP Authentication popup."
    },
    "optionsTitle": {
        "message": "Settings | KeePassXC-Browser",
        "description": "Options page title."
    },
    "optionsGeneralSettingsTab": {
        "message": "General Settings",
        "description": "General Settings tab text."
    },
    "optionsConnectedDatabasesTab": {
        "message": "Connected Databases",
        "description": "Connected Databases tab text."
    },
    "optionsCustomFieldsTab": {
        "message": "Custom Login Fields",
        "description": "Saved Custom Login Fields tab text."
    },
    "optionsSitePreferencesTab": {
        "message": "Site Preferences",
        "description": "Site Preferences fields tab text."
    },
    "optionsAboutTab": {
        "message": "About",
        "description": "About tab text."
    },
    "optionsMenuGeneral": {
        "message": "General",
        "description": "General settings page header."
    },
    "optionsMenuConnectedDatabases": {
        "message": "Connected Databases",
        "description": "Connected Databases page header."
    },
    "optionsMenuCustomFields": {
        "message": "Custom Login Fields",
        "description": "Custom Login Fields page header."
    },
    "optionsMenuSitePreferences": {
        "message": "Site Preferences",
        "description": "Site Preferences page header."
    },
    "optionsMenuAbout": {
        "message": "About",
        "description": "About page header."
    },
    "optionsConfigureShortcuts": {
        "message": " Configure shortcuts",
        "description": "Keyboard shortcut button and title text."
    },
    "optionsButtonSave": {
        "message": "Save",
        "description": "Save button text."
    },
    "optionsButtonConnect": {
        "message": "Connect",
        "description": "Connect button text."
    },
    "optionsButtonRemove": {
        "message": "Remove",
        "description": "Remove button text."
    },
    "optionsButtonAdd": {
        "message": "Add",
        "description": "Add button text."
    },
    "optionsButtonUpdate": {
        "message": "Check for updates",
        "description": "Check for updates button text."
    },
    "optionsButtonRemoveNow": {
        "message": "Yes, remove now",
        "description": "Confirm button text when removing database key or Custom Login Fields."
    },
    "optionsButtonCancel": {
        "message": "Cancel",
        "description": "Cancel button text when removing database key or Custom Login Fields."
    },
    "optionsButtonReset": {
        "message": "Reset",
        "description": "Reset button text for keyboard shortcuts."
    },
    "optionsButtonImport": {
        "message": "Import settings",
        "description": "Import settings button text."
    },
    "optionsButtonExport": {
        "message": "Export settings",
        "description": "Export settings button text."
    },
    "optionsLabelDefaultGroup": {
        "message": "Default group for saving new passwords:",
        "description": "Default group options text."
    },
    "optionsDefaultGroupHelpText": {
        "message": "Separate the group with slashes, for example: Group/ChildGroup.",
        "description": "Default group help text."
    },
    "optionsLabelDefaultPasskeyGroup": {
        "message": "Default group for saving new passkeys:",
        "description": "Default passkey group options text."
    },
    "optionsLabelDefaultGroupCheckboxText": {
        "message": "Always ask where to save new credentials",
        "description": "Default group checkbox help text."
    },
    "optionsLabelDefaultGroupCheckboxHelpText": {
        "message": "When enabled, the popup shows a group listing.",
        "description": "Default checkbox explanation help text."
    },
    "optionsCheckboxUsePasswordGenerator": {
        "message": "Activate password generator icons",
        "description": "Activate password generator icons checkbox text."
    },
    "optionsCheckboxUsernameIcons": {
        "message": "Activate username field icons",
        "description": "Activate username field icons textbox text."
    },
    "optionsUseObserver": {
        "message": "Use dynamic input field detection",
        "description": "Use dynamic input field detection checkbox text."
    },
    "optionsUseObserverHelpText": {
        "message": "Useful with pages that use popups or dynamic dialogs. Disable the feature to reduce CPU load on slower machines. When disabled credentials can be only inserted using keyboard shortcuts, the context menu or the extension popup.",
        "description": "Use dynamic input field detection help text."
    },
    "optionsCheckboxOTPIcons": {
        "message": "Activate 2FA/OTP field icons",
        "description": "Activate OTP field icons textbox text."
    },
    "optionsCheckboxAutoRetrieveCredentials": {
        "message": "Automatically retrieve credentials",
        "description": "Automatically retrieve credentials checkbox text."
    },
    "optionsCheckboxAutomaticReconnect": {
        "message": "Automatically reconnect to KeePassXC",
        "description": "Auto-reconnect checkbox text."
    },
    "optionsAutomaticReconnectWarning": {
        "message": "Warning! This feature is experimental. Use at your own risk.",
        "description": "Auto-reconnect warning message."
    },
    "optionsCheckboxAutoFillSingleEntry": {
        "message": "Automatically fill in single-credential entries",
        "description": "Automatically fill-in single credential entry checkbox text."
    },
    "optionsCheckboxAutoFillRelevantCredential": {
        "message": "Automatically fill in relevant credential entries",
        "description": "Automatically fill-in relevant credential entry checkbox text."
    },
    "optionsCheckboxAutoFillSingleTotp": {
        "message": "Automatically fill in single TOTP entries",
        "description": "Automatically fill-in single TOTP entries checkbox text."
    },
    "optionsCheckboxAutoCompleteUsernames": {
        "message": "Activate autocomplete for username fields",
        "description": "Activate autocomplete for username fields checkbox text."
    },
    "optionsCheckboxShowGroupNameInAutocomplete": {
        "message": "Display the group name in autocomplete list when credentials are from different groups",
        "description": "Show group name in autocomplete checkbox text."
    },
    "optionsCheckboxAutoSubmit": {
        "message": "Auto-submit login forms",
        "description": "Auto-submit checkbox text."
    },
    "optionsAutoSubmitHelpText": {
        "message": "Automatically submits selected credentials. This is disabled for single entry auto-fill.",
        "description": "Auto-submit help text."
    },
    "optionsCheckboxShowNotifications": {
        "message": "Show notifications",
        "description": "Show notifications checkbox text."
    },
    "optionsCheckboxUseMonochromeToolbarIcon": {
        "message": "Use monochrome toolbar icon",
        "description": "Use monochrome toolbar icon checkbox text."
    },
    "optionsCheckboxUseCompactMode": {
        "message": "Use compact mode",
        "description": "Whether the compact mode (legacy dropdown) should be enabled."
    },
    "optionsSaveDomainOnly": {
        "message": "Save domain only",
        "description": "Save domain only checkbox text."
    },
    "optionsCheckboxShowLoginNotifications": {
        "message": "Show a banner on the page when new credentials can be saved to the database",
        "description": "Show login notifications checkbox text."
    },
    "optionsRedirectAllowance": {
        "message": "Number of allowed redirects: $1",
        "description": "Redirect allowance range input text."
    },
    "optionsRedirectAllowanceHelpText": {
        "message": "How many redirects are allowed until the banner disappears. Default value is 3. Maximum is infinite.",
        "description": "Redirect allowance help text."
    },
    "optionsCheckboxAutoFillAndSend": {
        "message": "Allow filling HTTP Basic Auth credentials",
        "description": "Allow filling HTTP Basic Auth credentials checkbox text."
    },
    "optionsDebugLogging": {
        "message": "Debug logging",
        "description": "Debug logging checkbox text."
    },
    "optionsDebugLoggingHelpText": {
        "message": "Enable debug logging. Additional console messages will be visible in both background and content scripts.",
        "description": "Debug logging help text."
    },
    "optionsRadioText": {
        "message": "Check for updates of KeePassXC:",
        "description": "Text above radio buttons in the settings page."
    },
    "optionsRadioThreeDays": {
        "message": "every three days",
        "description": "Radio button text."
    },
    "optionsRadioWeek": {
        "message": "every week",
        "description": "Radio button text."
    },
    "optionsRadioMonth": {
        "message": "every month",
        "description": "Radio button text."
    },
    "optionsRadioNever": {
        "message": "never",
        "description": "Radio button text."
    },
    "optionsThemeSelectionHeader": {
        "message": "Color theme",
        "description": "Theme selection header text."
    },
    "optionsCredentialSortSelectionHeader": {
        "message": "Sort matching credentials by",
        "description": "Credential sort option header text."
    },
    "optionsThemeSelection": {
        "message": "Select color theme",
        "description": "Theme selection title text."
    },
    "optionsThemeSystem": {
        "message": "System",
        "description": "System theme text."
    },
    "optionsThemeDark": {
        "message": "Dark",
        "description": "Dark theme text."
    },
    "optionsThemeLight": {
        "message": "Light",
        "description": "Light theme text."
    },
    "optionsKeyboardShortcutsHeader": {
        "message": "Keyboard shortcuts",
        "description": "Keyboard shortcut header text."
    },
    "optionsUsePasswordGeneratorHelpText": {
        "message": "Adds an icon to password fields for generating a new password.",
        "description": "Password Generator option help text."
    },
    "optionsUsePasswordGeneratorHelpTextSecond": {
        "message": "Passwords are generated by KeePassXC using your password generation profile.",
        "description": "Password Generator option help text, second part."
    },
    "optionsPredefinedSiteList": {
        "message": "Predefined sites",
        "description": "Predefined site list details button text."
    },
    "optionsUsePredefinedSites": {
        "message": "Use predefined sites for compatibility",
        "description": "Use predefined sites checkbox text."
    },
    "optionsUsePredefinedSitesHelpText": {
        "message": "Adds common sites that have username-only login forms to the Site Preferences.",
        "description": "Use predefined sites option help text."
    },
    "optionsShowLoginFormIconHelpText": {
        "message": "Adds an icon to username fields for filling credentials with a single mouse click.",
        "description": "Username field icon option help text."
    },
    "optionsShowOTPIconHelpText": {
        "message": "Adds an icon to input fields that are recognized as OTP/2FA.",
        "description": "OTP field icon option help text."
    },
    "optionsHideIconsAlertText": {
        "message": "You can also hide icons manually when needed with shift+click.",
        "description": "Hide icons alert text text."
    },
    "optionsAutoRetrieveCredentialsHelpText": {
        "message": "KeePassXC-Browser will immediately retrieve credentials when a tab is activated.",
        "description": "Auto-Retrive Credentials option help text."
    },
    "optionsAutomaticReconnectHelpText": {
        "message": "Reconnects automatically to KeePassXC when it is detected.",
        "description": "Auto-reconnect option help text."
    },
    "optionsAutoFillSingleEntryHelpText": {
        "message": "Let KeePassXC-Browser automatically fill in credentials if it receives only a single entry.",
        "description": "Auto-Fill Single Entry option help text."
    },
    "optionsAutoFillRelevantCredentialHelpText": {
        "message": "Automatically fill in the relevant credential if a second fill is needed.",
        "description": "Auto-Fill Relevant Credential option help text."
    },
    "optionsAutoFillSingleEntryWarning": {
        "message": "Warning! Using auto-fill is not safe. Use at your own risk. KeePassXC-Browser automatically tries to detect login fields. However, they may be detected incorrectly, possibly filling sensitive data to unsafe input fields.",
        "description": "Auto-Fill Single Entry warning text."
    },
    "optionsAutoFillSingleTotpHelpText": {
        "message": "Let KeePassXC-Browser automatically fill in TOTP fields if it receives only a single entry.",
        "description": "Auto-Fill Single TOTP field option help text."
    },
    "optionsAutocompleteUsernamesHelpText": {
        "message": "Show a dropdown list containing available credentials for all username fields on a page.",
        "description": "Autocomplete Usernames option help text."
    },
    "optionsShowGroupNameInAutocompleteHelpText": {
        "message": "When credentials are returned from different groups, the group name will be shown. Only affects the compact mode.",
        "description": "Show group name in autocomplete help text."
    },
    "optionsShowNotificationsHelpText": {
        "message": "Show notifications for errors and when user interaction is required.",
        "description": "Show notifications option help text."
    },
    "optionsUseMonochromeToolbarIconHelpText": {
        "message": "Use a monochrome icon with colored badges in toolbar that adapts to light/dark browser theme.",
        "description": "Use monochrome toolbar icon option help text."
    },
    "optionsUseCompactModeHelpText": {
        "message": "Use a compact version of the dropdown list to select credentials.",
        "description": "Use compact (legacy) mode help text."
    },
    "optionsSaveDomainOnlyHelpText": {
        "message": "When saving new credentials, save only the domain instead of full URL.",
        "description": "Save domain only option help text."
    },
    "optionsSaveDomainOnlyCustomLoginHelpText": {
        "message": "When saving new Custom Login Fields, save only the domain instead of full URL.",
        "description": "Save domain only option help text."
    },
    "optionsDownloadFaviconAfterSave": {
        "message": "Download favicon after save",
        "description": "Download favicon after save checkbox label text."
    },
    "optionsDownloadFaviconAfterSaveHelpText": {
        "message": "Favicon will be automatically downloaded for the new credential.",
        "description": "Download favicon after save help text."
    },
    "optionsAutoFillAndSendHelpText": {
        "message": "If credentials are found for a page and the login-type is an HTTP Basic Auth request, KeePassXC-Browser tries to login automatically with the first given credentials. When multiple credentials are present, the extension popup can be used to choose the correct one. Even when this feature is enabled, it is still possible to enter HTTP Basic Auth login manually.",
        "description": "Auto-Fill And Send option help text."
    },
    "optionsAutoFillAndSendHelpTextSecond": {
        "message": "An HTTP Basic Auth dialog looks like this:",
        "description": "HTTP Basic Auth image help text."
    },
    "optionsClearCredentialsTimeout": {
        "message": "Clear credentials from non-active tabs after (seconds, 0-3600).",
        "description": "Clear credentials label text."
    },
    "optionsClearCredentialsTimeoutHelpText": {
        "message": "Credentials are cleared from background tabs after the timeout and permissions for those pages will be asked again.",
        "description": "Clear credentials timeout help text."
    },
    "optionsVersionInfoText": {
        "message": "KeePassXC-Browser needs KeePassXC to retrieve credentials.",
        "description": "Settings page version info text."
    },
    "optionsVersionDownload": {
        "message": "You can download the latest stable version from $1",
        "description": "Settings page download link."
    },
    "optionsVersionRunning": {
        "message": "You are running KeePassXC version: $1",
        "description": "Settings page info text of user's KeePassXC version."
    },
    "optionsLatestVersion": {
        "message": "Latest available version of KeePassXC: $1",
        "description": "Settings page info text about the latest KeePassXC version."
    },
    "optionsKeePassXCVersionRequired": {
        "message": "Requires KeePassXC version: $1",
        "description": "KeePassXC version requirement text."
    },
    "optionsDefault": {
        "message": "Default: $1",
        "description": "Default setting text."
    },
    "optionsInfinite": {
        "message": "Infinite: $1",
        "description": "Infinite setting text."
    },
    "optionsRecommended": {
        "message": "Recommended: $1",
        "description": "Recommended setting text."
    },
    "optionsShortcutsSuccess": {
        "message": "Shortcut for $1 has been successfully changed.",
        "description": "Message for successful keyboard shortcut change."
    },
    "optionsShortcutsInfo": {
        "message": "Shortcut for $1 has been reset.",
        "description": "Info message for changing keyboard shortcuts."
    },
    "optionsShortcutsDanger": {
        "message": "Error: Shortcut for $1 has not been changed!",
        "description": "Error message for changing keyboard shortcuts."
    },
    "optionsImportExportSettings": {
        "message": "Import/Export settings",
        "description": "Settings page header text for import/export."
    },
    "optionsImportSettingsDialogTitle": {
        "message": "Import settings from external file?",
        "description": "Import settings confirmation dialog title text."
    },
    "optionsImportSettingsDialogText": {
        "message": "Current settings will be overridden. Do you really want to import the settings file?",
        "description": "Import settings confirmation dialog help text."
    },
    "optionsConnectedDatabasesText": {
        "message": "Databases connected to KeePassXC-Browser.",
        "description": "Info text about connected databases."
    },
    "optionsConnectedDatabasesNotFound": {
        "message": "No connected databases found.",
        "description": "Shown in the connected databases table when there is no connected databases."
    },
    "optionsDatabasesRemoveIdentifier": {
        "message": "Remove identifier from database list?",
        "description": "Confirmation text when removing database from the list."
    },
    "optionsDatabasesRemoveIdentifierConfirmFirst": {
        "message": "Do you really want to remove the following identifier from the database list: $1?",
        "description": "Confirmation text when removing database from the list."
    },
    "optionsDatabasesRemoveIdentifierConfirmSecond": {
        "message": "You can reconnect your database at any time.",
        "description": "Confirmation text when removing database from the list, second part."
    },
    "optionsDatabaseIdentifier": {
        "message": "Identifier",
        "description": "Database list column title."
    },
    "optionsDatabaseKey": {
        "message": "Key",
        "description": "Database list column title."
    },
    "optionsDatabaseLastUsed": {
        "message": "Last used",
        "description": "Database list column title."
    },
    "optionsDatabaseCreated": {
        "message": "Created",
        "description": "Database list column title."
    },
    "optionsDatabaseDelete": {
        "message": "Delete",
        "description": "Database list column title."
    },
    "optionsColumnPageURL": {
        "message": "Page URL",
        "description": "Site Preferences list column title."
    },
    "optionsColumnIgnore": {
        "message": "Ignore",
        "description": "Site Preferences list column title."
    },
    "optionsColumnUsernameOnly": {
        "message": "Username-only Detection",
        "description": "Site Preferences list column title."
    },
    "optionsColumnImprovedInputFieldDetection": {
        "message": "Improved Input Field Detection",
        "description": "Improved Input Field Detection column text."
    },
    "optionsColumnAllowIframes": {
        "message": "Allow Cross-Origin iframes",
        "description": "Allow iframes column text."
    },
    "optionsColumnDelete": {
        "message": "Delete",
        "description": "Site Preferences list column title."
    },
    "optionsSelectionNothing": {
        "message": "Enable all features",
        "description": "Site Preferences option selection."
    },
    "optionsSelectionNormal": {
        "message": "Disable new/modified credentials",
        "description": "Site Preferences option selection."
    },
    "optionsSelectionAutoSubmit": {
        "message": "Disable Auto-Submit",
        "description": "Site Preferences option selection."
    },
    "optionsSelectionFull": {
        "message": "Disable all features",
        "description": "Site Preferences option selection."
    },
    "optionsSortByTitle": {
        "message": "Title",
        "description": "Sort matching credentials by title option selection."
    },
    "optionsSortByUsername": {
        "message": "Username",
        "description": "Sort matching credentials by username option selection."
    },
    "optionsSortByGroupAndTitle": {
        "message": "Group and title",
        "description": "Sort matching credentials by group and title option selection."
    },
    "optionsSortByGroupAndUsername": {
        "message": "Group and username",
        "description": "Sort matching credentials by group and username option selection."
    },
    "optionsFillSortPriority": {
        "message": "Sort credentials after fill by",
        "description": ""
    },
    "optionsFillSortPriorityHelpText": {
        "message": "When Relevant credential first option is selected, the credential for previously filled login is set as first in Autocomplete Menu's listing.",
        "description": "Help text for Sort credentials after fill."
    },
    "optionsFillSortPriorityTotp": {
        "message": "Sort credentials after fill for TOTP by",
        "description": ""
    },
    "optionsFillSortPriorityTotpHelpText": {
        "message": "When Relevant credential first option is selected, the TOTP for previously filled login is set as first in Autocomplete Menu's listing.",
        "description": "Help text for Sort credentials after fill for TOTP."
    },
    "optionsFillSortByMatchingCredentials": {
        "message": "Matching credentials setting",
        "description": "Default option for Sort after fill. Respects the Matching Credentials sorting setting."
    },
    "optionsFillSortByRelevantEntry": {
        "message": "Relevant credential first",
        "description": "Relevant credential first option for Sort after fill."
    },
    "optionsCustomFieldsNotFound": {
        "message": "No saved Custom Login Fields found.",
        "description": "Shown when no saved custom credentials are saved."
    },
    "optionsCustomFieldsTableCaption": {
        "message": "You can manage saved Custom Login Fields using the table.",
        "description": "Table caption of Custom Login Fields page."
    },
    "optionsCustomFieldsTabHelpTextFirst": {
        "message": "If KeePassXC-Browser detects the wrong login fields, you are able to specify the correct fields yourself.",
        "description": "Saved Custom Login Fields info text, first part."
    },
    "optionsCustomFieldsTabHelpTextSecond": {
        "message": "Go to the page and click on the KeePassXC-Browser icon, then select ",
        "description": "Saved Custom Login Fields info text, second part."
    },
    "optionsCustomFieldsTabHelpTextThird": {
        "message": "On this page you can manage saved Custom Login Fields.",
        "description": "Saved Custom Login Fields info text, third part."
    },
    "optionsCustomFieldsRemove": {
        "message": "Remove saved Custom Login Fields?",
        "description": "Confirmation text when removing saved Custom Login Fields."
    },
    "optionsCustomFieldsConfirmation": {
        "message": "Do you really want to remove the saved Custom Login Fields on the page: $1",
        "description": "Confirmation text when removing saved Custom Login Fields."
    },
    "optionsCustomFieldsConfirmationHelpText": {
        "message": "KeePassXC-Browser will automatically detect the login fields next time you visit this page.",
        "description": "Part of confirmation text when removing saved Custom Login Fields."
    },
    "optionsSitePreferencesNotFound": {
        "message": "No Site Preferences found.",
        "description": "Shown when no Site Preferences are saved."
    },
    "optionsSitePreferencesRemove": {
        "message": "Remove site?",
        "description": "Confirmation text when removing ignored sites from the list."
    },
    "optionsSitePreferencesTabHelpTextFirst": {
        "message": "Sites on this page have special handling methods associated with them.",
        "description": "Site Preferences info text, first part."
    },
    "optionsSitePreferencesTabHelpTextSecond": {
        "message": "To ignore new/modified credentials on a specific site, add them below or when using the credential banner on the page select <em>Don't ask again for this site</em>.",
        "description": "Site Preferences info text, second part."
    },
    "optionsSitePreferencesTabHelpTextThird": {
        "message": "If a site is fully ignored (<em>Disable all features</em> is selected), then the plugin will do nothing when visiting that site.",
        "description": "Site Preferences info text, third part."
    },
    "optionsSitePreferencesTabHelpTextFourth": {
        "message": "Username-only detection allows KeePassXC-Browser to fill in login details on websites with separate pages for username and password.",
        "description": "Site Preferences info text, fourth part."
    },
    "optionsSitePreferencesImprovedInputFieldDetectionHelpText": {
        "message": "Improved Input Field Detection allows more detailed dynamic input field detection. However, it might affect the page performance. Use with caution.",
        "description": "Improved Input Field Detection help text."
    },
    "optionsSitePreferencesAllowIframesHelpText": {
        "message": "Allowing Cross-Origin iframes will enable credential retrieval for iframes from another domain. Use at your own risk.",
        "description": "Allow Cross-Origin iframes help text."
    },
    "optionsSitePreferencesManualAddText": {
        "message": "Add URL manually",
        "description": "Label for adding site manually on Site Preferences tab."
    },
    "optionsSitePreferencesManualAddHelp": {
        "message": "The URL must start with either <code>https://</code>, <code>http://</code>, <code>file://</code>, or <code>ftp://</code> and must be at least 5 characters long.",
        "description": "Help text for adding site manually on Site Preferences tab."
    },
    "optionsSitePreferencesConfirmation": {
        "message": "Do you really want to remove the specified site from the list: $1",
        "description": "Confirmation text when removing site from Site Preferences."
    },
    "optionsSitePreferencesConfirmationHelpText": {
        "message": "KeePassXC-Browser will enable all features for this site and remove username-only detection.",
        "description": "Part of confirmation text when removing Site Preferences."
    },
    "optionsSitePreferencesTableCaption": {
        "message": "You can manage saved Site Preferences using the table.",
        "description": "Table caption of Site Preferences page."
    },
    "optionsSitePreferencesSelect": {
        "message": "Option to ignore extension features for the page.",
        "description": "Title text of select element in Site Preferences."
    },
    "optionsAboutChrome": {
        "message": "Visit KeePassXC-Browser in the Chrome Web Store.",
        "description": "About page link to Chrome Web Store."
    },
    "optionsAboutMozilla": {
        "message": "Visit KeePassXC-Browser in the Mozilla Add-ons directory.",
        "description": "About page link to AMO."
    },
    "optionsAboutEdge": {
        "message": "Visit KeePassXC-Browser in the Edge Add-ons page.",
        "description": "About page link to Edge Add-ons page."
    },
    "optionsAboutGitHub": {
        "message": "Visit KeePassXC-Browser on GitHub.",
        "description": "About page link to GitHub."
    },
    "optionsAboutExtensionVersion": {
        "message": "KeePassXC-Browser Version: $1",
        "description": "About page text of extension version."
    },
    "optionsAboutKeePassXCVersion": {
        "message": "KeePassXC Version: $1",
        "description": "About page text of KeePassXC version."
    },
    "optionsAboutContributors": {
        "message": "Contributors",
        "description": "About page text of contributors."
    },
    "optionsAboutLicenses": {
        "message": "Licenses",
        "description": "About page text of licenses."
    },
    "optionsAboutReportBugs": {
        "message": "Report bugs",
        "description": "About page text of reporting bugs."
    },
    "optionsAboutCreateNewIssue": {
        "message": "Create new issue on GitHub.",
        "description": "Link text for creating a new issue."
    },
    "optionsAboutDebugInfo": {
        "message": "The following debug info can be used",
        "description": "Debug info text."
    },
    "optionsAboutSupporters": {
        "message": "Supporters",
        "description": "Supporters label text."
    },
    "optionsErrorInvalidValue": {
        "message": "Invalid value. Please check the input.",
        "description": "Error shown when input field has an incorrect value."
    },
    "optionsErrorInvalidURL": {
        "message": "Invalid URL. Please check the input.",
        "description": "Error shown when input field has an incorrect URL."
    },
    "optionsErrorValueExists": {
        "message": "The value already exists in the list.",
        "description": "Error shown when trying to add a duplicate value to the list."
    },
    "optionsUserInterfaceTitle": {
        "message": "User interface",
        "description": "User interface title in settings page"
    },
    "optionsFillingCredentialsTitle": {
        "message": "Filling credentials",
        "description": "Filling credentials title in settings page"
    },
    "optionsSavingCredentialsTitle": {
        "message": "Saving credentials",
        "description": "Saving credentials title in settings page"
    },
    "optionsUpdatesTitle": {
        "message": "Updates",
        "description": "Updates title in settings page"
    },
    "optionsAdvancedSettingsTitle": {
        "message": "Advanced settings",
        "description": "Advanced settings title in settings page"
    },
    "optionsExtensionTitle": {
        "message": "Extension",
        "description": "Extension title in settings page"
    },
    "optionsPasskeysTitle": {
        "message": "Passkeys",
        "description": "Passkeys settings title in settings page."
    },
    "optionsPasskeysEnable": {
        "message": "Enable passkeys",
        "description": "Enabled passkeys option text."
    },
    "optionsPasskeysEnableHelpText": {
        "message": "Enable support for Web Authentication.",
        "description": "Passkeys option help text."
    },
    "optionsPasskeysEnableFallback": {
        "message": "Enable passkeys fallback",
        "description": "Enabled passkeys fallback option text."
    },
    "optionsPasskeysEnableFallbackHelpText": {
        "message": "When enabled, a failed or canceled request to KeePassXC will trigger the browser's own internal passkeys request. If disabled, connection to KeePassXC is required and canceled request will fail. Default: enabled.",
        "description": "Passkeys fallback option help text."
    },
    "openNewTab": {
        "message": "Opens a new tab",
        "description": "Title attribute text."
    },
    "httpAuthDialog": {
        "message": "HTTP Basic Authentication dialog",
        "description": "Options page HTTP Basic Auth dialog text"
    },
    "autocompleteSubmitMessage": {
        "message": "Your selection will be auto-submitted",
        "description": "Message shown at the bottom of autocomplete menu."
    },
    "lockDatabase": {
        "message": "Lock database",
        "description": "Lock database button title text."
    }
}
