{
    "extensionDescription": {
        "message": "Integrasi KeePassXC untuk peramban web modern",
        "description": "Name of the extension."
    },
    "addSitePreferenceButtonTitle": {
        "message": "Add Site Preferences for this URL.",
        "description": "Add button title text on Site Preferences tab."
    },
    "allowIframeButtonTitle": {
        "message": "Allows Cross-Origin iframes for the current page.",
        "description": "Allow Cross-Origin iframes button title text."
    },
    "connectButtonTitle": {
        "message": "Connect current active database to KeePassXC-Browser.",
        "description": "Connect button title text."
    },
    "copyDebugInfoButtonTitle": {
        "message": "Salin info debug ke clipboard.",
        "description": "Copy debug info button title text on About tab."
    },
    "dismissHttpAuthButtonTitle": {
        "message": "Mengabaikan autentikasi HTTP dasar.",
        "description": "Dismiss HTTP Auth button title text."
    },
    "reconnectButtonTitle": {
        "message": "Sambungkan kembali database aktif saat ini ke KeePassXC-Browser.",
        "description": "Reconnect button title text."
    },
    "redetectButtonTitle": {
        "message": "Mendeteksi kembali semua bidang input pada halaman.",
        "description": "Redetect login fields button title text."
    },
    "reloadButtonTitle": {
        "message": "Memuat ulang ekstensi dan sambungkan kembali ke KeePassXC.",
        "description": "Reload button title text."
    },
    "removeConnectedDatabaseButtonTitle": {
        "message": "Hapus database yang terhubung dari KeePassXC-Browser.",
        "description": "Remove button title on Connected Databases tab."
    },
    "removeCustomLoginFieldsButtonTitle": {
        "message": "Remove Custom Login Fields for this URL.",
        "description": "Remove button title on Custom Login Fields tab."
    },
    "removeSitePreferencesButtonTitle": {
        "message": "Hapus Preferensi Situs untuk URL ini.",
        "description": "Remove button title on Site Preferences tab."
    },
    "reopenDatabaseButtonTitle": {
        "message": "Buka kembali database yang aktif saat ini.",
        "description": "Reopen database button title text."
    },
    "usernameButtonTitle": {
        "message": "Menambahkan Deteksi Khusus Nama Pengguna ke halaman saat ini.",
        "description": "Add Username-only detection button title text."
    },
    "contextMenuFillUsernameAndPassword": {
        "message": "Isi Nama Pengguna dan Sandi",
        "description": "Context menu item for filling both username and password."
    },
    "contextMenuFillPassword": {
        "message": "Hanya Isi Sandi",
        "description": "Context menu item for filling password."
    },
    "contextMenuFillTOTP": {
        "message": "Isi TOTP",
        "description": "Context menu item for filling Time-based One Time Password."
    },
    "contextMenuShowPasswordGeneratorIcons": {
        "message": "Tampilkan Ikon Pembuat Sandi",
        "description": "Show password generator icon on every password input field."
    },
    "contextMenuSaveCredentials": {
        "message": "Save Credentials",
        "description": "Save credentials using the credential banner."
    },
    "contextMenuShowPasswordGenerator": {
        "message": "Tampilkan Pembuat Sandi",
        "description": "Show password generator text."
    },
    "contextMenuFillAttribute": {
        "message": "Fill Attribute…",
        "description": "Context menu parent item for filling a custom attribute."
    },
    "contextMenuRequestGlobalAutoType": {
        "message": "Minta Ketik-Otomatis Global",
        "description": "Global Auto-Type shortcut text."
    },
    "multipleCredentialsDetected": {
        "message": "Mendeteksi otentikasi HTTP dengan beberapa kredensial. Klik pada ikon ekstensi untuk memilih kredensial yang benar.",
        "description": "Notification when HTTP Authentication has multiple credentials detected."
    },
    "errorMessageUnknown": {
        "message": "Kesalahan tidak diketahui.",
        "description": "Unknown error."
    },
    "errorMessageDatabaseNotOpened": {
        "message": "Basis data tidak terbuka.",
        "description": "Database not opened."
    },
    "errorMessageDatabaseHash": {
        "message": "Basis data hash tidak diterima.",
        "description": "Database hash not received."
    },
    "errorMessageClientPublicKey": {
        "message": "Kunci publik klien tidak diterima.",
        "description": "Client public key not received."
    },
    "errorMessageDecrypt": {
        "message": "Tidak bisa mendekripsi pesan.",
        "description": "Cannot decrypt message."
    },
    "errorMessageTimeout": {
        "message": "Tidak dapat terhubung ke KeePassXC. Periksa apakah integrasi browser diaktifkan di pengaturan KeePassXC.",
        "description": "Cannot connect to KeePassXC. Check that browser integration is enabled in KeePassXC settings."
    },
    "errorMessageCanceled": {
        "message": "Tindakan dibatalkan atau ditolak.",
        "description": "Action canceled or denied."
    },
    "errorMessageEncrypt": {
        "message": "Enskripsi pesan gagal. Apakah KeePassXC sudah berjalan?",
        "description": "Message encryption failed. Is KeePassXC running?"
    },
    "errorMessageAssociate": {
        "message": "Asosiasi KeePassXC gagal, coba lagi.",
        "description": "KeePassXC association failed, try again."
    },
    "errorMessageKeyExchange": {
        "message": "Pertukaran kunci tidak berhasil.",
        "description": "Key exchange was not successful."
    },
    "errorMessageEncryptionKey": {
        "message": "Kunci enkripsi tidak dikenali.",
        "description": "Encryption key is not recognized."
    },
    "errorMessageSavedDatabases": {
        "message": "Tidak ada basis data tersimpan yang ditemukan.",
        "description": "No saved databases found."
    },
    "errorMessageIncorrectAction": {
        "message": "Tindakan salah.",
        "description": "Incorrect action."
    },
    "errorMessageEmptyMessage": {
        "message": "Pesan kosong diterima.",
        "description": "Empty message received."
    },
    "errorMessageNoURL": {
        "message": "Tidak ada URL yang disediakan.",
        "description": "No URL provided."
    },
    "errorMessageNoLogins": {
        "message": "Login tidak ditemukan.",
        "description": "No logins found."
    },
    "errorMessagePaswordLengthExceeded": {
        "message": "Kata sandi lebih panjang dari ruas yang tersedia.",
        "description": "Error notification text shown when filled password is longer than defined maxLength of the input field."
    },
    "errorMessageNoGroupsFound": {
        "message": "Tidak ada grup yang ditemukan.",
        "description": "No groups found."
    },
    "errorMessageCannotCreateNewGroup": {
        "message": "Tidak bisa membuat grup baru.",
        "description": "Cannot create new group."
    },
    "errorMessageNoValidUuidProvided": {
        "message": "Tidak ada UUID yang valid yang disediakan.",
        "description": "No valid UUID provided."
    },
    "errorMessageAccessToAllEntriesDenied": {
        "message": "Akses ke semua entri tidak diperbolehkan.",
        "description": "Access to all entries denied."
    },
    "errorMessagePasskeysAttestationNotSupported": {
        "message": "Atestasi tidak didukung.",
        "description": "Attestation not supported."
    },
    "errorMessagePasskeysCredentialIsExcluded": {
        "message": "Kredensial dikecualikan.",
        "description": "Credential is excluded."
    },
    "errorMessagePasskeysRequestCanceled": {
        "message": "Permintaan Passkey dibatalkan.",
        "description": "Passkeys request canceled."
    },
    "errorMessagePasskeysInvalidUserVerification": {
        "message": "Verifikasi pengguna tidak valid.",
        "description": "Invalid user verification."
    },
    "errorMessagePasskeysEmptyPublicKey": {
        "message": "Kunci publik kosong.",
        "description": "Empty public key."
    },
    "errorMessagePasskeysInvalidUrlProvided": {
        "message": "URL yang disediakan tidak valid.",
        "description": "Invalid URL provided."
    },
    "errorMessagePasskeysOriginNotAllowed": {
        "message": "Origin is empty or not allowed.",
        "description": "Origin is empty or not allowed."
    },
    "errorMessagePasskeysDomainNotValid": {
        "message": "Effective domain is not a valid domain.",
        "description": "Effective domain is not a valid domain."
    },
    "errorMessagePasskeysDomainRpIdMismatch": {
        "message": "Origin and RP ID do not match.",
        "description": "Origin and RP ID do not match."
    },
    "errorMessagePasskeysNoSupportedAlgorithms": {
        "message": "Tidak ada algoritma yang didukung yang disediakan.",
        "description": "No supported algorithms were provided."
    },
    "errorMessagePasskeysWaitforLifeTimer": {
        "message": "Tunggu hingga waktu kedaluwarsa.",
        "description": "Wait for timer to expire."
    },
    "errorMessagePasskeysUnknownError": {
        "message": "Kesalahan passkeys tidak dikenal.",
        "description": "Unknown passkeys error."
    },
    "errorMessagePasskeysInvalidChallenge": {
        "message": "Challenge is shorter than required minimum length.",
        "description": "Challenge is shorter than required minimum length."
    },
    "errorMessagePasskeysInvalidUserId": {
        "message": "user.id tidak sesuai dengan panjang yang dibutuhkan.",
        "description": "user.id does not match the required length."
    },
    "errorMessagePasskeysContextIsNotSecure": {
        "message": "Context is not secure.",
        "description": "Context is not secure."
    },
    "errorNotConnected": {
        "message": "Tidak tersambung dengan KeePassXC.",
        "description": "Error notification shown when not connected to KeePassXC."
    },
    "errorCurrentDatabaseNotConnected": {
        "message": "Current database is not connected.",
        "description": "Error notification shown when current database is not connected during action."
    },
    "passwordGeneratorErrorTooLong": {
        "message": "Galat: Sandi yang dibuat melebihi panjang maksimum yang diizinkan!",
        "description": "A warning text shown in the password generator."
    },
    "passwordGeneratorErrorTooLongCut": {
        "message": "Itu telah dipotong untuk menyesuaikan dengan panjangnya",
        "description": "A warning text shown in the password generator."
    },
    "passwordGeneratorErrorTooLongRemember": {
        "message": "Harap ingat kata sandi yang baru!",
        "description": "A warning text shown in the password generator."
    },
    "passwordGeneratorGenerateText": {
        "message": "Buat kata sandi.",
        "description": "Password icon title text."
    },
    "passwordGeneratorNotSupported": {
        "message": "Pembuat kata sandi tidak didukung dalam versi KeePassXC ini. Silakan perbarui KeePassXC ke versi yang lebih baru."
    },
    "usernameFieldText": {
        "message": "Isi kredensial dari KeePassXC.",
        "description": "Username field icon hover text."
    },
    "usernameFieldTextNoCredentials": {
        "message": "Tidak ada kredensial yang dapat diisi.",
        "description": "Username field icon hover text when no credentials are."
    },
    "usernameLockedFieldText": {
        "message": "Database is locked.",
        "description": "Username field icon hover text when database is locked."
    },
    "usernameDisconnectedFieldText": {
        "message": "KeePassXC is disconnected.",
        "description": "Username field icon hover text when KeePassXC is disconnected."
    },
    "totp": {
        "message": "TOTP",
        "description": "TOTP text."
    },
    "totpFieldText": {
        "message": "Isi TOTP dari KeePassXC",
        "description": "OTP field icon hover text."
    },
    "defineClose": {
        "message": "Tutup",
        "description": "Close button text when choosing Custom Login Fields."
    },
    "defineSkip": {
        "message": "Lewati",
        "description": "Skip button text when choosing Custom Login Fields."
    },
    "defineMore": {
        "message": "Tampilkan lainnya",
        "description": "More button text when choosing Custom Login Fields."
    },
    "defineReset": {
        "message": "Atur ulang",
        "description": "Reset button text when choosing Custom Login Fields."
    },
    "defineConfirm": {
        "message": "Konfirmasi",
        "description": "Confirm button text when choosing Custom Login Fields."
    },
    "defineAlreadySelected": {
        "message": "Ruas masuk untuk halaman ini sudah dipilih dan akan ditimpa ulang.",
        "description": "A text shown when custom credentials fields are already set for the page."
    },
    "defineClearData": {
        "message": "Bersihkan data yang tersimpan",
        "description": "Clear save data button text when choosing Custom Login Fields."
    },
    "defineStringField": {
        "message": "Ruas lema",
        "description": "Text for string field."
    },
    "defineChooseUsername": {
        "message": "Pilih ruas nama pengguna",
        "description": "Choosing a username field text when choosing Custom Login Fields."
    },
    "defineChoosePassword": {
        "message": "Pilih ruas kata sandi",
        "description": "Choosing a password field text when choosing Custom Login Fields."
    },
    "defineChooseTOTP": {
        "message": "Pilih ruas TOTP",
        "description": "Choosing a TOTP field text when choosing Custom Login Fields."
    },
    "defineChooseStringFields": {
        "message": "Pilih Ruas String",
        "description": "Choose String Fields a selection text when choosing Custom Login Fields."
    },
    "defineHelpText": {
        "message": "Harap konfirmasi pilihan Anda atau pilih lebih banyak bidang sebagai bidang String.",
        "description": "Confirm a selection text when choosing Custom Login Fields which contains string fields."
    },
    "defineKeyboardText": {
        "message": "Anda juga dapat menggunakan angka untuk memilih bidang input dari keyboard.",
        "description": "Help text when choosing Custom Login Fields."
    },
    "defineChooseCustomLoginFieldText": {
        "message": "Pilih suatu Ruas Log Masuk Ubahan",
        "description": "Help text for Custom Login Field banner."
    },
    "username": {
        "message": "Nama pengguna",
        "description": "General text for username."
    },
    "password": {
        "message": "Sandi",
        "description": "General text for password."
    },
    "stringFields": {
        "message": "Ruas String",
        "description": "General text for a String Fields."
    },
    "credentialsNoUsername": {
        "message": "- tidak ada nama pengguna -",
        "description": "Shown when no username is set in the credentials."
    },
    "credentialsNoLoginsFound": {
        "message": "Login tidak ditemukan.",
        "description": "Shown when no credentials are found for the current page."
    },
    "credentialsMultipleFound": {
        "message": "Lebih dari satu login ditemukan di KeePassXC!",
        "description": "Alert message when trying to fill username and/or password when multiple credentials are found."
    },
    "credentialsMultipleFoundSecondLine": {
        "message": "Click the KeePassXC-Browser icon for more options.",
        "description": "Alert message when trying to fill username and/or password when multiple credentials are found."
    },
    "credentialsNoUsernameFound": {
        "message": "Tidak ditemukan kredensial untuk nama pengguna yang dimaksud.",
        "description": "Alert message when no credentials are found for the given username."
    },
    "credentialsNoTOTPFound": {
        "message": "TOTP tidak ditemukan.",
        "description": "Alert message when no TOTP is found."
    },
    "credentialExpired": {
        "message": "Kedaluwarsa",
        "description": "If a credential is expired, this is appended to the title label."
    },
    "fieldsFill": {
        "message": "Error: Tidak dapat menemukan bidang yang harus diisi.",
        "description": "Alert message when no fields are found to fill in."
    },
    "fieldsNoPasswordField": {
        "message": "Error: Tidak dapat menemukan bidang kata sandi.",
        "description": "Message shown when no password fields are found."
    },
    "fieldsPasswordFillNotAccepted": {
        "message": "Filling password to a plain text field is prevented.",
        "description": "Message shown when password fill to a plain text field is prevented."
    },
    "rememberNothingChanged": {
        "message": "Error: Tidak dapat mendeteksi perubahan kredensial.",
        "description": "Message shown when trying to save credentials that haven't changed."
    },
    "popupTitle": {
        "message": "KeePassXC - Popup",
        "description": "Popup window title."
    },
    "popupSettingsText": {
        "message": "Pengaturan",
        "description": "Popup Settings button text."
    },
    "popupChooseCredentialsText": {
        "message": "Choose Custom Login Fields",
        "description": "Popup credential choosing button text."
    },
    "popupConnectButton": {
        "message": "Sambung",
        "description": "Popup Connect button text."
    },
    "popupReconnectButton": {
        "message": "Sambung ulang",
        "description": "Popup Reconnect button text."
    },
    "popupRedetectButton": {
        "message": "Deteksi ulang ruas masuk",
        "description": "Popup Redetect login fields button text."
    },
    "popupReloadButton": {
        "message": "Muat ulang",
        "description": "Popup Reload button text."
    },
    "popupReopenButton": {
        "message": "Buka ulang basis data",
        "description": "Popup reopen database button text."
    },
    "popupUsernameButton": {
        "message": "Tambah opsi hanya-nama-pengguna untuk situs ini",
        "description": "Button text for adding Username-only option."
    },
    "popupAllowIframeButton": {
        "message": "Perbolehkan iframe lintas sumber untuk situs",
        "description": "Button text for allowing Cross-Origin iframes option."
    },
    "popupErrorEncountered": {
        "message": "KeePassXC-Browser mengalami error:",
        "description": "A text shown above error message in the popup."
    },
    "popupUpdateAvailable": {
        "message": "Anda menggunakan versi lama KeePassXC.",
        "description": "Popup warning message about old version of KeePassXC."
    },
    "popupDownloadNewVersion": {
        "message": "Silakan unduh versi terbaru dari keepassxc.org",
        "description": "Popup warning message link when KeePassXC version is not up-to-date."
    },
    "popupGettingStartedText": {
        "message": "Apakah Anda pengguna baru? Harap periksa Buku Panduan Memulai.",
        "description": "Popup information message about Getting Started Guide."
    },
    "popupGettingStartedLinkText": {
        "message": "Panduan Memulai - Menyiapkan Integrasi Peramban",
        "description": "Popup Getting Started Guide link text."
    },
    "popupAlertHide": {
        "message": "Sembunyikan dan jangan tampilkan lagi.",
        "description": "Hide alert close button title."
    },
    "popupTroubleshootingText": {
        "message": "Tidak dapat menghubungkan ke KeePassXC? Mungkin laman wiki kami dapat membantu.",
        "description": "Popup information message about Troubleshooting Guide."
    },
    "popupTroubleshootingLinkText": {
        "message": "Petunjuk Pemecahan Masalah",
        "description": "Popup Troubleshooting Guide link text."
    },
    "popupCheckingStatus": {
        "message": "Memeriksa status...",
        "description": "Checking status message in popup."
    },
    "popupNotConfigured": {
        "message": "KeePassXC-Browser has not been configured. Click the connect button to pair with KeePassXC.",
        "description": "A popup message shown when the extension has not been connected to KeePassXC."
    },
    "popupNeedReconfigure": {
        "message": "KeePassXC-Browser telah terputus dari KeePassXC.",
        "description": "A popup message shown when the extension has been disconnected from KeePassXC."
    },
    "popupNeedReconfigureMessage": {
        "message": "Click the reconnect button to establish a new connection.",
        "description": "A popup message shown when reconnect is needed."
    },
    "popupConfiguredNotAssociated": {
        "message": "KeePassXC-Browser belum terhubung ke KeePassXC tetapi telah dikonfigurasi menggunakan pengidentifikasi: $1",
        "description": "A popup message shown when KeePassXC is not connected but configured."
    },
    "popupConfiguredAndAssociated": {
        "message": "KeePassXC-Browser terhubung ke KeePassXC dan telah dikonfigurasi menggunakan pengidentifikasi berikut: $1",
        "description": "A popup message when a connection to KeePassXC is successful."
    },
    "popupUsernameFieldDetected": {
        "message": "Hanya ruas nama pengguna saja yang terdeteksi. Tambahkan URL ke Preferensi Situs hanya dengan nama pengguna saja?",
        "description": "Text shown when page can be added to Site Preferences with Username-only option enabled."
    },
    "popupIframeDetected": {
        "message": "Sebuah iframe lintas sumber telah terdeteksi. Tambahkan URL ke Preferensi Situs dengan opsi Perbolehkan iframe lintas sumber diaktifkan?",
        "description": "Text shown when page can be added to Site Preferences with Allow Cross-Origin iframes option enabled."
    },
    "rememberInfoText": {
        "message": "Nama pengguna atau kata sandi berubah! Simpan?",
        "description": "Message when username or password has changed."
    },
    "rememberSaving": {
        "message": "Kredensial akan disimpan dalam basis data yang terhubung dengan pengidentifikasi $1",
        "description": "A message when saving or updating credentials."
    },
    "rememberNewUsername": {
        "message": "Nama pengguna berikut saat ini belum disimpan: $1",
        "description": "A message shown when a new username is detected when saving credentials."
    },
    "rememberUsernameExists": {
        "message": "Kredensial dengan nama pengguna yang telah ada ditandai dengan huruf tebal: $1",
        "description": "A message shown when an existing username is detected when saving credentials."
    },
    "rememberChooseCredentials": {
        "message": "Harap pilih kredensial yang ingin Anda perbaharui",
        "description": "A message shown choosing what credentials user wants to update."
    },
    "rememberChooseGroup": {
        "message": "Please choose a group to store new credentials.",
        "description": "A message shown choosing what group user wants to use for new credentials."
    },
    "rememberInfoDefaultGroupNotFound": {
        "message": "Grup default dibuat dalam basis data terhubung.",
        "description": "Info message shown when default group set cannot be found."
    },
    "rememberErrorCreatingNewGroup": {
        "message": "Grup baru tidak bisa dibuat.",
        "description": "Error message shown when new groups cannot be created."
    },
    "rememberErrorPasswordNotChanged": {
        "message": "Kredensial tidak diperbarui. Sandi belum diubah.",
        "description": "Error message shown when credential password is not changed."
    },
    "rememberErrorCannotSaveCredentials": {
        "message": "Kredensial tidak bisa disimpan atau diperbarui.",
        "description": "Error message shown when credentials cannot be saved or updated."
    },
    "rememberErrorDatabaseClosed": {
        "message": "Kredensial tidak dapat di simpan atau diperbarui ke sebuah basis data yang tertutup.",
        "description": "Error message shown when credentials cannot be saved or updated and the database is closed."
    },
    "rememberCredentialsNotSaved": {
        "message": "Tindakan dibatalkan. Kredensial tidak diperbarui.",
        "description": "Message shown when saving operation was cancelled."
    },
    "rememberCredentialsSaved": {
        "message": "Kredensial baru dengan nama pengguna $1 disimpan.",
        "description": "Message shown when new credentials are saved."
    },
    "rememberCredentialsUpdated": {
        "message": "Kredensial dengan nama pengguna $1 diperbarui.",
        "description": "Message shown when new credentials are successfully updated."
    },
    "rememberCredentialsExists": {
        "message": "Kredensial identik sudah ada. Tidak ada yang perlu diperbarui.",
        "description": "Message shown when new credentials already found in database."
    },
    "rememberEmptyUsername": {
        "message": "(kosong)",
        "description": "Means an empty username."
    },
    "rememberNoPassword": {
        "message": "Silakan isi ruas sandi sebelum menyimpan kredensial.",
        "description": "Message shown when no password is set when saving credentials."
    },
    "popupLoginText": {
        "message": "Pilih informasi login yang ingin Anda sematkan ke dalam halaman.",
        "description": "A popup message shown when one or multiple credentials are present."
    },
    "popupFilterText": {
        "message": "Filter:",
        "description": "Text for login credentials quick filter."
    },
    "popupAuthText": {
        "message": "Pilih informasi login yang Anda ingin masuk.",
        "description": "A popup message shown when doing HTTP Authentication with multiple credentials present."
    },
    "popupMultiplePasswordFields": {
        "message": "Lebih dari satu kolom kata sandi ditemukan pada laman ini. Klik kanan pada salah satu kolom kata sandi, dan pilih satu dari:",
        "description": "A popup message shown when web page has multiple password fields."
    },
    "popupUsername": {
        "message": "Username:",
        "description": "A username field name shown on credential update."
    },
    "popupButtonNew": {
        "message": "Baru",
        "description": "New button text in popup when updating credentials."
    },
    "popupButtonUpdate": {
        "message": "Perbarui",
        "description": "Update button text in popup when updating credentials."
    },
    "popupButtonCancel": {
        "message": "Cancel",
        "description": "Cancel button text in popup when updating credentials."
    },
    "popupButtonBack": {
        "message": "Back",
        "description": "Back button text in popup when updating credentials."
    },
    "popupButtonIgnore": {
        "message": "Jangan tanya lagi untuk situs ini",
        "description": "Ignore button text in popup or in notification when updating credentials."
    },
    "popupButtonClose": {
        "message": "Tutup",
        "description": "Close button text in popup or in notification."
    },
    "popupButtonDismissHttpAuth": {
        "message": "Tutup dan tampilkan dialog otentikasi bawaan",
        "description": "Dismiss button text when in HTTP Authentication popup."
    },
    "optionsTitle": {
        "message": "Pengaturan | KeePassXC-Browser",
        "description": "Options page title."
    },
    "optionsGeneralSettingsTab": {
        "message": "Pengaturan Umum",
        "description": "General Settings tab text."
    },
    "optionsConnectedDatabasesTab": {
        "message": "Basis Data Tersambung",
        "description": "Connected Databases tab text."
    },
    "optionsCustomFieldsTab": {
        "message": "Custom Login Fields",
        "description": "Saved Custom Login Fields tab text."
    },
    "optionsSitePreferencesTab": {
        "message": "Site Preferences",
        "description": "Site Preferences fields tab text."
    },
    "optionsAboutTab": {
        "message": "Tentang",
        "description": "About tab text."
    },
    "optionsMenuGeneral": {
        "message": "Umum",
        "description": "General settings page header."
    },
    "optionsMenuConnectedDatabases": {
        "message": "Basis Data Tersambung",
        "description": "Connected Databases page header."
    },
    "optionsMenuCustomFields": {
        "message": "Custom Login Fields",
        "description": "Custom Login Fields page header."
    },
    "optionsMenuSitePreferences": {
        "message": "Site Preferences",
        "description": "Site Preferences page header."
    },
    "optionsMenuAbout": {
        "message": "Tentang",
        "description": "About page header."
    },
    "optionsConfigureShortcuts": {
        "message": "Kelola pintasan",
        "description": "Keyboard shortcut button and title text."
    },
    "optionsButtonSave": {
        "message": "Simpan",
        "description": "Save button text."
    },
    "optionsButtonConnect": {
        "message": "Sambung",
        "description": "Connect button text."
    },
    "optionsButtonRemove": {
        "message": "Buang",
        "description": "Remove button text."
    },
    "optionsButtonAdd": {
        "message": "Tambah",
        "description": "Add button text."
    },
    "optionsButtonUpdate": {
        "message": "Periksa pembaruan",
        "description": "Check for updates button text."
    },
    "optionsButtonRemoveNow": {
        "message": "Ya, buang sekarang",
        "description": "Confirm button text when removing database key or Custom Login Fields."
    },
    "optionsButtonCancel": {
        "message": "Batal",
        "description": "Cancel button text when removing database key or Custom Login Fields."
    },
    "optionsButtonReset": {
        "message": "Setel ulang",
        "description": "Reset button text for keyboard shortcuts."
    },
    "optionsButtonImport": {
        "message": "Impor pengaturan",
        "description": "Import settings button text."
    },
    "optionsButtonExport": {
        "message": "Ekspor pengaturan",
        "description": "Export settings button text."
    },
    "optionsLabelDefaultGroup": {
        "message": "Grup baku untuk menyimpan sandi baru:",
        "description": "Default group options text."
    },
    "optionsDefaultGroupHelpText": {
        "message": "Pisahkan grup dengan '/', contoh: Grup/Subgrup",
        "description": "Default group help text."
    },
    "optionsLabelDefaultPasskeyGroup": {
        "message": "Grup default untuk menyimpan passkeys baru:",
        "description": "Default passkey group options text."
    },
    "optionsLabelDefaultGroupCheckboxText": {
        "message": "Selalu bertanya dimana menyimpan kredensial baru",
        "description": "Default group checkbox help text."
    },
    "optionsLabelDefaultGroupCheckboxHelpText": {
        "message": "Ketika diaktifkan, popup menampilkan daftar grup.",
        "description": "Default checkbox explanation help text."
    },
    "optionsCheckboxUsePasswordGenerator": {
        "message": "Activate password generator icons",
        "description": "Activate password generator icons checkbox text."
    },
    "optionsCheckboxUsernameIcons": {
        "message": "Activate username field icons",
        "description": "Activate username field icons textbox text."
    },
    "optionsUseObserver": {
        "message": "Use dynamic input field detection",
        "description": "Use dynamic input field detection checkbox text."
    },
    "optionsUseObserverHelpText": {
        "message": "Berguna untuk laman yang menggunakan popup atau dialog dinamik. Nonaktifkan fitur untuk mengurangi beban CPU pada mesin yang lambat. Ketika dinonaktifkan kredensial hanya dapat diisi menggunakan pintasan keyboard, menu konteks atau popup ekstensi.",
        "description": "Use dynamic input field detection help text."
    },
    "optionsCheckboxOTPIcons": {
        "message": "Activate 2FA/OTP field icons",
        "description": "Activate OTP field icons textbox text."
    },
    "optionsCheckboxAutoRetrieveCredentials": {
        "message": "Automatically retrieve credentials",
        "description": "Automatically retrieve credentials checkbox text."
    },
    "optionsCheckboxAutomaticReconnect": {
        "message": "Automatically reconnect to KeePassXC",
        "description": "Auto-reconnect checkbox text."
    },
    "optionsAutomaticReconnectWarning": {
        "message": "Peringatan! Fitur ini masih bereksperimental. Gunakan dengan risiko Anda sendiri.",
        "description": "Auto-reconnect warning message."
    },
    "optionsCheckboxAutoFillSingleEntry": {
        "message": "Automatically fill in single-credential entries",
        "description": "Automatically fill-in single credential entry checkbox text."
    },
    "optionsCheckboxAutoFillRelevantCredential": {
        "message": "Automatically fill in relevant credential entries",
        "description": "Automatically fill-in relevant credential entry checkbox text."
    },
    "optionsCheckboxAutoFillSingleTotp": {
        "message": "Automatically fill in single TOTP entries",
        "description": "Automatically fill-in single TOTP entries checkbox text."
    },
    "optionsCheckboxAutoCompleteUsernames": {
        "message": "Activate autocomplete for username fields",
        "description": "Activate autocomplete for username fields checkbox text."
    },
    "optionsCheckboxShowGroupNameInAutocomplete": {
        "message": "Display the group name in autocomplete list when credentials are from different groups",
        "description": "Show group name in autocomplete checkbox text."
    },
    "optionsCheckboxAutoSubmit": {
        "message": "Kirim forum login secara otomatis",
        "description": "Auto-submit checkbox text."
    },
    "optionsAutoSubmitHelpText": {
        "message": "Secara otomatis mengirim kredensial yang dipilih. Ini dinonaktifkan untuk pengisian otomatis entri tunggal.",
        "description": "Auto-submit help text."
    },
    "optionsCheckboxShowNotifications": {
        "message": "Show notifications",
        "description": "Show notifications checkbox text."
    },
    "optionsCheckboxUseMonochromeToolbarIcon": {
        "message": "Use monochrome toolbar icon",
        "description": "Use monochrome toolbar icon checkbox text."
    },
    "optionsCheckboxUseCompactMode": {
        "message": "Use compact mode",
        "description": "Whether the compact mode (legacy dropdown) should be enabled."
    },
    "optionsSaveDomainOnly": {
        "message": "Save domain only",
        "description": "Save domain only checkbox text."
    },
    "optionsCheckboxShowLoginNotifications": {
        "message": "Show a banner on the page when new credentials can be saved to the database",
        "description": "Show login notifications checkbox text."
    },
    "optionsRedirectAllowance": {
        "message": "Jumlah pengalihan yang diperbolehkan: $1",
        "description": "Redirect allowance range input text."
    },
    "optionsRedirectAllowanceHelpText": {
        "message": "Jumlah penerusan ulang yang diperbolehkan sampai banner hilang. Nilai bawaan adalah 3. Maksimal tak terbatas.",
        "description": "Redirect allowance help text."
    },
    "optionsCheckboxAutoFillAndSend": {
        "message": "Allow filling HTTP Basic Auth credentials",
        "description": "Allow filling HTTP Basic Auth credentials checkbox text."
    },
    "optionsDebugLogging": {
        "message": "Catat pengawakutu",
        "description": "Debug logging checkbox text."
    },
    "optionsDebugLoggingHelpText": {
        "message": "Aktifkan pencatatan pengawakutu. Pesan-pesan konsol juga akan terlihat pada skrip latar belakang dan konten.",
        "description": "Debug logging help text."
    },
    "optionsRadioText": {
        "message": "Periksa pembaruan KeePassXC:",
        "description": "Text above radio buttons in the settings page."
    },
    "optionsRadioThreeDays": {
        "message": "every three days",
        "description": "Radio button text."
    },
    "optionsRadioWeek": {
        "message": "setiap minggu",
        "description": "Radio button text."
    },
    "optionsRadioMonth": {
        "message": "setiap bulan",
        "description": "Radio button text."
    },
    "optionsRadioNever": {
        "message": "tidak pernah",
        "description": "Radio button text."
    },
    "optionsThemeSelectionHeader": {
        "message": "Warna tema",
        "description": "Theme selection header text."
    },
    "optionsCredentialSortSelectionHeader": {
        "message": "Urutkan kredensial yang cocok berdasarkan",
        "description": "Credential sort option header text."
    },
    "optionsThemeSelection": {
        "message": "Pilih warna tema",
        "description": "Theme selection title text."
    },
    "optionsThemeSystem": {
        "message": "Sistem",
        "description": "System theme text."
    },
    "optionsThemeDark": {
        "message": "Hitam",
        "description": "Dark theme text."
    },
    "optionsThemeLight": {
        "message": "Putih",
        "description": "Light theme text."
    },
    "optionsKeyboardShortcutsHeader": {
        "message": "Pintasan keyboard",
        "description": "Keyboard shortcut header text."
    },
    "optionsUsePasswordGeneratorHelpText": {
        "message": "Menambahkan sebuah ikon pada kolom kata sandi untuk membuat sebuah kata sandi baru.",
        "description": "Password Generator option help text."
    },
    "optionsUsePasswordGeneratorHelpTextSecond": {
        "message": "Kata sandi dibuat oleh KeePassXC menggunakan profil pembuatan kata sandi Anda.",
        "description": "Password Generator option help text, second part."
    },
    "optionsPredefinedSiteList": {
        "message": "Situs yang sudah ditentukan sebelumnya",
        "description": "Predefined site list details button text."
    },
    "optionsUsePredefinedSites": {
        "message": "Use predefined sites for compatibility",
        "description": "Use predefined sites checkbox text."
    },
    "optionsUsePredefinedSitesHelpText": {
        "message": "Adds common sites that have username-only login forms to the Site Preferences.",
        "description": "Use predefined sites option help text."
    },
    "optionsShowLoginFormIconHelpText": {
        "message": "Menambahkan ikon ke kolom nama pengguna untuk mengisi kredensial dengan satu klik tetikus.",
        "description": "Username field icon option help text."
    },
    "optionsShowOTPIconHelpText": {
        "message": "Menambahkan ikon ke kolom masukan yang dikenal sebagai OTP/2FA.",
        "description": "OTP field icon option help text."
    },
    "optionsAutoRetrieveCredentialsHelpText": {
        "message": "KeePassXC-Browser akan menerima kredensial secara otomatis ketika sebuah tab diaktifkan.",
        "description": "Auto-Retrive Credentials option help text."
    },
    "optionsAutomaticReconnectHelpText": {
        "message": "Menghubungkan ulang secara otomatis ke KeePassXC ketika terdeteksi.",
        "description": "Auto-reconnect option help text."
    },
    "optionsAutoFillSingleEntryHelpText": {
        "message": "Biarkan KeePassXC-Browser mengisi kredensial secara otomatis ketika hanya menerima satu entri.",
        "description": "Auto-Fill Single Entry option help text."
    },
    "optionsAutoFillRelevantCredentialHelpText": {
        "message": "Automatically fill in the relevant credential if a second fill is needed.",
        "description": "Auto-Fill Relevant Credential option help text."
    },
    "optionsAutoFillSingleEntryWarning": {
        "message": "Peringatan! Menggunakan pengisian otomatis tidak aman. Gunakan dengan risiko Anda sendiri. KeePassXC-Browser mendeteksi kolom masuk secara otomatis. Tetapi, mereka dapat dideteksi secara salah, kemungkinan dapat mengisi data sensitif ke kolom masukan yang berbahaya.",
        "description": "Auto-Fill Single Entry warning text."
    },
    "optionsAutoFillSingleTotpHelpText": {
        "message": "Biarkan KeePassXC-Browser mengisi kolom TOTP secara otomatis ketika hanya menerima satu entri.",
        "description": "Auto-Fill Single TOTP field option help text."
    },
    "optionsAutocompleteUsernamesHelpText": {
        "message": "Tampilkan daftar dropdown berisi kredensial yang tersedia untuk semua kolom nama pengguna di sebuah laman.",
        "description": "Autocomplete Usernames option help text."
    },
    "optionsShowGroupNameInAutocompleteHelpText": {
        "message": "When credentials are returned from different groups, the group name will be shown. Only affects the compact mode.",
        "description": "Show group name in autocomplete help text."
    },
    "optionsShowNotificationsHelpText": {
        "message": "Tampilkan notifikasi atau kesalahan dan ketika interaksi pengguna diperlukan.",
        "description": "Show notifications option help text."
    },
    "optionsUseMonochromeToolbarIconHelpText": {
        "message": "Gunakan ikon monokrom dengan lencana berwarna di bilah alat yang beradaptasi dengan tema terang/gelap peramban.",
        "description": "Use monochrome toolbar icon option help text."
    },
    "optionsUseCompactModeHelpText": {
        "message": "Use a compact version of the dropdown list to select credentials.",
        "description": "Use compact (legacy) mode help text."
    },
    "optionsSaveDomainOnlyHelpText": {
        "message": "Ketika menyimpan kredensial baru, hanya simpan domainnya daripada URL penuhnya.",
        "description": "Save domain only option help text."
    },
    "optionsSaveDomainOnlyCustomLoginHelpText": {
        "message": "When saving new Custom Login Fields, save only the domain instead of full URL.",
        "description": "Save domain only option help text."
    },
    "optionsDownloadFaviconAfterSave": {
        "message": "Unduh favicon setelah penyimpanan",
        "description": "Download favicon after save checkbox label text."
    },
    "optionsDownloadFaviconAfterSaveHelpText": {
        "message": "Favicon akan diunduh secara otomatis untuk kredensial yang baru.",
        "description": "Download favicon after save help text."
    },
    "optionsAutoFillAndSendHelpText": {
        "message": "Jika kredensial ditemukan untuk sebuah laman dan jenis masuk merupakan permintaan Autentikasi HTTP Dasar, KeePassXC-Browser akan mencoba masuk secara otomatis dengan kredensial pertama yang diberikan. Ketika tersedia beberapa kredensial, popup pengaya dapat digunakan untuk memilih yang benar. Bahkan ketika fitur ini diaktifkan, masih dimungkinkan untuk memasukkan entri masuk Autentikasi HTTP Dasar secara manual.",
        "description": "Auto-Fill And Send option help text."
    },
    "optionsAutoFillAndSendHelpTextSecond": {
        "message": "Dialog Autentikasi HTTP Dasar terlihat seperti berikut:",
        "description": "HTTP Basic Auth image help text."
    },
    "optionsClearCredentialsTimeout": {
        "message": "Hapus kredensial dari tab non-aktif setelah (detik, 0-3600).",
        "description": "Clear credentials label text."
    },
    "optionsClearCredentialsTimeoutHelpText": {
        "message": "Kredensial dihapus dari tab latar belakang setelah waktu habis dan perizinan untuk laman tersebut akan ditanyakan lagi.",
        "description": "Clear credentials timeout help text."
    },
    "optionsVersionInfoText": {
        "message": "KeePassXC-Browser memerlukan KeePassXC untuk menerima kredensial.",
        "description": "Settings page version info text."
    },
    "optionsVersionDownload": {
        "message": "Anda dapat mengunduh versi stabil terbaru dari $1",
        "description": "Settings page download link."
    },
    "optionsVersionRunning": {
        "message": "Anda menggunakan KeePassXC versi: $1",
        "description": "Settings page info text of user's KeePassXC version."
    },
    "optionsLatestVersion": {
        "message": "Versi paling baru KeePassXC yang tersedia: $1",
        "description": "Settings page info text about the latest KeePassXC version."
    },
    "optionsKeePassXCVersionRequired": {
        "message": "Membutuhkan KeePassXC versi: $1",
        "description": "KeePassXC version requirement text."
    },
    "optionsDefault": {
        "message": "Standar: $1",
        "description": "Default setting text."
    },
    "optionsInfinite": {
        "message": "Tak terbatas: $1",
        "description": "Infinite setting text."
    },
    "optionsRecommended": {
        "message": "Rekomendasi: $1",
        "description": "Recommended setting text."
    },
    "optionsShortcutsSuccess": {
        "message": "Pintasan untuk $1 berhasil diubah.",
        "description": "Message for successful keyboard shortcut change."
    },
    "optionsShortcutsInfo": {
        "message": "Pintasan untuk $1 telah direset.",
        "description": "Info message for changing keyboard shortcuts."
    },
    "optionsShortcutsDanger": {
        "message": "Error: Pintasan untuk $1 belum berubah!",
        "description": "Error message for changing keyboard shortcuts."
    },
    "optionsImportExportSettings": {
        "message": "Impor/Ekspor pengaturan",
        "description": "Settings page header text for import/export."
    },
    "optionsImportSettingsDialogTitle": {
        "message": "Impor pengaturan dari berkas eksternal?",
        "description": "Import settings confirmation dialog title text."
    },
    "optionsImportSettingsDialogText": {
        "message": "Pengaturan saat ini akan diganti. Apakah Anda benar-benar ingin mengimpor berkas pengaturan?",
        "description": "Import settings confirmation dialog help text."
    },
    "optionsConnectedDatabasesText": {
        "message": "Basis data terhubung ke KeePassXC-Browser.",
        "description": "Info text about connected databases."
    },
    "optionsConnectedDatabasesNotFound": {
        "message": "Tidak dapat menemukan basis data yang telah terhubung.",
        "description": "Shown in the connected databases table when there is no connected databases."
    },
    "optionsDatabasesRemoveIdentifier": {
        "message": "Hapus pengidentifikasi dari daftar basis data?",
        "description": "Confirmation text when removing database from the list."
    },
    "optionsDatabasesRemoveIdentifierConfirmFirst": {
        "message": "Do you really want to remove the following identifier from the database list: $1?",
        "description": "Confirmation text when removing database from the list."
    },
    "optionsDatabasesRemoveIdentifierConfirmSecond": {
        "message": "Anda dapat menghubungkan kembali basis data Anda kapan saja.",
        "description": "Confirmation text when removing database from the list, second part."
    },
    "optionsDatabaseIdentifier": {
        "message": "Pengidentifikasi",
        "description": "Database list column title."
    },
    "optionsDatabaseKey": {
        "message": "Kunci",
        "description": "Database list column title."
    },
    "optionsDatabaseLastUsed": {
        "message": "Terakhir digunakan",
        "description": "Database list column title."
    },
    "optionsDatabaseCreated": {
        "message": "Dibuat",
        "description": "Database list column title."
    },
    "optionsDatabaseDelete": {
        "message": "Hapus",
        "description": "Database list column title."
    },
    "optionsColumnPageURL": {
        "message": "Halaman URL",
        "description": "Site Preferences list column title."
    },
    "optionsColumnIgnore": {
        "message": "Abaikan",
        "description": "Site Preferences list column title."
    },
    "optionsColumnUsernameOnly": {
        "message": "Deteksi Hanya-NamaPengguna",
        "description": "Site Preferences list column title."
    },
    "optionsColumnImprovedInputFieldDetection": {
        "message": "Deteksi Kolom Masukan yang Ditingkatkan",
        "description": "Improved Input Field Detection column text."
    },
    "optionsColumnAllowIframes": {
        "message": "Perbolehkan iframe lintas sumber",
        "description": "Allow iframes column text."
    },
    "optionsColumnDelete": {
        "message": "Hapus",
        "description": "Site Preferences list column title."
    },
    "optionsSelectionNothing": {
        "message": "Aktifkan semua fitur",
        "description": "Site Preferences option selection."
    },
    "optionsSelectionNormal": {
        "message": "Nonaktifkan kredensial baru/dimodifikasi",
        "description": "Site Preferences option selection."
    },
    "optionsSelectionAutoSubmit": {
        "message": "Nonaktifkan Pengiriman Otomatis",
        "description": "Site Preferences option selection."
    },
    "optionsSelectionFull": {
        "message": "Nonaktifkan semua fitur",
        "description": "Site Preferences option selection."
    },
    "optionsSortByTitle": {
        "message": "Judul",
        "description": "Sort matching credentials by title option selection."
    },
    "optionsSortByUsername": {
        "message": "Nama pengguna",
        "description": "Sort matching credentials by username option selection."
    },
    "optionsSortByGroupAndTitle": {
        "message": "Grup dan judul",
        "description": "Sort matching credentials by group and title option selection."
    },
    "optionsSortByGroupAndUsername": {
        "message": "Grup dan nama pengguna",
        "description": "Sort matching credentials by group and username option selection."
    },
    "optionsFillSortPriority": {
        "message": "Urutkan kredensial setelah pengisian berdasarkan",
        "description": ""
    },
    "optionsFillSortPriorityHelpText": {
        "message": "Ketika Kredensial relevan pertama dipilih, kredensial untuk entri masuk yang diisi sebelumnya akan ditetapkan sebagai pertama dalam pendaftaran Menu Isi Otomatis.",
        "description": "Help text for Sort credentials after fill."
    },
    "optionsFillSortPriorityTotp": {
        "message": "Urutkan kredensial setelah mengisi TOTP berdasarkan",
        "description": ""
    },
    "optionsFillSortPriorityTotpHelpText": {
        "message": "Ketika opsi Kredensial relevan pertama dipilih, TOTP untuk entri masuk yang sebelumnya diisi akan ditetapkan sebagai pertama dalam pendaftaran Menu Isi Otomatis. ",
        "description": "Help text for Sort credentials after fill for TOTP."
    },
    "optionsFillSortByMatchingCredentials": {
        "message": "Pengaturan pencocokan kredensial",
        "description": "Default option for Sort after fill. Respects the Matching Credentials sorting setting."
    },
    "optionsFillSortByRelevantEntry": {
        "message": "Kredensial relevan yang pertama",
        "description": "Relevant credential first option for Sort after fill."
    },
    "optionsCustomFieldsNotFound": {
        "message": "No saved Custom Login Fields found.",
        "description": "Shown when no saved custom credentials are saved."
    },
    "optionsCustomFieldsTableCaption": {
        "message": "You can manage saved Custom Login Fields using the table.",
        "description": "Table caption of Custom Login Fields page."
    },
    "optionsCustomFieldsTabHelpTextFirst": {
        "message": "Jika KeePassXC-Browser mendeteksi kolom masuk yang salah, Anda dapat menentukan kolom yang benar.",
        "description": "Saved Custom Login Fields info text, first part."
    },
    "optionsCustomFieldsTabHelpTextSecond": {
        "message": "Pergi ke laman dan klik pada ikon KeePassXC-Browser, lalu pilih",
        "description": "Saved Custom Login Fields info text, second part."
    },
    "optionsCustomFieldsTabHelpTextThird": {
        "message": "On this page you can manage saved Custom Login Fields.",
        "description": "Saved Custom Login Fields info text, third part."
    },
    "optionsCustomFieldsRemove": {
        "message": "Remove saved Custom Login Fields?",
        "description": "Confirmation text when removing saved Custom Login Fields."
    },
    "optionsCustomFieldsConfirmation": {
        "message": "Do you really want to remove the saved Custom Login Fields on the page: $1",
        "description": "Confirmation text when removing saved Custom Login Fields."
    },
    "optionsCustomFieldsConfirmationHelpText": {
        "message": "KeePassXC-Browser akan mendeteksi kolom masuk secara otomatis ketika Anda mengunjungi laman ini lagi.",
        "description": "Part of confirmation text when removing saved Custom Login Fields."
    },
    "optionsSitePreferencesNotFound": {
        "message": "No Site Preferences found.",
        "description": "Shown when no Site Preferences are saved."
    },
    "optionsSitePreferencesRemove": {
        "message": "Hapus situs?",
        "description": "Confirmation text when removing ignored sites from the list."
    },
    "optionsSitePreferencesTabHelpTextFirst": {
        "message": "Situs di laman ini memiliki metode penanganan yang khusus yang berkaitan dengan mereka.",
        "description": "Site Preferences info text, first part."
    },
    "optionsSitePreferencesTabHelpTextSecond": {
        "message": "Untuk mengabaikan kredensial baru/termodifikasi di laman khusus, tambahkan mereka di bawah atau ketika menggunakan banner kredensial di laman pilih <em>Jangan tanyakan lagi untuk situs ini</em>.",
        "description": "Site Preferences info text, second part."
    },
    "optionsSitePreferencesTabHelpTextThird": {
        "message": "Jika sebuah situs diabaikan secara penuh (<em>Nonaktifkan semua fitur</em> dipilih), lalu plugin tidak akan melakukan apa pun ketika mengunjungi situs tersebut.",
        "description": "Site Preferences info text, third part."
    },
    "optionsSitePreferencesTabHelpTextFourth": {
        "message": "Deteksi hanya nama pengguna memperbolehkan KeePassXC-Browser untuk mengisi detail masuk di situs web dengan laman terpisah untuk nama pengguna dan kata sandi.",
        "description": "Site Preferences info text, fourth part."
    },
    "optionsSitePreferencesImprovedInputFieldDetectionHelpText": {
        "message": "Deteksi Kolom Masukan yang Ditingkatkan memungkinkan deteksi kolom masukan dinamis yang lebih detail. Tetapi, ini dapat memengaruhi performa laman. Gunakan dengan hati-hati.",
        "description": "Improved Input Field Detection help text."
    },
    "optionsSitePreferencesAllowIframesHelpText": {
        "message": "Memperbolehkan iframe lintas sumber akan mengaktifkan pengambilan kredensial untuk iframe dari domain lain. Gunakan dengan risiko Anda sendiri.",
        "description": "Allow Cross-Origin iframes help text."
    },
    "optionsSitePreferencesManualAddText": {
        "message": "Tambahkan URL secara manual",
        "description": "Label for adding site manually on Site Preferences tab."
    },
    "optionsSitePreferencesManualAddHelp": {
        "message": "URL harus berawalan entah dengan <code>https://</code>, <code>http://</code>, <code>file://</code>, atau <code>ftp://</code> dan harus setidaknya 5 karakter panjang.",
        "description": "Help text for adding site manually on Site Preferences tab."
    },
    "optionsSitePreferencesConfirmation": {
        "message": "Apakah Anda ingin menghilangkan situs yang ditentukan dari daftar: $1",
        "description": "Confirmation text when removing site from Site Preferences."
    },
    "optionsSitePreferencesConfirmationHelpText": {
        "message": "KeePassXC-Browser akan mengaktifkan semua fitur untuk situs ini dan menghilangkan deteksi hanya nama pengguna.",
        "description": "Part of confirmation text when removing Site Preferences."
    },
    "optionsSitePreferencesTableCaption": {
        "message": "You can manage saved Site Preferences using the table.",
        "description": "Table caption of Site Preferences page."
    },
    "optionsSitePreferencesSelect": {
        "message": "Opsi mengabaikan fitur pengaya untuk laman.",
        "description": "Title text of select element in Site Preferences."
    },
    "optionsAboutChrome": {
        "message": "Kunjungi KeePassXC-Browser di Chrome Web Store.",
        "description": "About page link to Chrome Web Store."
    },
    "optionsAboutMozilla": {
        "message": "Kunjungi KeePassXC-Browser di direktori Mozilla Add-ons.",
        "description": "About page link to AMO."
    },
    "optionsAboutEdge": {
        "message": "Kunjungi KeePassXC-Browser di laman Add-on Edge.",
        "description": "About page link to Edge Add-ons page."
    },
    "optionsAboutGitHub": {
        "message": "Kunjungi KeePassXC-Browser di GitHub.",
        "description": "About page link to GitHub."
    },
    "optionsAboutExtensionVersion": {
        "message": "KeePassXC-Browser Versi: $1",
        "description": "About page text of extension version."
    },
    "optionsAboutKeePassXCVersion": {
        "message": "KeePassXC Versi: $1",
        "description": "About page text of KeePassXC version."
    },
    "optionsAboutContributors": {
        "message": "Kontributor",
        "description": "About page text of contributors."
    },
    "optionsAboutLicenses": {
        "message": "Lisensi",
        "description": "About page text of licenses."
    },
    "optionsAboutReportBugs": {
        "message": "Laporkan bug",
        "description": "About page text of reporting bugs."
    },
    "optionsAboutCreateNewIssue": {
        "message": "Create new issue on GitHub.",
        "description": "Link text for creating a new issue."
    },
    "optionsAboutDebugInfo": {
        "message": "Info awakutu berikut dapat digunakan",
        "description": "Debug info text."
    },
    "optionsAboutSupporters": {
        "message": "Pendukung",
        "description": "Supporters label text."
    },
    "optionsErrorInvalidValue": {
        "message": "URL tidak valid. Silakan periksa input.",
        "description": "Error shown when input field has an incorrect value."
    },
    "optionsErrorInvalidURL": {
        "message": "URL tidak valid. Silakan periksa input.",
        "description": "Error shown when input field has an incorrect URL."
    },
    "optionsErrorValueExists": {
        "message": "Nilai sudah ada dalam daftar.",
        "description": "Error shown when trying to add a duplicate value to the list."
    },
    "optionsUserInterfaceTitle": {
        "message": "Antarmuka pengguna",
        "description": "User interface title in settings page"
    },
    "optionsFillingCredentialsTitle": {
        "message": "Mengisi kredensial",
        "description": "Filling credentials title in settings page"
    },
    "optionsSavingCredentialsTitle": {
        "message": "Menyimpan kredensial",
        "description": "Saving credentials title in settings page"
    },
    "optionsUpdatesTitle": {
        "message": "Pembaruan",
        "description": "Updates title in settings page"
    },
    "optionsAdvancedSettingsTitle": {
        "message": "Pengaturan lanjutan",
        "description": "Advanced settings title in settings page"
    },
    "optionsExtensionTitle": {
        "message": "Ekstensi",
        "description": "Extension title in settings page"
    },
    "optionsPasskeysTitle": {
        "message": "Passkey",
        "description": "Passkeys settings title in settings page."
    },
    "optionsPasskeysEnable": {
        "message": "Enable passkeys",
        "description": "Enabled passkeys option text."
    },
    "optionsPasskeysEnableHelpText": {
        "message": "Aktifkan dukungan untuk Autentikasi Web.",
        "description": "Passkeys option help text."
    },
    "optionsPasskeysEnableFallback": {
        "message": "Enable passkeys fallback",
        "description": "Enabled passkeys fallback option text."
    },
    "optionsPasskeysEnableFallbackHelpText": {
        "message": "When enabled, a failed or canceled request to KeePassXC will trigger the browser's own internal passkeys request. If disabled, connection to KeePassXC is required and canceled request will fail. Default: enabled.",
        "description": "Passkeys fallback option help text."
    },
    "openNewTab": {
        "message": "Buka tab baru",
        "description": "Title attribute text."
    },
    "httpAuthDialog": {
        "message": "Dialog Autentikasi HTTP Dasar",
        "description": "Options page HTTP Basic Auth dialog text"
    },
    "autocompleteSubmitMessage": {
        "message": "Seleksi Anda akan dikirim secara otomatis",
        "description": "Message shown at the bottom of autocomplete menu."
    },
    "lockDatabase": {
        "message": "Kunci basis data",
        "description": "Lock database button title text."
    }
}
