{
    "extensionDescription": {
        "message": "KeePassXC за съвременни мрежови четци",
        "description": "Name of the extension."
    },
    "addSitePreferenceButtonTitle": {
        "message": "Добавете Предпочитания за сайтове за този адрес.",
        "description": "Add button title text on Site Preferences tab."
    },
    "allowIframeButtonTitle": {
        "message": "Разрешава рамки с ограничение по Cross-Origin за текущата страница.",
        "description": "Allow Cross-Origin iframes button title text."
    },
    "connectButtonTitle": {
        "message": "Свързване на KeePassXC-Browser с текущото хранилище.",
        "description": "Connect button title text."
    },
    "copyDebugInfoButtonTitle": {
        "message": "Копира информацията за отстраняване на дефекти.",
        "description": "Copy debug info button title text on About tab."
    },
    "dismissHttpAuthButtonTitle": {
        "message": "Отказва Basic HTTP Auth.",
        "description": "Dismiss HTTP Auth button title text."
    },
    "reconnectButtonTitle": {
        "message": "Повторно свързване на KeePassXC-Browser с текущото хранилище.",
        "description": "Reconnect button title text."
    },
    "redetectButtonTitle": {
        "message": "Повторно открива текстовите полета на страницата.",
        "description": "Redetect login fields button title text."
    },
    "reloadButtonTitle": {
        "message": "Презарежда разширението и извършва повторно свързване с KeePassXC.",
        "description": "Reload button title text."
    },
    "removeConnectedDatabaseButtonTitle": {
        "message": "Премахване на свързаното хранилище от KeePassXC-Browser.",
        "description": "Remove button title on Connected Databases tab."
    },
    "removeCustomLoginFieldsButtonTitle": {
        "message": "Премахва потребителските полета за вход за този адрес.",
        "description": "Remove button title on Custom Login Fields tab."
    },
    "removeSitePreferencesButtonTitle": {
        "message": "Премахнете Предпочитания за сайтове за този адрес.",
        "description": "Remove button title on Site Preferences tab."
    },
    "reopenDatabaseButtonTitle": {
        "message": "Повторно отключване на текущото хранилище.",
        "description": "Reopen database button title text."
    },
    "usernameButtonTitle": {
        "message": "Добавяне на настройка за вход в страницата единствено с потребителско име",
        "description": "Add Username-only detection button title text."
    },
    "contextMenuFillUsernameAndPassword": {
        "message": "Попълване на потребител и парола",
        "description": "Context menu item for filling both username and password."
    },
    "contextMenuFillPassword": {
        "message": "Попълване само на парола",
        "description": "Context menu item for filling password."
    },
    "contextMenuFillTOTP": {
        "message": "Попълване на TOTP",
        "description": "Context menu item for filling Time-based One Time Password."
    },
    "contextMenuShowPasswordGeneratorIcons": {
        "message": "Пиктограма за генератора на пароли",
        "description": "Show password generator icon on every password input field."
    },
    "contextMenuSaveCredentials": {
        "message": "Запазване на регистрация",
        "description": "Save credentials using the credential banner."
    },
    "contextMenuShowPasswordGenerator": {
        "message": "Генератор на пароли",
        "description": "Show password generator text."
    },
    "contextMenuFillAttribute": {
        "message": "Попълване на атрибут…",
        "description": "Context menu parent item for filling a custom attribute."
    },
    "contextMenuRequestGlobalAutoType": {
        "message": "Искане за глобално автоматично въвеждане",
        "description": "Global Auto-Type shortcut text."
    },
    "multipleCredentialsDetected": {
        "message": "Удостоверяване по HTTP с множество съвпадащи регистрации. За да изберете правилната регистрация, щракнете върху пиктограмата на разширението.",
        "description": "Notification when HTTP Authentication has multiple credentials detected."
    },
    "errorMessageUnknown": {
        "message": "Неизвестна грешка.",
        "description": "Unknown error."
    },
    "errorMessageDatabaseNotOpened": {
        "message": "Хранилището не е отворено.",
        "description": "Database not opened."
    },
    "errorMessageDatabaseHash": {
        "message": "Не е получен отпечатък от хранилището.",
        "description": "Database hash not received."
    },
    "errorMessageClientPublicKey": {
        "message": "Не е получен публичния ключ на клиента.",
        "description": "Client public key not received."
    },
    "errorMessageDecrypt": {
        "message": "Съобщението не може да бъде дешифрирано.",
        "description": "Cannot decrypt message."
    },
    "errorMessageTimeout": {
        "message": "Не може да бъде установена връзка с KeePassXC. Уверете се, че съчетаването с мрежовия четец е включено в настройките на приложението.",
        "description": "Cannot connect to KeePassXC. Check that browser integration is enabled in KeePassXC settings."
    },
    "errorMessageCanceled": {
        "message": "Действието е отменено или отказано.",
        "description": "Action canceled or denied."
    },
    "errorMessageEncrypt": {
        "message": "Неуспешно шифроване на съобщението. KeePassXC работи ли?",
        "description": "Message encryption failed. Is KeePassXC running?"
    },
    "errorMessageAssociate": {
        "message": "Неуспешно свързване с приложението KeePassXC, опитайте отново.",
        "description": "KeePassXC association failed, try again."
    },
    "errorMessageKeyExchange": {
        "message": "Неуспешен обмен на ключове.",
        "description": "Key exchange was not successful."
    },
    "errorMessageEncryptionKey": {
        "message": "Ключът за шифроване не е познат.",
        "description": "Encryption key is not recognized."
    },
    "errorMessageSavedDatabases": {
        "message": "Не са намерени запазени хранилища",
        "description": "No saved databases found."
    },
    "errorMessageIncorrectAction": {
        "message": "Неправилно действие.",
        "description": "Incorrect action."
    },
    "errorMessageEmptyMessage": {
        "message": "Получено е празно съобщение.",
        "description": "Empty message received."
    },
    "errorMessageNoURL": {
        "message": "Не е предоставен адрес.",
        "description": "No URL provided."
    },
    "errorMessageNoLogins": {
        "message": "Не са намерени данни за вход.",
        "description": "No logins found."
    },
    "errorMessagePaswordLengthExceeded": {
        "message": "Попълнената парола е по-дълга от разрешената дължина на съдържание в полето.",
        "description": "Error notification text shown when filled password is longer than defined maxLength of the input field."
    },
    "errorMessageNoGroupsFound": {
        "message": "Не са намерени групи.",
        "description": "No groups found."
    },
    "errorMessageCannotCreateNewGroup": {
        "message": "Нова група не може да бъде създадена.",
        "description": "Cannot create new group."
    },
    "errorMessageNoValidUuidProvided": {
        "message": "Не е предоставен валиден универсален уникален идентификатор.",
        "description": "No valid UUID provided."
    },
    "errorMessageAccessToAllEntriesDenied": {
        "message": "Достъпът до всички записи е отказан.",
        "description": "Access to all entries denied."
    },
    "errorMessagePasskeysAttestationNotSupported": {
        "message": "Не се поддържа атестация.",
        "description": "Attestation not supported."
    },
    "errorMessagePasskeysCredentialIsExcluded": {
        "message": "Данните за удостоверяване са изключени.",
        "description": "Credential is excluded."
    },
    "errorMessagePasskeysRequestCanceled": {
        "message": "Заявката за Passkeys е отказана.",
        "description": "Passkeys request canceled."
    },
    "errorMessagePasskeysInvalidUserVerification": {
        "message": "Потребителят не може да бъде потвърден.",
        "description": "Invalid user verification."
    },
    "errorMessagePasskeysEmptyPublicKey": {
        "message": "Въведете публичен ключ.",
        "description": "Empty public key."
    },
    "errorMessagePasskeysInvalidUrlProvided": {
        "message": "Предоставен е недействителен адрес.",
        "description": "Invalid URL provided."
    },
    "errorMessagePasskeysOriginNotAllowed": {
        "message": "Източникът е празен или забранен.",
        "description": "Origin is empty or not allowed."
    },
    "errorMessagePasskeysDomainNotValid": {
        "message": "Ефективният домейн не е приемлив домейн.",
        "description": "Effective domain is not a valid domain."
    },
    "errorMessagePasskeysDomainRpIdMismatch": {
        "message": "Източникът и RP ID не съвпадат.",
        "description": "Origin and RP ID do not match."
    },
    "errorMessagePasskeysNoSupportedAlgorithms": {
        "message": "Не са предоставени поддържани алгоритми.",
        "description": "No supported algorithms were provided."
    },
    "errorMessagePasskeysWaitforLifeTimer": {
        "message": "Изчакайте отброяването да приключи.",
        "description": "Wait for timer to expire."
    },
    "errorMessagePasskeysUnknownError": {
        "message": "Неочаквана грешка на Passkeys.",
        "description": "Unknown passkeys error."
    },
    "errorMessagePasskeysInvalidChallenge": {
        "message": "Предизвикването е по-късо от изискваната минимална дължина.",
        "description": "Challenge is shorter than required minimum length."
    },
    "errorMessagePasskeysInvalidUserId": {
        "message": "user.id не отговаря на изискваната дължина.",
        "description": "user.id does not match the required length."
    },
    "errorMessagePasskeysContextIsNotSecure": {
        "message": "Контекстът не е сигурен.",
        "description": "Context is not secure."
    },
    "errorNotConnected": {
        "message": "Няма връзка с KeePassXC.",
        "description": "Error notification shown when not connected to KeePassXC."
    },
    "errorCurrentDatabaseNotConnected": {
        "message": "Текущото хранилище не е свързано.",
        "description": "Error notification shown when current database is not connected during action."
    },
    "passwordGeneratorErrorTooLong": {
        "message": "Грешка: Генерираната парола е по-дълга от разрешената дължина!",
        "description": "A warning text shown in the password generator."
    },
    "passwordGeneratorErrorTooLongCut": {
        "message": "Отрязана е, за да се събере.",
        "description": "A warning text shown in the password generator."
    },
    "passwordGeneratorErrorTooLongRemember": {
        "message": "Моля, запомнете новата парола!",
        "description": "A warning text shown in the password generator."
    },
    "passwordGeneratorGenerateText": {
        "message": "Генериране на парола",
        "description": "Password icon title text."
    },
    "passwordGeneratorNotSupported": {
        "message": "Инсталираното издание на KeePassXC не поддържа отдалечено създаване на пароли. Обновете KeePassXC."
    },
    "usernameFieldText": {
        "message": "Попълва регистрация от KeePassXC.",
        "description": "Username field icon hover text."
    },
    "usernameFieldTextNoCredentials": {
        "message": "Липсват регистрации, които да бъдат попълнени.",
        "description": "Username field icon hover text when no credentials are."
    },
    "usernameLockedFieldText": {
        "message": "Хранилището е заключено.",
        "description": "Username field icon hover text when database is locked."
    },
    "usernameDisconnectedFieldText": {
        "message": "Няма връзка с KeePassXC.",
        "description": "Username field icon hover text when KeePassXC is disconnected."
    },
    "totp": {
        "message": "TOTP",
        "description": "TOTP text."
    },
    "totpFieldText": {
        "message": "Попълва TOTP от KeePassXC",
        "description": "OTP field icon hover text."
    },
    "defineClose": {
        "message": "Затваряне",
        "description": "Close button text when choosing Custom Login Fields."
    },
    "defineSkip": {
        "message": "Пропускане",
        "description": "Skip button text when choosing Custom Login Fields."
    },
    "defineMore": {
        "message": "Повече",
        "description": "More button text when choosing Custom Login Fields."
    },
    "defineReset": {
        "message": "Нулиране",
        "description": "Reset button text when choosing Custom Login Fields."
    },
    "defineConfirm": {
        "message": "Потвърждаване",
        "description": "Confirm button text when choosing Custom Login Fields."
    },
    "defineAlreadySelected": {
        "message": "Полетата за вход в тази страница вече са избрани и ще бъдат презаписани.",
        "description": "A text shown when custom credentials fields are already set for the page."
    },
    "defineClearData": {
        "message": "Премахване на запазените данни",
        "description": "Clear save data button text when choosing Custom Login Fields."
    },
    "defineStringField": {
        "message": "Поле за низ",
        "description": "Text for string field."
    },
    "defineChooseUsername": {
        "message": "Избиране поле за потребителското име",
        "description": "Choosing a username field text when choosing Custom Login Fields."
    },
    "defineChoosePassword": {
        "message": "Избиране на поле за парола",
        "description": "Choosing a password field text when choosing Custom Login Fields."
    },
    "defineChooseTOTP": {
        "message": "Избиране на поле за TOTP",
        "description": "Choosing a TOTP field text when choosing Custom Login Fields."
    },
    "defineChooseStringFields": {
        "message": "Избиране на поле за низ",
        "description": "Choose String Fields a selection text when choosing Custom Login Fields."
    },
    "defineHelpText": {
        "message": "Потвърдете избора си или изберете повече полета като полета за низ.",
        "description": "Confirm a selection text when choosing Custom Login Fields which contains string fields."
    },
    "defineKeyboardText": {
        "message": "Също можете да използвате цифрите, за да избирате полета посредством клавиатурата.",
        "description": "Help text when choosing Custom Login Fields."
    },
    "defineChooseCustomLoginFieldText": {
        "message": "Изберете поле за вход",
        "description": "Help text for Custom Login Field banner."
    },
    "username": {
        "message": "Потребителско име",
        "description": "General text for username."
    },
    "password": {
        "message": "Парола",
        "description": "General text for password."
    },
    "stringFields": {
        "message": "Полета за низове",
        "description": "General text for a String Fields."
    },
    "credentialsNoUsername": {
        "message": "- без потребителско име -",
        "description": "Shown when no username is set in the credentials."
    },
    "credentialsNoLoginsFound": {
        "message": "Не са намерени данни за вход.",
        "description": "Shown when no credentials are found for the current page."
    },
    "credentialsMultipleFound": {
        "message": "Повече от една регистрация е намерена в KeePassXC!",
        "description": "Alert message when trying to fill username and/or password when multiple credentials are found."
    },
    "credentialsMultipleFoundSecondLine": {
        "message": "Натиснете пиктограмата на KeePassXC-Browser за повече възможности.",
        "description": "Alert message when trying to fill username and/or password when multiple credentials are found."
    },
    "credentialsNoUsernameFound": {
        "message": "Не е намерена регистрация за потребителското име.",
        "description": "Alert message when no credentials are found for the given username."
    },
    "credentialsNoTOTPFound": {
        "message": "Не е намерен TOTP.",
        "description": "Alert message when no TOTP is found."
    },
    "credentialExpired": {
        "message": "Изтекъл",
        "description": "If a credential is expired, this is appended to the title label."
    },
    "fieldsFill": {
        "message": "Грешка: Не са намерени полета, които да бъдат попълнени.",
        "description": "Alert message when no fields are found to fill in."
    },
    "fieldsNoPasswordField": {
        "message": "Грешка: Не е намерено поле за парола.",
        "description": "Message shown when no password fields are found."
    },
    "fieldsPasswordFillNotAccepted": {
        "message": "Предотвратено е попълване на парола в текстово поле.",
        "description": "Message shown when password fill to a plain text field is prevented."
    },
    "rememberNothingChanged": {
        "message": "Грешка: Не е намерена променена регистрация.",
        "description": "Message shown when trying to save credentials that haven't changed."
    },
    "popupTitle": {
        "message": "KeePassXC - изкачащ прозорец",
        "description": "Popup window title."
    },
    "popupSettingsText": {
        "message": "Настройки",
        "description": "Popup Settings button text."
    },
    "popupChooseCredentialsText": {
        "message": "Изберете потребителски полета за вход",
        "description": "Popup credential choosing button text."
    },
    "popupConnectButton": {
        "message": "Свързване",
        "description": "Popup Connect button text."
    },
    "popupReconnectButton": {
        "message": "Повторно свързване",
        "description": "Popup Reconnect button text."
    },
    "popupRedetectButton": {
        "message": "Търсене на полета за вход",
        "description": "Popup Redetect login fields button text."
    },
    "popupReloadButton": {
        "message": "Презареждане",
        "description": "Popup Reload button text."
    },
    "popupReopenButton": {
        "message": "Отключване на хранилище",
        "description": "Popup reopen database button text."
    },
    "popupUsernameButton": {
        "message": "Добавяне на настройка за вход в страницата единствено с потребителско име",
        "description": "Button text for adding Username-only option."
    },
    "popupAllowIframeButton": {
        "message": "Разрешаване на рамки с ограничение по Cross-Origin за сайта",
        "description": "Button text for allowing Cross-Origin iframes option."
    },
    "popupErrorEncountered": {
        "message": "KeePassXC-Browser се натъкна на грешка:",
        "description": "A text shown above error message in the popup."
    },
    "popupUpdateAvailable": {
        "message": "Използвате предно издание на KeePassXC.",
        "description": "Popup warning message about old version of KeePassXC."
    },
    "popupDownloadNewVersion": {
        "message": "Изтеглете последното издание от keepassxc.org",
        "description": "Popup warning message link when KeePassXC version is not up-to-date."
    },
    "popupGettingStartedText": {
        "message": "Използвате за първи път? Прочетете ръководството за първи стъпки.",
        "description": "Popup information message about Getting Started Guide."
    },
    "popupGettingStartedLinkText": {
        "message": "Ръководството за първи стъпки - настройка на интеграцията с мрежовия четец",
        "description": "Popup Getting Started Guide link text."
    },
    "popupAlertHide": {
        "message": "Скрива без възможност за повторно показване.",
        "description": "Hide alert close button title."
    },
    "popupTroubleshootingText": {
        "message": "Не можете да се свържете с KeePassXC? Може би нашата страница може да ви помогне.",
        "description": "Popup information message about Troubleshooting Guide."
    },
    "popupTroubleshootingLinkText": {
        "message": "Отстраняване на неизправности",
        "description": "Popup Troubleshooting Guide link text."
    },
    "popupCheckingStatus": {
        "message": "Проверка на състоянието…",
        "description": "Checking status message in popup."
    },
    "popupNotConfigured": {
        "message": "Добавката KeePassXC-Browser не е настроена. Изберете бутона за свързване, за да свържете с KeePassXC.",
        "description": "A popup message shown when the extension has not been connected to KeePassXC."
    },
    "popupNeedReconfigure": {
        "message": "Добавката KeePassXC-Browser няма връзка с KeePassXC.",
        "description": "A popup message shown when the extension has been disconnected from KeePassXC."
    },
    "popupNeedReconfigureMessage": {
        "message": "Изберете бутона за повторно свързване, за да бъде извършен нов опит.",
        "description": "A popup message shown when reconnect is needed."
    },
    "popupConfiguredNotAssociated": {
        "message": "Добавката KeePassXC-Browser не е свързана с KeePassXC, но е настроена чрез идентификатора $1",
        "description": "A popup message shown when KeePassXC is not connected but configured."
    },
    "popupConfiguredAndAssociated": {
        "message": "Добавката KeePassXC-Browser е свързана с KeePassXC и е настроена чрез идентификатора $1",
        "description": "A popup message when a connection to KeePassXC is successful."
    },
    "popupUsernameFieldDetected": {
        "message": "Само поле за потребителско име е намерено. Адресът на страницата да бъде ли добавен към „Предпочитания за сайтове“ с настройка за вход единствено с потребителско име?",
        "description": "Text shown when page can be added to Site Preferences with Username-only option enabled."
    },
    "popupIframeDetected": {
        "message": "Установена е рамка с ограничение по Cross-Origin. Желаете ли адресът да бъде добавен към предпочитанията на сайтове с отметнато поле за Cross-Origin?",
        "description": "Text shown when page can be added to Site Preferences with Allow Cross-Origin iframes option enabled."
    },
    "rememberInfoText": {
        "message": "Данни за вход са променени! Да бъдат ли запазени?",
        "description": "Message when username or password has changed."
    },
    "rememberSaving": {
        "message": "Регистрацията ще бъде запазена в свързаното хранилище с идентификатор $1",
        "description": "A message when saving or updating credentials."
    },
    "rememberNewUsername": {
        "message": "Следното потребителско име все още не е запазено: $1",
        "description": "A message shown when a new username is detected when saving credentials."
    },
    "rememberUsernameExists": {
        "message": "Регистрациите с използваното потребителско име са отбелязани с получер шрифт: $1",
        "description": "A message shown when an existing username is detected when saving credentials."
    },
    "rememberChooseCredentials": {
        "message": "Изберете регистрациите, които да бъдат обновени.",
        "description": "A message shown choosing what credentials user wants to update."
    },
    "rememberChooseGroup": {
        "message": "Изберете група, в която да бъде добавена нова регистрация.",
        "description": "A message shown choosing what group user wants to use for new credentials."
    },
    "rememberInfoDefaultGroupNotFound": {
        "message": "Група по подразбиране е създадена в свързаното хранилище.",
        "description": "Info message shown when default group set cannot be found."
    },
    "rememberErrorCreatingNewGroup": {
        "message": "Нови групи не могат да бъдат създавани.",
        "description": "Error message shown when new groups cannot be created."
    },
    "rememberErrorPasswordNotChanged": {
        "message": "Не са обновени регистрации. Паролата не е променена.",
        "description": "Error message shown when credential password is not changed."
    },
    "rememberErrorCannotSaveCredentials": {
        "message": "Регистрациите не могат да бъдат запазени или обновени.",
        "description": "Error message shown when credentials cannot be saved or updated."
    },
    "rememberErrorDatabaseClosed": {
        "message": "Регистрации не могат да бъдат запазвани или обновявани при затворено хранилище.",
        "description": "Error message shown when credentials cannot be saved or updated and the database is closed."
    },
    "rememberCredentialsNotSaved": {
        "message": "Операцията е отменена. Регистрациите не са обновени.",
        "description": "Message shown when saving operation was cancelled."
    },
    "rememberCredentialsSaved": {
        "message": "Запазена е нова регистрация с потребителско име $1. ",
        "description": "Message shown when new credentials are saved."
    },
    "rememberCredentialsUpdated": {
        "message": "Регистрацията с потребителско име $1 е обновена.",
        "description": "Message shown when new credentials are successfully updated."
    },
    "rememberCredentialsExists": {
        "message": "Има подобна регистрация. Нищо не е обновено.",
        "description": "Message shown when new credentials already found in database."
    },
    "rememberEmptyUsername": {
        "message": "(празно)",
        "description": "Means an empty username."
    },
    "rememberNoPassword": {
        "message": "Попълнете полето за парола преди да запазите регистрацията.",
        "description": "Message shown when no password is set when saving credentials."
    },
    "popupLoginText": {
        "message": "Изберете регистрацията, която искате да бъде въведена в страницата.",
        "description": "A popup message shown when one or multiple credentials are present."
    },
    "popupFilterText": {
        "message": "Филтър:",
        "description": "Text for login credentials quick filter."
    },
    "popupAuthText": {
        "message": "Изберете регистрацията, с която искате да влезете в страницата.",
        "description": "A popup message shown when doing HTTP Authentication with multiple credentials present."
    },
    "popupMultiplePasswordFields": {
        "message": "На тази страница е намерено повече от едно поле за парола. Щракнете с десния бутон на мишката върху някое от тях и изберете едно от следните:",
        "description": "A popup message shown when web page has multiple password fields."
    },
    "popupUsername": {
        "message": "Потребителско име:",
        "description": "A username field name shown on credential update."
    },
    "popupButtonNew": {
        "message": "Добавяне",
        "description": "New button text in popup when updating credentials."
    },
    "popupButtonUpdate": {
        "message": "Обновяване",
        "description": "Update button text in popup when updating credentials."
    },
    "popupButtonCancel": {
        "message": "Отказ",
        "description": "Cancel button text in popup when updating credentials."
    },
    "popupButtonBack": {
        "message": "Назад",
        "description": "Back button text in popup when updating credentials."
    },
    "popupButtonIgnore": {
        "message": "Спиране на въпроса за тази страница",
        "description": "Ignore button text in popup or in notification when updating credentials."
    },
    "popupButtonClose": {
        "message": "Затваряне",
        "description": "Close button text in popup or in notification."
    },
    "popupButtonDismissHttpAuth": {
        "message": "Отхвърляне и показване на подразбирания диалогов прозорец за удостоверяване",
        "description": "Dismiss button text when in HTTP Authentication popup."
    },
    "optionsTitle": {
        "message": "Настройки | KeePassXC-Browser",
        "description": "Options page title."
    },
    "optionsGeneralSettingsTab": {
        "message": "Общи настройки",
        "description": "General Settings tab text."
    },
    "optionsConnectedDatabasesTab": {
        "message": "Свързани хранилища",
        "description": "Connected Databases tab text."
    },
    "optionsCustomFieldsTab": {
        "message": "Потребителски полета за вход",
        "description": "Saved Custom Login Fields tab text."
    },
    "optionsSitePreferencesTab": {
        "message": "Предпочитания за сайтове",
        "description": "Site Preferences fields tab text."
    },
    "optionsAboutTab": {
        "message": "Относно",
        "description": "About tab text."
    },
    "optionsMenuGeneral": {
        "message": "Общи",
        "description": "General settings page header."
    },
    "optionsMenuConnectedDatabases": {
        "message": "Свързани хранилища",
        "description": "Connected Databases page header."
    },
    "optionsMenuCustomFields": {
        "message": "Потребителски полета за вход",
        "description": "Custom Login Fields page header."
    },
    "optionsMenuSitePreferences": {
        "message": "Предпочитания за сайтове",
        "description": "Site Preferences page header."
    },
    "optionsMenuAbout": {
        "message": "Относно",
        "description": "About page header."
    },
    "optionsConfigureShortcuts": {
        "message": "Клавишни комбинации",
        "description": "Keyboard shortcut button and title text."
    },
    "optionsButtonSave": {
        "message": "Запазване",
        "description": "Save button text."
    },
    "optionsButtonConnect": {
        "message": "Свързване",
        "description": "Connect button text."
    },
    "optionsButtonRemove": {
        "message": "Премахване",
        "description": "Remove button text."
    },
    "optionsButtonAdd": {
        "message": "Добавяне",
        "description": "Add button text."
    },
    "optionsButtonUpdate": {
        "message": "Проверка за обновяване",
        "description": "Check for updates button text."
    },
    "optionsButtonRemoveNow": {
        "message": "Премахване",
        "description": "Confirm button text when removing database key or Custom Login Fields."
    },
    "optionsButtonCancel": {
        "message": "Отмяна",
        "description": "Cancel button text when removing database key or Custom Login Fields."
    },
    "optionsButtonReset": {
        "message": "Нулиране",
        "description": "Reset button text for keyboard shortcuts."
    },
    "optionsButtonImport": {
        "message": "Внасяне на настройки",
        "description": "Import settings button text."
    },
    "optionsButtonExport": {
        "message": "Изнасяне на настройки",
        "description": "Export settings button text."
    },
    "optionsLabelDefaultGroup": {
        "message": "Група по подразбиране при добавяне на регистрации:",
        "description": "Default group options text."
    },
    "optionsDefaultGroupHelpText": {
        "message": "Разделете групите с наклонени черти, например: Група/Подгрупа.",
        "description": "Default group help text."
    },
    "optionsLabelDefaultPasskeyGroup": {
        "message": "Група по подразбиране при добавяне на Passkeys:",
        "description": "Default passkey group options text."
    },
    "optionsLabelDefaultGroupCheckboxText": {
        "message": "Винаги да пита къде да бъдат запазвани новите регистрации",
        "description": "Default group checkbox help text."
    },
    "optionsLabelDefaultGroupCheckboxHelpText": {
        "message": "Когато е отметнато, изскачащият прозорец показва списък с групите.",
        "description": "Default checkbox explanation help text."
    },
    "optionsCheckboxUsePasswordGenerator": {
        "message": "Пиктограма за генератора на пароли",
        "description": "Activate password generator icons checkbox text."
    },
    "optionsCheckboxUsernameIcons": {
        "message": "Пиктограма в полето за потребителско име",
        "description": "Activate username field icons textbox text."
    },
    "optionsUseObserver": {
        "message": "Динамично откриване на полетата за въвеждане",
        "description": "Use dynamic input field detection checkbox text."
    },
    "optionsUseObserverHelpText": {
        "message": "Полезно за страници, които използват изскачащи прозорци или динамични диалози. Ако е изключено се намалява натоварването на процесора на по-бавни машини. Когато е изключено могат да бъдат добавяни регистрации само с помощта на клавишни комбинации, контекстуалното меню или изскачащия прозорец на разширението.",
        "description": "Use dynamic input field detection help text."
    },
    "optionsCheckboxOTPIcons": {
        "message": "Пиктограма в полето 2FA/OTP",
        "description": "Activate OTP field icons textbox text."
    },
    "optionsCheckboxAutoRetrieveCredentials": {
        "message": "Автоматично извличане на регистрации.",
        "description": "Automatically retrieve credentials checkbox text."
    },
    "optionsCheckboxAutomaticReconnect": {
        "message": "Автоматично повторно свързване с KeePassXC",
        "description": "Auto-reconnect checkbox text."
    },
    "optionsAutomaticReconnectWarning": {
        "message": "Внимание! Тази функция е експериментална. Използвайте на собствен риск.",
        "description": "Auto-reconnect warning message."
    },
    "optionsCheckboxAutoFillSingleEntry": {
        "message": "Автоматично попълване на единични съвпадения",
        "description": "Automatically fill-in single credential entry checkbox text."
    },
    "optionsCheckboxAutoFillRelevantCredential": {
        "message": "Автоматично попълване на свързани регистрации",
        "description": "Automatically fill-in relevant credential entry checkbox text."
    },
    "optionsCheckboxAutoFillSingleTotp": {
        "message": "Автоматично попълване на единични съвпадения за TOTP",
        "description": "Automatically fill-in single TOTP entries checkbox text."
    },
    "optionsCheckboxAutoCompleteUsernames": {
        "message": "Автоматично попълване за полета с потребителско име",
        "description": "Activate autocomplete for username fields checkbox text."
    },
    "optionsCheckboxShowGroupNameInAutocomplete": {
        "message": "При регистрации от различни групи името на групата е видимо в списъка за автоматично довършване",
        "description": "Show group name in autocomplete checkbox text."
    },
    "optionsCheckboxAutoSubmit": {
        "message": "Автоматично изпращане на формуляри за вход",
        "description": "Auto-submit checkbox text."
    },
    "optionsAutoSubmitHelpText": {
        "message": "Автоматично изпраща избраните регистрации. Изключено при автоматично попълване на единични съвпадения.",
        "description": "Auto-submit help text."
    },
    "optionsCheckboxShowNotifications": {
        "message": "Показване на известия",
        "description": "Show notifications checkbox text."
    },
    "optionsCheckboxUseMonochromeToolbarIcon": {
        "message": "Едноцветна пиктограма в лентата с инструменти",
        "description": "Use monochrome toolbar icon checkbox text."
    },
    "optionsCheckboxUseCompactMode": {
        "message": "Умален режим",
        "description": "Whether the compact mode (legacy dropdown) should be enabled."
    },
    "optionsSaveDomainOnly": {
        "message": "Запазване само на домейна",
        "description": "Save domain only checkbox text."
    },
    "optionsCheckboxShowLoginNotifications": {
        "message": "Показване на лента в страницата, когато могат да бъдат запазвани нови регистрации",
        "description": "Show login notifications checkbox text."
    },
    "optionsRedirectAllowance": {
        "message": "Брой разрешени пренасочвания: $1",
        "description": "Redirect allowance range input text."
    },
    "optionsRedirectAllowanceHelpText": {
        "message": "Колко пренасочвания са разрешени, докато банерът изчезне. Стойността по подразбиране е 3. Максимумът е безкраен.",
        "description": "Redirect allowance help text."
    },
    "optionsCheckboxAutoFillAndSend": {
        "message": "Разрешава попълване на регистрации на HTTP Basic Auth",
        "description": "Allow filling HTTP Basic Auth credentials checkbox text."
    },
    "optionsDebugLogging": {
        "message": "Дневник за отстраняване на грешки",
        "description": "Debug logging checkbox text."
    },
    "optionsDebugLoggingHelpText": {
        "message": "Включва зсписване в дневника за отстраняване на грешки. В конзолата ще има допълнителни съобщения от скрипта във фонов режим и скрипта за съдържание.",
        "description": "Debug logging help text."
    },
    "optionsRadioText": {
        "message": "Проверка за обновяване на KeePassXC:",
        "description": "Text above radio buttons in the settings page."
    },
    "optionsRadioThreeDays": {
        "message": "на всеки три дена",
        "description": "Radio button text."
    },
    "optionsRadioWeek": {
        "message": "всяка седмица",
        "description": "Radio button text."
    },
    "optionsRadioMonth": {
        "message": "всеки месец",
        "description": "Radio button text."
    },
    "optionsRadioNever": {
        "message": "никога",
        "description": "Radio button text."
    },
    "optionsThemeSelectionHeader": {
        "message": "Тема",
        "description": "Theme selection header text."
    },
    "optionsCredentialSortSelectionHeader": {
        "message": "Съвпадащите регистрации се подреждат по",
        "description": "Credential sort option header text."
    },
    "optionsThemeSelection": {
        "message": "Изберете цветова тема",
        "description": "Theme selection title text."
    },
    "optionsThemeSystem": {
        "message": "Системна",
        "description": "System theme text."
    },
    "optionsThemeDark": {
        "message": "Тъмна",
        "description": "Dark theme text."
    },
    "optionsThemeLight": {
        "message": "Светла",
        "description": "Light theme text."
    },
    "optionsKeyboardShortcutsHeader": {
        "message": "Клавишни комбинации",
        "description": "Keyboard shortcut header text."
    },
    "optionsUsePasswordGeneratorHelpText": {
        "message": "Добавя пиктограма към полето за парола, която създава на нова парола.",
        "description": "Password Generator option help text."
    },
    "optionsUsePasswordGeneratorHelpTextSecond": {
        "message": "Паролите се генерират от KeePassXC с помощта на профила за генериране на пароли.",
        "description": "Password Generator option help text, second part."
    },
    "optionsPredefinedSiteList": {
        "message": "Предварително определени страници",
        "description": "Predefined site list details button text."
    },
    "optionsUsePredefinedSites": {
        "message": "Използване на предварително определените страници с цел съвместимост",
        "description": "Use predefined sites checkbox text."
    },
    "optionsUsePredefinedSitesHelpText": {
        "message": "Добавя към „Предпочитания за сайтове“ често срещаните страници, които имат формуляр за вход единствено с потребителско име.",
        "description": "Use predefined sites option help text."
    },
    "optionsShowLoginFormIconHelpText": {
        "message": "Добавя пиктограма към полето за потребителско име, която с едно действие попълва регистрации.",
        "description": "Username field icon option help text."
    },
    "optionsShowOTPIconHelpText": {
        "message": "Добавя се пиктограма към полета, които са разпознати като OTP/2FA.",
        "description": "OTP field icon option help text."
    },
    "optionsAutoRetrieveCredentialsHelpText": {
        "message": "KeePassXC-Browser ще зареди регистрациите веднага щом разделът стане активен.",
        "description": "Auto-Retrive Credentials option help text."
    },
    "optionsAutomaticReconnectHelpText": {
        "message": "При откриване на KeePassXC се свързва автоматично.",
        "description": "Auto-reconnect option help text."
    },
    "optionsAutoFillSingleEntryHelpText": {
        "message": "KeePassXC-Browser автоматично попълва регистрацията при едно съвпадение.",
        "description": "Auto-Fill Single Entry option help text."
    },
    "optionsAutoFillRelevantCredentialHelpText": {
        "message": "Автоматично попълване на съответните регистрации ако е необходимо второ попълване.",
        "description": "Auto-Fill Relevant Credential option help text."
    },
    "optionsAutoFillSingleEntryWarning": {
        "message": "Внимание! Автоматичното попълване не е безопасно. Използвайте го на свой риск. KeePassXC-Browser се опитва автоматично да открие полетата за вход. Обаче те могат да не бъдат открити правилно, като е възможно да бъдат попълнени чувствителни данни в грешните полета.",
        "description": "Auto-Fill Single Entry warning text."
    },
    "optionsAutoFillSingleTotpHelpText": {
        "message": "KeePassXC-Browser автоматично попълва съдържанието на полето за TOTP при едно съвпадение.",
        "description": "Auto-Fill Single TOTP field option help text."
    },
    "optionsAutocompleteUsernamesHelpText": {
        "message": "Показва падащ списък с наличните регистрации за всички полета за потребителско име на страницата.",
        "description": "Autocomplete Usernames option help text."
    },
    "optionsShowGroupNameInAutocompleteHelpText": {
        "message": "Ако в списъка са налични регистрации от различни групи, тогава името на групата да е видимо. Отнася се само за умален режим.",
        "description": "Show group name in autocomplete help text."
    },
    "optionsShowNotificationsHelpText": {
        "message": "Показват се известия при грешки и при необходимост от взаимодействие с потребителя.",
        "description": "Show notifications option help text."
    },
    "optionsUseMonochromeToolbarIconHelpText": {
        "message": "Едноцветна пиктограма с цветни значки в лентата с инструменти, която се адаптира към светла / тъмна тема на четеца.",
        "description": "Use monochrome toolbar icon option help text."
    },
    "optionsUseCompactModeHelpText": {
        "message": "Използване на умален вариант на падащия списък за избор на регистрации.",
        "description": "Use compact (legacy) mode help text."
    },
    "optionsSaveDomainOnlyHelpText": {
        "message": "При добавяне на регистрации да бъде запазван само домейна вместо целия адрес.",
        "description": "Save domain only option help text."
    },
    "optionsSaveDomainOnlyCustomLoginHelpText": {
        "message": "При добавяне на потребителски полета за вход да бъде запазен само домейна вместо целия адрес.",
        "description": "Save domain only option help text."
    },
    "optionsDownloadFaviconAfterSave": {
        "message": "Изтегляне на пиктограмата на страницата след запазване",
        "description": "Download favicon after save checkbox label text."
    },
    "optionsDownloadFaviconAfterSaveHelpText": {
        "message": "При добавяне на регистрация пиктограмата на страницата ще бъде изтеглена автоматично.",
        "description": "Download favicon after save help text."
    },
    "optionsAutoFillAndSendHelpText": {
        "message": "Ако има съвпадащи регистрации и вида на удостоверяване е HTTP Basic Auth, KeePassXC-Browser автоматично ще направи опит за вход с първата намерена. Ако има повече регистрации, необходимата може да бъде избрана от изскачащия прозорец на разширението. Дори и да е включена тази функция пак е възможно да въведете данните ръчно.",
        "description": "Auto-Fill And Send option help text."
    },
    "optionsAutoFillAndSendHelpTextSecond": {
        "message": "Диалогът за HTTP Basic Auth изглежда така:",
        "description": "HTTP Basic Auth image help text."
    },
    "optionsClearCredentialsTimeout": {
        "message": "Изчистване на попълнените регистрации от неактивните раздели след (секунди, 0-3600)",
        "description": "Clear credentials label text."
    },
    "optionsClearCredentialsTimeoutHelpText": {
        "message": "Попълнените регистрации се изчистват от неактивните раздели след изтичане на времето и отново ще бъде поискано разрешение за тези раздели.",
        "description": "Clear credentials timeout help text."
    },
    "optionsVersionInfoText": {
        "message": "KeePassXC-Browser се нуждае от KeePassXC за достъп до регистрации.",
        "description": "Settings page version info text."
    },
    "optionsVersionDownload": {
        "message": "Можете да изтеглите последното стабилно издание от $1",
        "description": "Settings page download link."
    },
    "optionsVersionRunning": {
        "message": "Използвате KeePassXC издание: $1",
        "description": "Settings page info text of user's KeePassXC version."
    },
    "optionsLatestVersion": {
        "message": "Последното достъпно издание на KeePassXC: $1",
        "description": "Settings page info text about the latest KeePassXC version."
    },
    "optionsKeePassXCVersionRequired": {
        "message": "Изисква KeePassXC издание: $1",
        "description": "KeePassXC version requirement text."
    },
    "optionsDefault": {
        "message": "По подразбиране: $1",
        "description": "Default setting text."
    },
    "optionsInfinite": {
        "message": "Безкраен: $1",
        "description": "Infinite setting text."
    },
    "optionsRecommended": {
        "message": "Препоръчителен: $1",
        "description": "Recommended setting text."
    },
    "optionsShortcutsSuccess": {
        "message": "Клавишната комбинация за $1 е променена успешно.",
        "description": "Message for successful keyboard shortcut change."
    },
    "optionsShortcutsInfo": {
        "message": "Клавишната комбинация за $1 е нулирана.",
        "description": "Info message for changing keyboard shortcuts."
    },
    "optionsShortcutsDanger": {
        "message": "Грешка: Клавишната комбинация за $1 не е променена!",
        "description": "Error message for changing keyboard shortcuts."
    },
    "optionsImportExportSettings": {
        "message": "Настройки за внасяне/изнасяне",
        "description": "Settings page header text for import/export."
    },
    "optionsImportSettingsDialogTitle": {
        "message": "Да бъдат ли внесени настройките от файла?",
        "description": "Import settings confirmation dialog title text."
    },
    "optionsImportSettingsDialogText": {
        "message": "Текущите настройки ще бъдат презаписани. Наистина ли желаете да бъдат внесени настройките от файла?",
        "description": "Import settings confirmation dialog help text."
    },
    "optionsConnectedDatabasesText": {
        "message": "Хранилища, свързани с KeePassXC-Browser.",
        "description": "Info text about connected databases."
    },
    "optionsConnectedDatabasesNotFound": {
        "message": "Не са намерени свързани хранилища.",
        "description": "Shown in the connected databases table when there is no connected databases."
    },
    "optionsDatabasesRemoveIdentifier": {
        "message": "Да бъде ли премахнат идентификаторът от списъка с хранилища?",
        "description": "Confirmation text when removing database from the list."
    },
    "optionsDatabasesRemoveIdentifierConfirmFirst": {
        "message": "Желаете следния идентификатор да премахнат от списъка: $1?",
        "description": "Confirmation text when removing database from the list."
    },
    "optionsDatabasesRemoveIdentifierConfirmSecond": {
        "message": "Можете да свържете отново хранилището по всяко време.",
        "description": "Confirmation text when removing database from the list, second part."
    },
    "optionsDatabaseIdentifier": {
        "message": "Идентификатор",
        "description": "Database list column title."
    },
    "optionsDatabaseKey": {
        "message": "Ключ",
        "description": "Database list column title."
    },
    "optionsDatabaseLastUsed": {
        "message": "Последно използвана",
        "description": "Database list column title."
    },
    "optionsDatabaseCreated": {
        "message": "Създадена",
        "description": "Database list column title."
    },
    "optionsDatabaseDelete": {
        "message": "Премахване",
        "description": "Database list column title."
    },
    "optionsColumnPageURL": {
        "message": "Адрес на страница",
        "description": "Site Preferences list column title."
    },
    "optionsColumnIgnore": {
        "message": "Пренебрегване",
        "description": "Site Preferences list column title."
    },
    "optionsColumnUsernameOnly": {
        "message": "Намиране на формуляри за вход единствено с потребителско име",
        "description": "Site Preferences list column title."
    },
    "optionsColumnImprovedInputFieldDetection": {
        "message": "Подобрено откриване на полета за вход",
        "description": "Improved Input Field Detection column text."
    },
    "optionsColumnAllowIframes": {
        "message": "Разрешаване на рамки с ограничение по Cross-Origin",
        "description": "Allow iframes column text."
    },
    "optionsColumnDelete": {
        "message": "Премахване",
        "description": "Site Preferences list column title."
    },
    "optionsSelectionNothing": {
        "message": "Включване на всички функции",
        "description": "Site Preferences option selection."
    },
    "optionsSelectionNormal": {
        "message": " Пренебрегване на нови и променени регистрации",
        "description": "Site Preferences option selection."
    },
    "optionsSelectionAutoSubmit": {
        "message": "Изключване на автоматично изпращане",
        "description": "Site Preferences option selection."
    },
    "optionsSelectionFull": {
        "message": "Изключване на всички функции",
        "description": "Site Preferences option selection."
    },
    "optionsSortByTitle": {
        "message": "Заглавие",
        "description": "Sort matching credentials by title option selection."
    },
    "optionsSortByUsername": {
        "message": "Потребителско име",
        "description": "Sort matching credentials by username option selection."
    },
    "optionsSortByGroupAndTitle": {
        "message": "Група и заглавие",
        "description": "Sort matching credentials by group and title option selection."
    },
    "optionsSortByGroupAndUsername": {
        "message": "Група и потребителско име",
        "description": "Sort matching credentials by group and username option selection."
    },
    "optionsFillSortPriority": {
        "message": "След попълване, регистрациите се подреждат по",
        "description": ""
    },
    "optionsFillSortPriorityHelpText": {
        "message": "Когато е избрана възможността „Първо съответстващите регистрации“, попълнените регистрации при предишен вход биват премествани в началото на списъка за автоматично попълване.",
        "description": "Help text for Sort credentials after fill."
    },
    "optionsFillSortPriorityTotp": {
        "message": "След попълване на TOTP, регистрациите се подреждат по",
        "description": ""
    },
    "optionsFillSortPriorityTotpHelpText": {
        "message": "Когато е избрана възможността „Първо съответстващите регистрации“, попълнените TOTP при предишен вход биват премествани в началото на списъка за автоматично попълване.",
        "description": "Help text for Sort credentials after fill for TOTP."
    },
    "optionsFillSortByMatchingCredentials": {
        "message": "Настройките за съвпадение на регистрации",
        "description": "Default option for Sort after fill. Respects the Matching Credentials sorting setting."
    },
    "optionsFillSortByRelevantEntry": {
        "message": "Първо съответстващите регистрации",
        "description": "Relevant credential first option for Sort after fill."
    },
    "optionsCustomFieldsNotFound": {
        "message": "Липсват запазени потребителски полета за вход.",
        "description": "Shown when no saved custom credentials are saved."
    },
    "optionsCustomFieldsTableCaption": {
        "message": "Можете да управлявате запазените потребителски полета за вход с помощта на таблицата.",
        "description": "Table caption of Custom Login Fields page."
    },
    "optionsCustomFieldsTabHelpTextFirst": {
        "message": "Ако KeePassXC-Browser открие грешни полета за вход, ще можете да определите правилните полета сами.",
        "description": "Saved Custom Login Fields info text, first part."
    },
    "optionsCustomFieldsTabHelpTextSecond": {
        "message": "Отидете на страницата и щракнете върху пиктограмата на KeePassXC-Browser, след което да изберете ",
        "description": "Saved Custom Login Fields info text, second part."
    },
    "optionsCustomFieldsTabHelpTextThird": {
        "message": "На тази страница  управлявате запазените потребителски полета за вход.",
        "description": "Saved Custom Login Fields info text, third part."
    },
    "optionsCustomFieldsRemove": {
        "message": "Да бъдат ли премахнати запазените потребителски полета за вход?",
        "description": "Confirmation text when removing saved Custom Login Fields."
    },
    "optionsCustomFieldsConfirmation": {
        "message": "Наистина ли желаете да бъдат премахнати запазените потребителски полета за вход в страницата: $1",
        "description": "Confirmation text when removing saved Custom Login Fields."
    },
    "optionsCustomFieldsConfirmationHelpText": {
        "message": "KeePassXC-Browser автоматично ще открие полетата за вход следващия път, когато посетите тази страница.",
        "description": "Part of confirmation text when removing saved Custom Login Fields."
    },
    "optionsSitePreferencesNotFound": {
        "message": "Липсват Предпочитания за сайтове.",
        "description": "Shown when no Site Preferences are saved."
    },
    "optionsSitePreferencesRemove": {
        "message": "Премахване на сайт?",
        "description": "Confirmation text when removing ignored sites from the list."
    },
    "optionsSitePreferencesTabHelpTextFirst": {
        "message": "Сайтовете на тази страница имат специални методи за обработка свързани с тях.",
        "description": "Site Preferences info text, first part."
    },
    "optionsSitePreferencesTabHelpTextSecond": {
        "message": "За да бъдат пренебрегнати новите и променените регистрации за определена страница я добавете по-долу или от лентата в страницата изберете <em>Спиране на въпроса за страницата</em>.",
        "description": "Site Preferences info text, second part."
    },
    "optionsSitePreferencesTabHelpTextThird": {
        "message": "Ако даден сайт е напълно пренебрегнат (избрано е <em>Изключване на всички функции</em>), тогава добавката няма да направи нищо, когато посетите тази страница.",
        "description": "Site Preferences info text, third part."
    },
    "optionsSitePreferencesTabHelpTextFourth": {
        "message": "Намирането на формуляри за вход единствено с потребителско име дава възможност на KeePassXC-Browser да попълва данни за вход в сайтове с отделни страници за потребителя и паролата.",
        "description": "Site Preferences info text, fourth part."
    },
    "optionsSitePreferencesImprovedInputFieldDetectionHelpText": {
        "message": "Подобреното откриване на полета за вход дава възможност за по-внимателно, динамично откриване на полета за вход. Това обаче може да повлияе на бързодействието на страницата. Използвайте с повишено внимание.",
        "description": "Improved Input Field Detection help text."
    },
    "optionsSitePreferencesAllowIframesHelpText": {
        "message": "Разрешавайки достъп на рамките с ограничение по Cross-Origin, осигурявате достъп до вашите регистрации от съвсем друг домейн. Използвайте на свой риск.",
        "description": "Allow Cross-Origin iframes help text."
    },
    "optionsSitePreferencesManualAddText": {
        "message": "Ръчно добавяне на адрес",
        "description": "Label for adding site manually on Site Preferences tab."
    },
    "optionsSitePreferencesManualAddHelp": {
        "message": "Адресът трябва да започва с <code>https://</code>, <code>http://</code>, <code>file://</code>, или <code>ftp://</code> и трябва да е с дължина най-малко 5 знака.",
        "description": "Help text for adding site manually on Site Preferences tab."
    },
    "optionsSitePreferencesConfirmation": {
        "message": "Наистина ли искате да премахнете указания сайт от списъка: $1",
        "description": "Confirmation text when removing site from Site Preferences."
    },
    "optionsSitePreferencesConfirmationHelpText": {
        "message": "KeePassXC-Browser ще използва всички свои възможности на тази страница и няма да търси формуляри за вход единствено с потребителско име.",
        "description": "Part of confirmation text when removing Site Preferences."
    },
    "optionsSitePreferencesTableCaption": {
        "message": "Можете да управлявате Предпочитанията за сайтове с помощта на таблицата.",
        "description": "Table caption of Site Preferences page."
    },
    "optionsSitePreferencesSelect": {
        "message": "Възможност за потискане на разширението за тази страница.",
        "description": "Title text of select element in Site Preferences."
    },
    "optionsAboutChrome": {
        "message": "Посетете KeePassXC-Browser в магазина на Chrome.",
        "description": "About page link to Chrome Web Store."
    },
    "optionsAboutMozilla": {
        "message": "Посетете KeePassXC-Browser в страницата за добавки на Mozilla.",
        "description": "About page link to AMO."
    },
    "optionsAboutEdge": {
        "message": "Посетете KeePassXC-Browser в страницата с добавки на Edge.",
        "description": "About page link to Edge Add-ons page."
    },
    "optionsAboutGitHub": {
        "message": "Посетете KeePassXC-Browser в GitHub.",
        "description": "About page link to GitHub."
    },
    "optionsAboutExtensionVersion": {
        "message": "Издание на KeePassXC-Browser: $1",
        "description": "About page text of extension version."
    },
    "optionsAboutKeePassXCVersion": {
        "message": "KeePassXC издание: $1",
        "description": "About page text of KeePassXC version."
    },
    "optionsAboutContributors": {
        "message": "Сътрудници",
        "description": "About page text of contributors."
    },
    "optionsAboutLicenses": {
        "message": "Лицензи",
        "description": "About page text of licenses."
    },
    "optionsAboutReportBugs": {
        "message": "Докладване на грешки",
        "description": "About page text of reporting bugs."
    },
    "optionsAboutCreateNewIssue": {
        "message": "Докладване на проблем в GitHub.",
        "description": "Link text for creating a new issue."
    },
    "optionsAboutDebugInfo": {
        "message": "Може да се използва следната информация за отстраняване на грешки",
        "description": "Debug info text."
    },
    "optionsAboutSupporters": {
        "message": "Поддръжници",
        "description": "Supporters label text."
    },
    "optionsErrorInvalidValue": {
        "message": "Недействителна стойност. Проверете въведеното.",
        "description": "Error shown when input field has an incorrect value."
    },
    "optionsErrorInvalidURL": {
        "message": "Недействителен адрес. Проверете въведеното.",
        "description": "Error shown when input field has an incorrect URL."
    },
    "optionsErrorValueExists": {
        "message": "Стойността вече съществува в списъка.",
        "description": "Error shown when trying to add a duplicate value to the list."
    },
    "optionsUserInterfaceTitle": {
        "message": "Интерфейс",
        "description": "User interface title in settings page"
    },
    "optionsFillingCredentialsTitle": {
        "message": "Попълване на регистрации",
        "description": "Filling credentials title in settings page"
    },
    "optionsSavingCredentialsTitle": {
        "message": "Запазване на регистрации",
        "description": "Saving credentials title in settings page"
    },
    "optionsUpdatesTitle": {
        "message": "Обновяване",
        "description": "Updates title in settings page"
    },
    "optionsAdvancedSettingsTitle": {
        "message": "Разширени настройки",
        "description": "Advanced settings title in settings page"
    },
    "optionsExtensionTitle": {
        "message": "Разширение",
        "description": "Extension title in settings page"
    },
    "optionsPasskeysTitle": {
        "message": "Passkeys",
        "description": "Passkeys settings title in settings page."
    },
    "optionsPasskeysEnable": {
        "message": "Включване на Passkeys",
        "description": "Enabled passkeys option text."
    },
    "optionsPasskeysEnableHelpText": {
        "message": "Поддръжане на Web Authentication.",
        "description": "Passkeys option help text."
    },
    "optionsPasskeysEnableFallback": {
        "message": "Резервен вариант на Passkeys",
        "description": "Enabled passkeys fallback option text."
    },
    "optionsPasskeysEnableFallbackHelpText": {
        "message": "Когато е отметнато, грешна или отказана заявка към KeePassXC ще задейства вградената в четеца заявка за Passkeys. Ако не е отметнато, връзка към KeePassXC е задължителна и отказаната заявка ще води до грешка. По подразбиране: отметнато.",
        "description": "Passkeys fallback option help text."
    },
    "openNewTab": {
        "message": "Отваря нов раздел",
        "description": "Title attribute text."
    },
    "httpAuthDialog": {
        "message": "Диалог HTTP Basic Authentication dialog",
        "description": "Options page HTTP Basic Auth dialog text"
    },
    "autocompleteSubmitMessage": {
        "message": "Изборът ви ще бъде автоматично изпратен",
        "description": "Message shown at the bottom of autocomplete menu."
    },
    "lockDatabase": {
        "message": "Заключване на хранилището",
        "description": "Lock database button title text."
    }
}
