{
    "extensionDescription": {
        "message": "Integração ao KeePassXC para navegadores modernos",
        "description": "Name of the extension."
    },
    "addSitePreferenceButtonTitle": {
        "message": "Adicionar Preferências de Site para esta URL.",
        "description": "Add button title text on Site Preferences tab."
    },
    "allowIframeButtonTitle": {
        "message": "Permitir iframes de Origem Cruzada para a página atual.",
        "description": "Allow Cross-Origin iframes button title text."
    },
    "connectButtonTitle": {
        "message": "Conecte o banco de dados ativo atual ao KeePassXC-Browser.",
        "description": "Connect button title text."
    },
    "copyDebugInfoButtonTitle": {
        "message": "Copiar as informações de depuração para a área de transferência.",
        "description": "Copy debug info button title text on About tab."
    },
    "dismissHttpAuthButtonTitle": {
        "message": "Dispensar autenticação HTTP básica.",
        "description": "Dismiss HTTP Auth button title text."
    },
    "reconnectButtonTitle": {
        "message": "Reconectar o banco de dados ativo atual ao KeePassXC-Browser.",
        "description": "Reconnect button title text."
    },
    "redetectButtonTitle": {
        "message": "Detectar novamente todos os campos de entrada na página.",
        "description": "Redetect login fields button title text."
    },
    "reloadButtonTitle": {
        "message": "Recarregar a extensão e reconectar ao KeePassXC.",
        "description": "Reload button title text."
    },
    "removeConnectedDatabaseButtonTitle": {
        "message": "Remover o banco de dados conectado do KeePassXC-Browser.",
        "description": "Remove button title on Connected Databases tab."
    },
    "removeCustomLoginFieldsButtonTitle": {
        "message": "Remover os Campos de Login Personalizados desta URL.",
        "description": "Remove button title on Custom Login Fields tab."
    },
    "removeSitePreferencesButtonTitle": {
        "message": "Remover as Preferências do Site para esta URL.",
        "description": "Remove button title on Site Preferences tab."
    },
    "reopenDatabaseButtonTitle": {
        "message": "Reabrir o banco de dados ativo atual.",
        "description": "Reopen database button title text."
    },
    "usernameButtonTitle": {
        "message": "Adicionar Detecção Somente de Nome de Usuário à página atual.",
        "description": "Add Username-only detection button title text."
    },
    "contextMenuFillUsernameAndPassword": {
        "message": "Preencher usuário e senha",
        "description": "Context menu item for filling both username and password."
    },
    "contextMenuFillPassword": {
        "message": "Preencher apenas a senha",
        "description": "Context menu item for filling password."
    },
    "contextMenuFillTOTP": {
        "message": "Preencher o TOTP",
        "description": "Context menu item for filling Time-based One Time Password."
    },
    "contextMenuShowPasswordGeneratorIcons": {
        "message": "Mostrar os ícones do gerador de senhas",
        "description": "Show password generator icon on every password input field."
    },
    "contextMenuSaveCredentials": {
        "message": "Salvar Credenciais",
        "description": "Save credentials using the credential banner."
    },
    "contextMenuShowPasswordGenerator": {
        "message": "Exibir o gerador de senhas",
        "description": "Show password generator text."
    },
    "contextMenuFillAttribute": {
        "message": "Preencher Atributo…",
        "description": "Context menu parent item for filling a custom attribute."
    },
    "contextMenuRequestGlobalAutoType": {
        "message": "Solicite a digitação global automática",
        "description": "Global Auto-Type shortcut text."
    },
    "multipleCredentialsDetected": {
        "message": "Autenticação HTTP com várias credenciais detectadas. Clique no ícone da extensão para escolher o correto.",
        "description": "Notification when HTTP Authentication has multiple credentials detected."
    },
    "errorMessageUnknown": {
        "message": "Erro desconhecido.",
        "description": "Unknown error."
    },
    "errorMessageDatabaseNotOpened": {
        "message": "O banco de dados não está aberto.",
        "description": "Database not opened."
    },
    "errorMessageDatabaseHash": {
        "message": "Hash do banco de dados não recebido.",
        "description": "Database hash not received."
    },
    "errorMessageClientPublicKey": {
        "message": "A chave pública do cliente não foi recebida.",
        "description": "Client public key not received."
    },
    "errorMessageDecrypt": {
        "message": "Não é possível descriptografar a mensagem.",
        "description": "Cannot decrypt message."
    },
    "errorMessageTimeout": {
        "message": "Não foi possível conectar ao KeePassXC. Verifique se a integração do navegador está ativada nas configurações do KeePassXC.",
        "description": "Cannot connect to KeePassXC. Check that browser integration is enabled in KeePassXC settings."
    },
    "errorMessageCanceled": {
        "message": "A ação foi cancelada ou foi negada.",
        "description": "Action canceled or denied."
    },
    "errorMessageEncrypt": {
        "message": "A criptografia das mensagens falhou. O KeePassXC está em execução?",
        "description": "Message encryption failed. Is KeePassXC running?"
    },
    "errorMessageAssociate": {
        "message": "A associação ao KeePassXC falhou, tente novamente.",
        "description": "KeePassXC association failed, try again."
    },
    "errorMessageKeyExchange": {
        "message": "A troca de chaves não foi bem sucedida.",
        "description": "Key exchange was not successful."
    },
    "errorMessageEncryptionKey": {
        "message": "A chave de criptografia não foi reconhecida.",
        "description": "Encryption key is not recognized."
    },
    "errorMessageSavedDatabases": {
        "message": "Nenhum banco de dados salvo foi encontrado.",
        "description": "No saved databases found."
    },
    "errorMessageIncorrectAction": {
        "message": "Ação incorreta.",
        "description": "Incorrect action."
    },
    "errorMessageEmptyMessage": {
        "message": "Uma mensagem vazia foi recebida.",
        "description": "Empty message received."
    },
    "errorMessageNoURL": {
        "message": "Nenhuma URL foi fornecida.",
        "description": "No URL provided."
    },
    "errorMessageNoLogins": {
        "message": "Nenhum login foi encontrado.",
        "description": "No logins found."
    },
    "errorMessagePaswordLengthExceeded": {
        "message": "A senha preenchida é maior que o comprimento máximo permitido do campo.",
        "description": "Error notification text shown when filled password is longer than defined maxLength of the input field."
    },
    "errorMessageNoGroupsFound": {
        "message": "Nenhum grupo foi encontrado.",
        "description": "No groups found."
    },
    "errorMessageCannotCreateNewGroup": {
        "message": "Não é possível criar um novo grupo.",
        "description": "Cannot create new group."
    },
    "errorMessageNoValidUuidProvided": {
        "message": "Nenhum UUID válido foi fornecido.",
        "description": "No valid UUID provided."
    },
    "errorMessageAccessToAllEntriesDenied": {
        "message": "O acesso a todas as entradas foi negado.",
        "description": "Access to all entries denied."
    },
    "errorMessagePasskeysAttestationNotSupported": {
        "message": "Atestado não compatível.",
        "description": "Attestation not supported."
    },
    "errorMessagePasskeysCredentialIsExcluded": {
        "message": "A credencial está excluída.",
        "description": "Credential is excluded."
    },
    "errorMessagePasskeysRequestCanceled": {
        "message": "A solicitação de Passkeys foi cancelada.",
        "description": "Passkeys request canceled."
    },
    "errorMessagePasskeysInvalidUserVerification": {
        "message": "Verificação inválida do usuário.",
        "description": "Invalid user verification."
    },
    "errorMessagePasskeysEmptyPublicKey": {
        "message": "Chave pública vazia.",
        "description": "Empty public key."
    },
    "errorMessagePasskeysInvalidUrlProvided": {
        "message": "Uma URL inválida foi fornecida.",
        "description": "Invalid URL provided."
    },
    "errorMessagePasskeysOriginNotAllowed": {
        "message": "A origem está vazia ou não é permitida.",
        "description": "Origin is empty or not allowed."
    },
    "errorMessagePasskeysDomainNotValid": {
        "message": "O domínio efetivo não é um domínio válido.",
        "description": "Effective domain is not a valid domain."
    },
    "errorMessagePasskeysDomainRpIdMismatch": {
        "message": "A origem e o ID de RP não coincidem.",
        "description": "Origin and RP ID do not match."
    },
    "errorMessagePasskeysNoSupportedAlgorithms": {
        "message": "Nenhum algoritmo suportado foi fornecido.",
        "description": "No supported algorithms were provided."
    },
    "errorMessagePasskeysWaitforLifeTimer": {
        "message": "Aguarde o tempo expirar.",
        "description": "Wait for timer to expire."
    },
    "errorMessagePasskeysUnknownError": {
        "message": "Erro desconhecido da chave de acesso.",
        "description": "Unknown passkeys error."
    },
    "errorMessagePasskeysInvalidChallenge": {
        "message": "O desafio é menor que o comprimento mínimo exigido.",
        "description": "Challenge is shorter than required minimum length."
    },
    "errorMessagePasskeysInvalidUserId": {
        "message": "user.id não corresponde ao comprimento necessário.",
        "description": "user.id does not match the required length."
    },
    "errorMessagePasskeysContextIsNotSecure": {
        "message": "O contexto não é seguro.",
        "description": "Context is not secure."
    },
    "errorNotConnected": {
        "message": "Não está conectado ao KeePassXC.",
        "description": "Error notification shown when not connected to KeePassXC."
    },
    "errorCurrentDatabaseNotConnected": {
        "message": "O banco de dados atual não está conectado.",
        "description": "Error notification shown when current database is not connected during action."
    },
    "passwordGeneratorErrorTooLong": {
        "message": "Erro: A senha gerada é maior que o tamanho permitido!",
        "description": "A warning text shown in the password generator."
    },
    "passwordGeneratorErrorTooLongCut": {
        "message": "Ela foi cortada para se ajustar ao comprimento.",
        "description": "A warning text shown in the password generator."
    },
    "passwordGeneratorErrorTooLongRemember": {
        "message": "Lembre-se da nova senha!",
        "description": "A warning text shown in the password generator."
    },
    "passwordGeneratorGenerateText": {
        "message": "Gerar senha.",
        "description": "Password icon title text."
    },
    "passwordGeneratorNotSupported": {
        "message": "O lançamento do gerador de senha não é compatível com esta versão do KeePassXC. Atualize o KeePassXC para uma versão mais recente."
    },
    "usernameFieldText": {
        "message": "Preencher as credenciais do KeePassXC.",
        "description": "Username field icon hover text."
    },
    "usernameFieldTextNoCredentials": {
        "message": "Nenhuma credencial para preencher.",
        "description": "Username field icon hover text when no credentials are."
    },
    "usernameLockedFieldText": {
        "message": "O banco de dados está bloqueado.",
        "description": "Username field icon hover text when database is locked."
    },
    "usernameDisconnectedFieldText": {
        "message": "KeePassXC está desconectado.",
        "description": "Username field icon hover text when KeePassXC is disconnected."
    },
    "totp": {
        "message": "TOTP",
        "description": "TOTP text."
    },
    "totpFieldText": {
        "message": "Preencha o TOTP do KeePassXC",
        "description": "OTP field icon hover text."
    },
    "defineClose": {
        "message": "Fechar",
        "description": "Close button text when choosing Custom Login Fields."
    },
    "defineSkip": {
        "message": "Pular",
        "description": "Skip button text when choosing Custom Login Fields."
    },
    "defineMore": {
        "message": "Mostrar mais",
        "description": "More button text when choosing Custom Login Fields."
    },
    "defineReset": {
        "message": "Redefinir",
        "description": "Reset button text when choosing Custom Login Fields."
    },
    "defineConfirm": {
        "message": "Confirmar",
        "description": "Confirm button text when choosing Custom Login Fields."
    },
    "defineAlreadySelected": {
        "message": "Os campos de login para esta página já estão selecionados e serão sobrescritos.",
        "description": "A text shown when custom credentials fields are already set for the page."
    },
    "defineClearData": {
        "message": "Limpar os dados salvos",
        "description": "Clear save data button text when choosing Custom Login Fields."
    },
    "defineStringField": {
        "message": "Campo para texto",
        "description": "Text for string field."
    },
    "defineChooseUsername": {
        "message": "Escolha um campo para o nome de usuário",
        "description": "Choosing a username field text when choosing Custom Login Fields."
    },
    "defineChoosePassword": {
        "message": "Escolha um campo para a senha",
        "description": "Choosing a password field text when choosing Custom Login Fields."
    },
    "defineChooseTOTP": {
        "message": "Escolha um campo para o TOTP",
        "description": "Choosing a TOTP field text when choosing Custom Login Fields."
    },
    "defineChooseStringFields": {
        "message": "Escolha os campos para texto",
        "description": "Choose String Fields a selection text when choosing Custom Login Fields."
    },
    "defineHelpText": {
        "message": "Confirme a sua seleção ou escolha mais campos como texto.",
        "description": "Confirm a selection text when choosing Custom Login Fields which contains string fields."
    },
    "defineKeyboardText": {
        "message": "Você também pode usar os números para escolher os campos de entrada do teclado.",
        "description": "Help text when choosing Custom Login Fields."
    },
    "defineChooseCustomLoginFieldText": {
        "message": "Escolha um campo personalizado de login",
        "description": "Help text for Custom Login Field banner."
    },
    "username": {
        "message": "Usuário",
        "description": "General text for username."
    },
    "password": {
        "message": "Senha",
        "description": "General text for password."
    },
    "stringFields": {
        "message": "Campos para texto",
        "description": "General text for a String Fields."
    },
    "credentialsNoUsername": {
        "message": "- sem usuário -",
        "description": "Shown when no username is set in the credentials."
    },
    "credentialsNoLoginsFound": {
        "message": "Nenhum login foi encontrado.",
        "description": "Shown when no credentials are found for the current page."
    },
    "credentialsMultipleFound": {
        "message": "Mais de um login foi encontrado no KeePassXC!",
        "description": "Alert message when trying to fill username and/or password when multiple credentials are found."
    },
    "credentialsMultipleFoundSecondLine": {
        "message": "Clique no ícone KeePassXC-Browser para mais opções.",
        "description": "Alert message when trying to fill username and/or password when multiple credentials are found."
    },
    "credentialsNoUsernameFound": {
        "message": "Nenhuma credencial foi encontrada para o nome de usuário.",
        "description": "Alert message when no credentials are found for the given username."
    },
    "credentialsNoTOTPFound": {
        "message": "Nenhum TOTP foi encontrado.",
        "description": "Alert message when no TOTP is found."
    },
    "credentialExpired": {
        "message": "Expirado",
        "description": "If a credential is expired, this is appended to the title label."
    },
    "fieldsFill": {
        "message": "Erro: Não foi possível encontrar campos para preencher.",
        "description": "Alert message when no fields are found to fill in."
    },
    "fieldsNoPasswordField": {
        "message": "Erro: Não foi possível encontrar um campo para a senha.",
        "description": "Message shown when no password fields are found."
    },
    "fieldsPasswordFillNotAccepted": {
        "message": "O preenchimento de senha em um campo de texto simples é evitado.",
        "description": "Message shown when password fill to a plain text field is prevented."
    },
    "rememberNothingChanged": {
        "message": "Erro: Não foi possível detectar as credenciais alteradas.",
        "description": "Message shown when trying to save credentials that haven't changed."
    },
    "popupTitle": {
        "message": "KeePassXC - Popup",
        "description": "Popup window title."
    },
    "popupSettingsText": {
        "message": "Configurações",
        "description": "Popup Settings button text."
    },
    "popupChooseCredentialsText": {
        "message": "Escolher Campos de Login Personalizados",
        "description": "Popup credential choosing button text."
    },
    "popupConnectButton": {
        "message": "Conectar",
        "description": "Popup Connect button text."
    },
    "popupReconnectButton": {
        "message": "Reconectar",
        "description": "Popup Reconnect button text."
    },
    "popupRedetectButton": {
        "message": "Redetectar os campos de login",
        "description": "Popup Redetect login fields button text."
    },
    "popupReloadButton": {
        "message": "Recarregar",
        "description": "Popup Reload button text."
    },
    "popupReopenButton": {
        "message": "Reabrir banco de dados",
        "description": "Popup reopen database button text."
    },
    "popupUsernameButton": {
        "message": "Adicionar a opção apenas usuário para o site",
        "description": "Button text for adding Username-only option."
    },
    "popupAllowIframeButton": {
        "message": "Permitir Iframes de Origem Cruzada para o site",
        "description": "Button text for allowing Cross-Origin iframes option."
    },
    "popupErrorEncountered": {
        "message": "O KeePassXC-Browser encontrou um erro:",
        "description": "A text shown above error message in the popup."
    },
    "popupUpdateAvailable": {
        "message": "Você está usando uma versão antiga do KeePassXC.",
        "description": "Popup warning message about old version of KeePassXC."
    },
    "popupDownloadNewVersion": {
        "message": "Faça o download de uma versão mais atualizada em keepassxc.org",
        "description": "Popup warning message link when KeePassXC version is not up-to-date."
    },
    "popupGettingStartedText": {
        "message": "É a sua primeira vez aqui? Consulte o nosso guia de introdução.",
        "description": "Popup information message about Getting Started Guide."
    },
    "popupGettingStartedLinkText": {
        "message": "Guia de introdução - Configuração da integração com o navegador",
        "description": "Popup Getting Started Guide link text."
    },
    "popupAlertHide": {
        "message": "Ocultar e não mostrar novamente.",
        "description": "Hide alert close button title."
    },
    "popupTroubleshootingText": {
        "message": "Não foi possível conectar ao KeePassXC? Talvez nossa página na wiki possa ajudar.",
        "description": "Popup information message about Troubleshooting Guide."
    },
    "popupTroubleshootingLinkText": {
        "message": "Guia de solução de problemas",
        "description": "Popup Troubleshooting Guide link text."
    },
    "popupCheckingStatus": {
        "message": "Verificando a condição...",
        "description": "Checking status message in popup."
    },
    "popupNotConfigured": {
        "message": "KeePassXC-Browser não foi configurado. Clique no botão conectar para emparelhar com KeePassXC.",
        "description": "A popup message shown when the extension has not been connected to KeePassXC."
    },
    "popupNeedReconfigure": {
        "message": "O KeePassXC-Browser foi desconectado do KeePassXC.",
        "description": "A popup message shown when the extension has been disconnected from KeePassXC."
    },
    "popupNeedReconfigureMessage": {
        "message": "Clique no botão reconectar para estabelecer uma nova conexão.",
        "description": "A popup message shown when reconnect is needed."
    },
    "popupConfiguredNotAssociated": {
        "message": "O KeePassXC-Browser ainda não se conectou ao KeePassXC, mas foi configurado usando o identificador: $1",
        "description": "A popup message shown when KeePassXC is not connected but configured."
    },
    "popupConfiguredAndAssociated": {
        "message": "O KeePassXC-Browser está conectado ao KeePassXC e foi configurado usando o seguinte identificador: $1",
        "description": "A popup message when a connection to KeePassXC is successful."
    },
    "popupUsernameFieldDetected": {
        "message": "Apenas um único campo de nome de usuário foi detectado. Adicione o URL para Preferências do site com opção de Só-Usuário habilitado?",
        "description": "Text shown when page can be added to Site Preferences with Username-only option enabled."
    },
    "popupIframeDetected": {
        "message": "Um iframe de origem cruzada foi detectado. Adicionar o URL às preferências do site com a opção Permitir Iframes de Origem Cruzada ativada?",
        "description": "Text shown when page can be added to Site Preferences with Allow Cross-Origin iframes option enabled."
    },
    "rememberInfoText": {
        "message": "O usuário ou a senha foi alterada! Salvar?",
        "description": "Message when username or password has changed."
    },
    "rememberSaving": {
        "message": "As credenciais serão salvas no banco de dados conectado com identificador $1",
        "description": "A message when saving or updating credentials."
    },
    "rememberNewUsername": {
        "message": "O seguinte usuário atualmente não foi salvo: $1",
        "description": "A message shown when a new username is detected when saving credentials."
    },
    "rememberUsernameExists": {
        "message": "As credenciais com o nome de usuário usado estão marcados em negrito: $1",
        "description": "A message shown when an existing username is detected when saving credentials."
    },
    "rememberChooseCredentials": {
        "message": "Escolha as credenciais que você deseja atualizar.",
        "description": "A message shown choosing what credentials user wants to update."
    },
    "rememberChooseGroup": {
        "message": "Escolha um grupo para armazenar novas credenciais.",
        "description": "A message shown choosing what group user wants to use for new credentials."
    },
    "rememberInfoDefaultGroupNotFound": {
        "message": "O grupo padrão foi criado no banco de dados.",
        "description": "Info message shown when default group set cannot be found."
    },
    "rememberErrorCreatingNewGroup": {
        "message": "Novo(s) grupo(s) não podem ser criado(s).",
        "description": "Error message shown when new groups cannot be created."
    },
    "rememberErrorPasswordNotChanged": {
        "message": "As credenciais não foram atualizadas. A senha não foi alterada.",
        "description": "Error message shown when credential password is not changed."
    },
    "rememberErrorCannotSaveCredentials": {
        "message": "As credenciais não podem ser salvas ou atualizadas.",
        "description": "Error message shown when credentials cannot be saved or updated."
    },
    "rememberErrorDatabaseClosed": {
        "message": "As credenciais não podem ser salvas ou atualizadas para um banco de dados fechado.",
        "description": "Error message shown when credentials cannot be saved or updated and the database is closed."
    },
    "rememberCredentialsNotSaved": {
        "message": "Operação cancelada. As credenciais não foram atualizadas.",
        "description": "Message shown when saving operation was cancelled."
    },
    "rememberCredentialsSaved": {
        "message": "As novas credenciais com o nome de usuário $1 foram salvas.",
        "description": "Message shown when new credentials are saved."
    },
    "rememberCredentialsUpdated": {
        "message": "As credenciais com nome de usuário $1 foi atualizado.",
        "description": "Message shown when new credentials are successfully updated."
    },
    "rememberCredentialsExists": {
        "message": "Estas credenciais já existem. Nada para atualizar.",
        "description": "Message shown when new credentials already found in database."
    },
    "rememberEmptyUsername": {
        "message": "(vazio)",
        "description": "Means an empty username."
    },
    "rememberNoPassword": {
        "message": "Preencha o campo de senha antes de salvar as credenciais.",
        "description": "Message shown when no password is set when saving credentials."
    },
    "popupLoginText": {
        "message": "Selecione as informações de login que você gostaria de inserir na página.",
        "description": "A popup message shown when one or multiple credentials are present."
    },
    "popupFilterText": {
        "message": "Filtro:",
        "description": "Text for login credentials quick filter."
    },
    "popupAuthText": {
        "message": "Selecione as informações de login que deseja usar para se conectar.",
        "description": "A popup message shown when doing HTTP Authentication with multiple credentials present."
    },
    "popupMultiplePasswordFields": {
        "message": "Mais de um campo de senha foi detectado nesta página. Clique com o botão direito do mouse em um dos campos de senha e escolha um dos seguintes:",
        "description": "A popup message shown when web page has multiple password fields."
    },
    "popupUsername": {
        "message": "Nome de Usuário:",
        "description": "A username field name shown on credential update."
    },
    "popupButtonNew": {
        "message": "Nova",
        "description": "New button text in popup when updating credentials."
    },
    "popupButtonUpdate": {
        "message": "Atualizar",
        "description": "Update button text in popup when updating credentials."
    },
    "popupButtonCancel": {
        "message": "Cancelar",
        "description": "Cancel button text in popup when updating credentials."
    },
    "popupButtonBack": {
        "message": "Voltar",
        "description": "Back button text in popup when updating credentials."
    },
    "popupButtonIgnore": {
        "message": "Nunca pergunte nesta página",
        "description": "Ignore button text in popup or in notification when updating credentials."
    },
    "popupButtonClose": {
        "message": "Fechar",
        "description": "Close button text in popup or in notification."
    },
    "popupButtonDismissHttpAuth": {
        "message": "Dispensar e mostrar a caixa de diálogo de autenticação padrão",
        "description": "Dismiss button text when in HTTP Authentication popup."
    },
    "optionsTitle": {
        "message": "Configurações | KeePassXC-Browser",
        "description": "Options page title."
    },
    "optionsGeneralSettingsTab": {
        "message": "Configurações gerais",
        "description": "General Settings tab text."
    },
    "optionsConnectedDatabasesTab": {
        "message": "Bancos de dados conectados",
        "description": "Connected Databases tab text."
    },
    "optionsCustomFieldsTab": {
        "message": "Campos de Login Personalizados",
        "description": "Saved Custom Login Fields tab text."
    },
    "optionsSitePreferencesTab": {
        "message": "Preferências do Site",
        "description": "Site Preferences fields tab text."
    },
    "optionsAboutTab": {
        "message": "Sobre",
        "description": "About tab text."
    },
    "optionsMenuGeneral": {
        "message": "Geral",
        "description": "General settings page header."
    },
    "optionsMenuConnectedDatabases": {
        "message": "Bancos de dados conectados",
        "description": "Connected Databases page header."
    },
    "optionsMenuCustomFields": {
        "message": "Campos de Login Personalizados",
        "description": "Custom Login Fields page header."
    },
    "optionsMenuSitePreferences": {
        "message": "Preferências do Site",
        "description": "Site Preferences page header."
    },
    "optionsMenuAbout": {
        "message": "Sobre",
        "description": "About page header."
    },
    "optionsConfigureShortcuts": {
        "message": "Configurar os atalhos",
        "description": "Keyboard shortcut button and title text."
    },
    "optionsButtonSave": {
        "message": "Salvar",
        "description": "Save button text."
    },
    "optionsButtonConnect": {
        "message": "Conectar",
        "description": "Connect button text."
    },
    "optionsButtonRemove": {
        "message": "Remover",
        "description": "Remove button text."
    },
    "optionsButtonAdd": {
        "message": "Adicionar",
        "description": "Add button text."
    },
    "optionsButtonUpdate": {
        "message": "Verificar se há atualizações",
        "description": "Check for updates button text."
    },
    "optionsButtonRemoveNow": {
        "message": "Sim, remover agora",
        "description": "Confirm button text when removing database key or Custom Login Fields."
    },
    "optionsButtonCancel": {
        "message": "Cancelar",
        "description": "Cancel button text when removing database key or Custom Login Fields."
    },
    "optionsButtonReset": {
        "message": "Restaurar",
        "description": "Reset button text for keyboard shortcuts."
    },
    "optionsButtonImport": {
        "message": "Importar as configurações",
        "description": "Import settings button text."
    },
    "optionsButtonExport": {
        "message": "Exportar as configurações",
        "description": "Export settings button text."
    },
    "optionsLabelDefaultGroup": {
        "message": "Grupo padrão para salvar novas senhas:",
        "description": "Default group options text."
    },
    "optionsDefaultGroupHelpText": {
        "message": "Separe o grupo com barras, por exemplo: Grupo/SubGrupo.",
        "description": "Default group help text."
    },
    "optionsLabelDefaultPasskeyGroup": {
        "message": "Grupo padrão para salvar novas chaves de acesso:",
        "description": "Default passkey group options text."
    },
    "optionsLabelDefaultGroupCheckboxText": {
        "message": "Sempre pergunte onde salvar as novas credenciais",
        "description": "Default group checkbox help text."
    },
    "optionsLabelDefaultGroupCheckboxHelpText": {
        "message": "Quando ativado, um balão mostra uma lista de grupos.",
        "description": "Default checkbox explanation help text."
    },
    "optionsCheckboxUsePasswordGenerator": {
        "message": "Ativar ícones do gerador de senha",
        "description": "Activate password generator icons checkbox text."
    },
    "optionsCheckboxUsernameIcons": {
        "message": "Ativar ícones de campo de nome de usuário",
        "description": "Activate username field icons textbox text."
    },
    "optionsUseObserver": {
        "message": "Usar detecção dinâmica de campo de entrada",
        "description": "Use dynamic input field detection checkbox text."
    },
    "optionsUseObserverHelpText": {
        "message": "Útil para páginas que usam popups ou diálogos dinâmicos. Desative o recurso para desativar uso de CPU em máquinas mais modestas. Quando desativado, as credenciais somente podem ser inseridas usando atalhos do teclado, o menu de contexto ou o popup da extensão.",
        "description": "Use dynamic input field detection help text."
    },
    "optionsCheckboxOTPIcons": {
        "message": "Ativar ícones de campo 2FA/OTP",
        "description": "Activate OTP field icons textbox text."
    },
    "optionsCheckboxAutoRetrieveCredentials": {
        "message": "Recuperar credenciais automaticamente",
        "description": "Automatically retrieve credentials checkbox text."
    },
    "optionsCheckboxAutomaticReconnect": {
        "message": "Reconectar automaticamente ao KeePassXC",
        "description": "Auto-reconnect checkbox text."
    },
    "optionsAutomaticReconnectWarning": {
        "message": "Aviso! Este recurso é experimental. Use por sua conta e risco.",
        "description": "Auto-reconnect warning message."
    },
    "optionsCheckboxAutoFillSingleEntry": {
        "message": "Preencher automaticamente entradas de credencial única",
        "description": "Automatically fill-in single credential entry checkbox text."
    },
    "optionsCheckboxAutoFillRelevantCredential": {
        "message": "Automatically fill in relevant credential entries",
        "description": "Automatically fill-in relevant credential entry checkbox text."
    },
    "optionsCheckboxAutoFillSingleTotp": {
        "message": "Preencher automaticamente entradas TOTP únicas",
        "description": "Automatically fill-in single TOTP entries checkbox text."
    },
    "optionsCheckboxAutoCompleteUsernames": {
        "message": "Ative o preenchimento automático para campos de nome de usuário",
        "description": "Activate autocomplete for username fields checkbox text."
    },
    "optionsCheckboxShowGroupNameInAutocomplete": {
        "message": "Exibir o nome do grupo na lista de preenchimento automático quando as credenciais forem de grupos diferentes",
        "description": "Show group name in autocomplete checkbox text."
    },
    "optionsCheckboxAutoSubmit": {
        "message": "Preencher automaticamente os formulários de autenticação",
        "description": "Auto-submit checkbox text."
    },
    "optionsAutoSubmitHelpText": {
        "message": "Preenche automaticamente as credenciais selecionadas. Isso está desativado para o preenchimento automático com entrada única.",
        "description": "Auto-submit help text."
    },
    "optionsCheckboxShowNotifications": {
        "message": "Mostrar notificações",
        "description": "Show notifications checkbox text."
    },
    "optionsCheckboxUseMonochromeToolbarIcon": {
        "message": "Usar ícone monocromático da barra de ferramentas",
        "description": "Use monochrome toolbar icon checkbox text."
    },
    "optionsCheckboxUseCompactMode": {
        "message": "Usar modo compacto",
        "description": "Whether the compact mode (legacy dropdown) should be enabled."
    },
    "optionsSaveDomainOnly": {
        "message": "Salvar apenas domínio",
        "description": "Save domain only checkbox text."
    },
    "optionsCheckboxShowLoginNotifications": {
        "message": "Mostrar um banner na página quando novas credenciais puderem ser salvas no banco de dados",
        "description": "Show login notifications checkbox text."
    },
    "optionsRedirectAllowance": {
        "message": "Quantidade de redirecionamentos permitidos:  $1",
        "description": "Redirect allowance range input text."
    },
    "optionsRedirectAllowanceHelpText": {
        "message": "Quantos redirecionamentos são permitidos até que o aviso desapareça. O valor padrão é 3. O máximo é infinito.",
        "description": "Redirect allowance help text."
    },
    "optionsCheckboxAutoFillAndSend": {
        "message": "Permitir o preenchimento de credenciais de Autenticação Básica HTTP",
        "description": "Allow filling HTTP Basic Auth credentials checkbox text."
    },
    "optionsDebugLogging": {
        "message": "Registro de depuração",
        "description": "Debug logging checkbox text."
    },
    "optionsDebugLoggingHelpText": {
        "message": "Ative o registro de depuração. Os scripts de conteúdo e de segundo plano serão visíveis nas mensagens adicionais do console.",
        "description": "Debug logging help text."
    },
    "optionsRadioText": {
        "message": "Verificar as atualizações do KeePassXC:",
        "description": "Text above radio buttons in the settings page."
    },
    "optionsRadioThreeDays": {
        "message": "a cada três dias",
        "description": "Radio button text."
    },
    "optionsRadioWeek": {
        "message": "toda semana",
        "description": "Radio button text."
    },
    "optionsRadioMonth": {
        "message": "todo mês",
        "description": "Radio button text."
    },
    "optionsRadioNever": {
        "message": "nunca",
        "description": "Radio button text."
    },
    "optionsThemeSelectionHeader": {
        "message": "Cores do tema",
        "description": "Theme selection header text."
    },
    "optionsCredentialSortSelectionHeader": {
        "message": "Classificar as credenciais correspondentes por",
        "description": "Credential sort option header text."
    },
    "optionsThemeSelection": {
        "message": "Selecionar as cores do tema",
        "description": "Theme selection title text."
    },
    "optionsThemeSystem": {
        "message": "Sistema",
        "description": "System theme text."
    },
    "optionsThemeDark": {
        "message": "Escuro",
        "description": "Dark theme text."
    },
    "optionsThemeLight": {
        "message": "Claro",
        "description": "Light theme text."
    },
    "optionsKeyboardShortcutsHeader": {
        "message": "Atalhos do teclado",
        "description": "Keyboard shortcut header text."
    },
    "optionsUsePasswordGeneratorHelpText": {
        "message": "Adiciona um botão aos campos de senha para gerar uma nova senha.",
        "description": "Password Generator option help text."
    },
    "optionsUsePasswordGeneratorHelpTextSecond": {
        "message": "As senhas são geradas pelo KeePassXC usando o seu perfil de geração de senha.",
        "description": "Password Generator option help text, second part."
    },
    "optionsPredefinedSiteList": {
        "message": "Sites predefinidos",
        "description": "Predefined site list details button text."
    },
    "optionsUsePredefinedSites": {
        "message": "Usar sites predefinidos para compatibilidade",
        "description": "Use predefined sites checkbox text."
    },
    "optionsUsePredefinedSitesHelpText": {
        "message": "Adiciona sites comuns que possuem formulários de login somente com nome de usuário às Preferências do Site.",
        "description": "Use predefined sites option help text."
    },
    "optionsShowLoginFormIconHelpText": {
        "message": "Adicionar ícones para os campos de nome de usuário para o preenchimento de credenciais com um único clique do mouse.",
        "description": "Username field icon option help text."
    },
    "optionsShowOTPIconHelpText": {
        "message": "Adicionar um ícone para campos de entrada que são reconhecidos como OTP/2FA.",
        "description": "OTP field icon option help text."
    },
    "optionsAutoRetrieveCredentialsHelpText": {
        "message": "O KeePassXC-Browser recuperará as credenciais imediatamente quando uma aba for ativada.",
        "description": "Auto-Retrive Credentials option help text."
    },
    "optionsAutomaticReconnectHelpText": {
        "message": "Reconecta-se automaticamente ao KeePassXC quando é detectado.",
        "description": "Auto-reconnect option help text."
    },
    "optionsAutoFillSingleEntryHelpText": {
        "message": "Deixe o KeePassXC-Browser preencher automaticamente as credenciais se receber apenas uma única entrada.",
        "description": "Auto-Fill Single Entry option help text."
    },
    "optionsAutoFillRelevantCredentialHelpText": {
        "message": "Automatically fill in the relevant credential if a second fill is needed.",
        "description": "Auto-Fill Relevant Credential option help text."
    },
    "optionsAutoFillSingleEntryWarning": {
        "message": "Aviso! Usando preenchimento automático não é seguro. Uso por sua própria conta e risco. KeePassXC-Browser automaticamente tentará detectar os campos de login. De qualquer forma, eles podem ser detectados incorretamente, possibilitando preenchimento de dados sensíveis em campos de entrada não seguros.",
        "description": "Auto-Fill Single Entry warning text."
    },
    "optionsAutoFillSingleTotpHelpText": {
        "message": "Deixe o KeePassXC-Browser preencher automaticamente os campos TOTP se receber apenas uma única entrada.",
        "description": "Auto-Fill Single TOTP field option help text."
    },
    "optionsAutocompleteUsernamesHelpText": {
        "message": "Mostrar uma lista suspensa contendo as credenciais disponíveis para todos os campos de nome de usuário em uma página.",
        "description": "Autocomplete Usernames option help text."
    },
    "optionsShowGroupNameInAutocompleteHelpText": {
        "message": "Quando as credenciais forem retornadas de grupos diferentes, o nome do grupo será mostrado. Afeta apenas o modo compacto.",
        "description": "Show group name in autocomplete help text."
    },
    "optionsShowNotificationsHelpText": {
        "message": "Mostrar as notificações de erros e quando a interação do usuário for necessária.",
        "description": "Show notifications option help text."
    },
    "optionsUseMonochromeToolbarIconHelpText": {
        "message": "Use um ícone monocromático com emblemas coloridos na barra de ferramentas que se adapta ao tema claro/escuro do navegador.",
        "description": "Use monochrome toolbar icon option help text."
    },
    "optionsUseCompactModeHelpText": {
        "message": "Usar uma versão compacta da lista suspensa para selecionar credenciais.",
        "description": "Use compact (legacy) mode help text."
    },
    "optionsSaveDomainOnlyHelpText": {
        "message": "Ao salvar novas credenciais, salve apenas o domínio em vez da URL completa.",
        "description": "Save domain only option help text."
    },
    "optionsSaveDomainOnlyCustomLoginHelpText": {
        "message": "Ao salvar novos Campos de Login Personalizados, salve apenas o domínio em vez do URL completa.",
        "description": "Save domain only option help text."
    },
    "optionsDownloadFaviconAfterSave": {
        "message": "Baixar favicon após salvar",
        "description": "Download favicon after save checkbox label text."
    },
    "optionsDownloadFaviconAfterSaveHelpText": {
        "message": "O Favicon será baixado automaticamente para a nova credencial.",
        "description": "Download favicon after save help text."
    },
    "optionsAutoFillAndSendHelpText": {
        "message": "Se forem encontradas credenciais para uma página e o tipo de autenticação for uma solicitação HTTP Basic Auth, o KeePassXC-Browser tentará fazer a autenticação automaticamente com as primeiras credenciais fornecidas. Quando várias credenciais estão presentes, o pop-up da extensão pode ser usado para escolher a correta. Mesmo quando esse recurso está ativado, ainda é possível inserir manualmente a autenticação HTTP Basic Auth.",
        "description": "Auto-Fill And Send option help text."
    },
    "optionsAutoFillAndSendHelpTextSecond": {
        "message": "Uma caixa de diálogo de autenticação básica HTTP é assim:",
        "description": "HTTP Basic Auth image help text."
    },
    "optionsClearCredentialsTimeout": {
        "message": "Limpar as credenciais das abas não ativas após (segundos, 0-3600).",
        "description": "Clear credentials label text."
    },
    "optionsClearCredentialsTimeoutHelpText": {
        "message": "As credenciais são apagadas das abas em segundo plano após o tempo limite e as permissões para essas páginas serão solicitadas novamente.",
        "description": "Clear credentials timeout help text."
    },
    "optionsVersionInfoText": {
        "message": "O KeePassXC-Browser precisa do KeePassXC para buscar as credenciais.",
        "description": "Settings page version info text."
    },
    "optionsVersionDownload": {
        "message": "Você pode baixar a última versão estável em $1",
        "description": "Settings page download link."
    },
    "optionsVersionRunning": {
        "message": "Você está executando o KeePassXC versão: $1",
        "description": "Settings page info text of user's KeePassXC version."
    },
    "optionsLatestVersion": {
        "message": "A última versão disponível do KeePassXC: $1",
        "description": "Settings page info text about the latest KeePassXC version."
    },
    "optionsKeePassXCVersionRequired": {
        "message": "Precisa da versão do KeePassXC: $1",
        "description": "KeePassXC version requirement text."
    },
    "optionsDefault": {
        "message": "Padrão: $1",
        "description": "Default setting text."
    },
    "optionsInfinite": {
        "message": "Infinito: $1",
        "description": "Infinite setting text."
    },
    "optionsRecommended": {
        "message": "Recomendado: $1",
        "description": "Recommended setting text."
    },
    "optionsShortcutsSuccess": {
        "message": "O atalho para $1 foi alterado com sucesso.",
        "description": "Message for successful keyboard shortcut change."
    },
    "optionsShortcutsInfo": {
        "message": "O atalho para $1 foi restaurado.",
        "description": "Info message for changing keyboard shortcuts."
    },
    "optionsShortcutsDanger": {
        "message": "Erro: O atalho para $1 não foi alterado!",
        "description": "Error message for changing keyboard shortcuts."
    },
    "optionsImportExportSettings": {
        "message": "Importar/Exportar as configurações",
        "description": "Settings page header text for import/export."
    },
    "optionsImportSettingsDialogTitle": {
        "message": "Importar as configurações de um arquivo externo?",
        "description": "Import settings confirmation dialog title text."
    },
    "optionsImportSettingsDialogText": {
        "message": "As configurações atuais serão substituídas. Deseja realmente importar o arquivo de configuração?",
        "description": "Import settings confirmation dialog help text."
    },
    "optionsConnectedDatabasesText": {
        "message": "Os seguintes bancos de dados do KeePassXC estão conectados ao KeePassXC-Browser.",
        "description": "Info text about connected databases."
    },
    "optionsConnectedDatabasesNotFound": {
        "message": "Nenhum banco de dados conectado foi encontrado.",
        "description": "Shown in the connected databases table when there is no connected databases."
    },
    "optionsDatabasesRemoveIdentifier": {
        "message": "Remover o identificador da lista de banco de dados?",
        "description": "Confirmation text when removing database from the list."
    },
    "optionsDatabasesRemoveIdentifierConfirmFirst": {
        "message": "Você realmente deseja remover o seguinte identificador da lista do banco de dados: $1?",
        "description": "Confirmation text when removing database from the list."
    },
    "optionsDatabasesRemoveIdentifierConfirmSecond": {
        "message": "Você pode reconectar seu banco de dados a qualquer momento.",
        "description": "Confirmation text when removing database from the list, second part."
    },
    "optionsDatabaseIdentifier": {
        "message": "Identificador",
        "description": "Database list column title."
    },
    "optionsDatabaseKey": {
        "message": "Chave",
        "description": "Database list column title."
    },
    "optionsDatabaseLastUsed": {
        "message": "Último uso",
        "description": "Database list column title."
    },
    "optionsDatabaseCreated": {
        "message": "Criado",
        "description": "Database list column title."
    },
    "optionsDatabaseDelete": {
        "message": "Excluir",
        "description": "Database list column title."
    },
    "optionsColumnPageURL": {
        "message": "URL da página",
        "description": "Site Preferences list column title."
    },
    "optionsColumnIgnore": {
        "message": "Ignorar",
        "description": "Site Preferences list column title."
    },
    "optionsColumnUsernameOnly": {
        "message": "Detecção do nome de usuário apenas",
        "description": "Site Preferences list column title."
    },
    "optionsColumnImprovedInputFieldDetection": {
        "message": "Detecção do campo aprimorado de entrada",
        "description": "Improved Input Field Detection column text."
    },
    "optionsColumnAllowIframes": {
        "message": "Permitir Iframes de Origem Cruzada",
        "description": "Allow iframes column text."
    },
    "optionsColumnDelete": {
        "message": "Excluir",
        "description": "Site Preferences list column title."
    },
    "optionsSelectionNothing": {
        "message": "Ativar todas as funcionalidades",
        "description": "Site Preferences option selection."
    },
    "optionsSelectionNormal": {
        "message": "Desativar credenciais novas/modificadas",
        "description": "Site Preferences option selection."
    },
    "optionsSelectionAutoSubmit": {
        "message": "Desativar o envio automático",
        "description": "Site Preferences option selection."
    },
    "optionsSelectionFull": {
        "message": "Desativar todos os recursos",
        "description": "Site Preferences option selection."
    },
    "optionsSortByTitle": {
        "message": "Tìtulo",
        "description": "Sort matching credentials by title option selection."
    },
    "optionsSortByUsername": {
        "message": "Usuário",
        "description": "Sort matching credentials by username option selection."
    },
    "optionsSortByGroupAndTitle": {
        "message": "Grupo e título",
        "description": "Sort matching credentials by group and title option selection."
    },
    "optionsSortByGroupAndUsername": {
        "message": "Grupo e usuário",
        "description": "Sort matching credentials by group and username option selection."
    },
    "optionsFillSortPriority": {
        "message": "Ordenar as credenciais após o preenchimento por",
        "description": ""
    },
    "optionsFillSortPriorityHelpText": {
        "message": "Quando a opção credencial relevante primeiro é selecionada, a credencial de autenticação preenchido anteriormente é definida como a primeira na listagem do menu de preenchimento automático.",
        "description": "Help text for Sort credentials after fill."
    },
    "optionsFillSortPriorityTotp": {
        "message": "Ordenar as credencias após o preenchimento para TOTP por",
        "description": ""
    },
    "optionsFillSortPriorityTotpHelpText": {
        "message": "Quando a opção credencial relevante primeiro é selecionada, o TOTP preenchido anteriormente é definido como a primeira na listagem do menu de preenchimento automático.",
        "description": "Help text for Sort credentials after fill for TOTP."
    },
    "optionsFillSortByMatchingCredentials": {
        "message": "Configuração de correspondência das credenciais",
        "description": "Default option for Sort after fill. Respects the Matching Credentials sorting setting."
    },
    "optionsFillSortByRelevantEntry": {
        "message": "Credencial relevante primeiro",
        "description": "Relevant credential first option for Sort after fill."
    },
    "optionsCustomFieldsNotFound": {
        "message": "Nenhum Campo de Login Personalizado salvo encontrado.",
        "description": "Shown when no saved custom credentials are saved."
    },
    "optionsCustomFieldsTableCaption": {
        "message": "Você pode gerenciar Campos de Login Personalizados salvos usando a tabela.",
        "description": "Table caption of Custom Login Fields page."
    },
    "optionsCustomFieldsTabHelpTextFirst": {
        "message": "Se o KeePassXC-Browser detectar campos errados de autenticação, você mesmo poderá especificar os campos corretos.",
        "description": "Saved Custom Login Fields info text, first part."
    },
    "optionsCustomFieldsTabHelpTextSecond": {
        "message": "Vá até a página, clique no ícone do KeePassXC-Browser e selecione",
        "description": "Saved Custom Login Fields info text, second part."
    },
    "optionsCustomFieldsTabHelpTextThird": {
        "message": "Nesta página você pode gerenciar Campos de Login Personalizados salvos.",
        "description": "Saved Custom Login Fields info text, third part."
    },
    "optionsCustomFieldsRemove": {
        "message": "Remover Campos de Login Personalizados salvos?",
        "description": "Confirmation text when removing saved Custom Login Fields."
    },
    "optionsCustomFieldsConfirmation": {
        "message": "Você realmente deseja remover os Campos de Login Personalizados salvos na página: $1",
        "description": "Confirmation text when removing saved Custom Login Fields."
    },
    "optionsCustomFieldsConfirmationHelpText": {
        "message": "O KeePassXC-Browser detectará automaticamente os campos de autenticação na próxima vez que você visitar esta página.",
        "description": "Part of confirmation text when removing saved Custom Login Fields."
    },
    "optionsSitePreferencesNotFound": {
        "message": "Nenhuma Preferência de Site encontrada.",
        "description": "Shown when no Site Preferences are saved."
    },
    "optionsSitePreferencesRemove": {
        "message": "Remover o site?",
        "description": "Confirmation text when removing ignored sites from the list."
    },
    "optionsSitePreferencesTabHelpTextFirst": {
        "message": "Sites nesta página têm métodos especiais de manipulação associados a eles.",
        "description": "Site Preferences info text, first part."
    },
    "optionsSitePreferencesTabHelpTextSecond": {
        "message": "Para ignorar credenciais novas/modificadas em um site específico, adicione-as abaixo ou clique no ícone do KeePassXC-Browser piscando e selecione",
        "description": "Site Preferences info text, second part."
    },
    "optionsSitePreferencesTabHelpTextThird": {
        "message": "Se um site for totalmente ignorado (<em>Desativar todos os recursos</em> for selecionado), o plug-in não fará nada ao visitar esse site.",
        "description": "Site Preferences info text, third part."
    },
    "optionsSitePreferencesTabHelpTextFourth": {
        "message": "A detecção somente de nome de usuário permite que o KeePassXC-Browser preencha os detalhes de login em sites com páginas separadas para nome de usuário e senha.",
        "description": "Site Preferences info text, fourth part."
    },
    "optionsSitePreferencesImprovedInputFieldDetectionHelpText": {
        "message": "A detecção de campo de entrada aprimorada permite uma detecção de campo de entrada dinâmica mais detalhada. No entanto, isso pode afetar o desempenho da página. Use com cuidado.",
        "description": "Improved Input Field Detection help text."
    },
    "optionsSitePreferencesAllowIframesHelpText": {
        "message": "Permitir iframes de origem cruzada permitirá a recuperação de credenciais para iframes de outro domínio. Use por sua conta e risco.",
        "description": "Allow Cross-Origin iframes help text."
    },
    "optionsSitePreferencesManualAddText": {
        "message": "Adicionar a URL manualmente",
        "description": "Label for adding site manually on Site Preferences tab."
    },
    "optionsSitePreferencesManualAddHelp": {
        "message": "A URL deve iniciar com <code>https://</code>, <code>http://</code> ou <code>file://</code>, ou <code>ftp://</code> e deve ter pelo menos 5 caracteres.",
        "description": "Help text for adding site manually on Site Preferences tab."
    },
    "optionsSitePreferencesConfirmation": {
        "message": "Deseja realmente remover o site especificado da lista: $1",
        "description": "Confirmation text when removing site from Site Preferences."
    },
    "optionsSitePreferencesConfirmationHelpText": {
        "message": "O KeePassXC-Browser ativará todos os recursos para este site e removerá a detecção somente no nome de usuário.",
        "description": "Part of confirmation text when removing Site Preferences."
    },
    "optionsSitePreferencesTableCaption": {
        "message": "Você pode gerenciar as Preferências do Site salvas usando a tabela.",
        "description": "Table caption of Site Preferences page."
    },
    "optionsSitePreferencesSelect": {
        "message": "Opção para ignorar os recursos de extensão para a página.",
        "description": "Title text of select element in Site Preferences."
    },
    "optionsAboutChrome": {
        "message": "Visite o KeePassXC-Browser na Chrome Web Store.",
        "description": "About page link to Chrome Web Store."
    },
    "optionsAboutMozilla": {
        "message": "Visite o KeePassXC-Browser no diretório de extensões do Firefox.",
        "description": "About page link to AMO."
    },
    "optionsAboutEdge": {
        "message": "Visite KeePassXC-Browser na página de complementos do Edge.",
        "description": "About page link to Edge Add-ons page."
    },
    "optionsAboutGitHub": {
        "message": "Visite o KeePassXC-Browser no GitHub.",
        "description": "About page link to GitHub."
    },
    "optionsAboutExtensionVersion": {
        "message": "Versão do KeePassXC-Browser: $1",
        "description": "About page text of extension version."
    },
    "optionsAboutKeePassXCVersion": {
        "message": "Versão do KeePassXC: $1",
        "description": "About page text of KeePassXC version."
    },
    "optionsAboutContributors": {
        "message": "Contribuidores",
        "description": "About page text of contributors."
    },
    "optionsAboutLicenses": {
        "message": "Licenças",
        "description": "About page text of licenses."
    },
    "optionsAboutReportBugs": {
        "message": "Relatar problemas",
        "description": "About page text of reporting bugs."
    },
    "optionsAboutCreateNewIssue": {
        "message": "Crie um novo relatório no GitHub.",
        "description": "Link text for creating a new issue."
    },
    "optionsAboutDebugInfo": {
        "message": "As seguintes informações de depuração podem ser usadas",
        "description": "Debug info text."
    },
    "optionsAboutSupporters": {
        "message": "Apoiadores",
        "description": "Supporters label text."
    },
    "optionsErrorInvalidValue": {
        "message": "Valor inválido. Verifique a entrada.",
        "description": "Error shown when input field has an incorrect value."
    },
    "optionsErrorInvalidURL": {
        "message": "URL inválida. Verifique a entrada.",
        "description": "Error shown when input field has an incorrect URL."
    },
    "optionsErrorValueExists": {
        "message": "O valor já existe na lista.",
        "description": "Error shown when trying to add a duplicate value to the list."
    },
    "optionsUserInterfaceTitle": {
        "message": "Interface do usuário",
        "description": "User interface title in settings page"
    },
    "optionsFillingCredentialsTitle": {
        "message": "Preenchendo as credenciais",
        "description": "Filling credentials title in settings page"
    },
    "optionsSavingCredentialsTitle": {
        "message": "Salvando as credenciais",
        "description": "Saving credentials title in settings page"
    },
    "optionsUpdatesTitle": {
        "message": "Atualizações",
        "description": "Updates title in settings page"
    },
    "optionsAdvancedSettingsTitle": {
        "message": "Configurações avançadas",
        "description": "Advanced settings title in settings page"
    },
    "optionsExtensionTitle": {
        "message": "Extensão",
        "description": "Extension title in settings page"
    },
    "optionsPasskeysTitle": {
        "message": "Passkeys",
        "description": "Passkeys settings title in settings page."
    },
    "optionsPasskeysEnable": {
        "message": "Habilitar chaves de acesso",
        "description": "Enabled passkeys option text."
    },
    "optionsPasskeysEnableHelpText": {
        "message": "Ative o suporte para autenticação na web.",
        "description": "Passkeys option help text."
    },
    "optionsPasskeysEnableFallback": {
        "message": "Habilitar substituto de chaves de acesso",
        "description": "Enabled passkeys fallback option text."
    },
    "optionsPasskeysEnableFallbackHelpText": {
        "message": "Quando ativado, uma solicitação falhada ou cancelada ao KeePassXC acionará a solicitação de senhas internas do próprio navegador. Se desativado, a conexão com o KeePassXC será necessária e a solicitação cancelada falhará. Padrão: habilitado.",
        "description": "Passkeys fallback option help text."
    },
    "openNewTab": {
        "message": "Abre uma nova aba",
        "description": "Title attribute text."
    },
    "httpAuthDialog": {
        "message": "Diálogo Básico de Autenticação HTTP",
        "description": "Options page HTTP Basic Auth dialog text"
    },
    "autocompleteSubmitMessage": {
        "message": "A sua seleção será enviada automaticamente",
        "description": "Message shown at the bottom of autocomplete menu."
    },
    "lockDatabase": {
        "message": "Trancar o banco de dados",
        "description": "Lock database button title text."
    }
}
