Place,Name,Sex,BirthDate,Age,Equipment,Division,BodyweightKg,WeightClassKg,Squat1Kg,Squat2Kg,Squat3Kg,Best3SquatKg,Bench1Kg,Bench2Kg,Bench3Kg,Best3BenchKg,Deadlift1Kg,Deadlift2Kg,Deadlift3Kg,Best3DeadliftKg,TotalKg,Event
1,Grace Hodge,F,2003-02-07,21,Sleeves,FR-Jr,68.4,69,70,75,80,80,42.5,47.5,-50,47.5,100,110,115,115,242.5,SBD
1,Bethany Cook,F,2003-03-06,,Sleeves,FR-Jr,75.3,76,95,102.5,107.5,107.5,50,55,57.5,57.5,107.5,117.5,125,125,290,SBD
1,Pav Johal,F,1983-07-04,40,Sleeves,FR-M1,62.9,63,110,120,-127.5,120,55,60,-62.5,60,140,-150,-150,140,320,SBD
1,Rosalind Lyon,F,1980-08-24,43,Sleeves,FR-M1,71.3,76,105,115,120,120,52.5,-57.5,-57.5,52.5,112.5,122.5,130,130,302.5,SBD
1,Cherry Yeung,F,1997-02-04,,Sleeves,FR-O,50.3,52,115,122.5,127.5,127.5,72.5,-75,77.5,77.5,142.5,152.5,160,160,365,SBD
1,Catherine Phipps,F,1990-09-03,33,Sleeves,FR-O,67.8,69,140,145,150,150,85,87.5,-90,87.5,160,167.5,175,175,412.5,SBD
2,Jasmine Cross,F,1997-02-27,,Sleeves,FR-O,67.5,69,95,102.5,107.5,107.5,47.5,52.5,55,55,110,120,-130,120,282.5,SBD
1,Louise Barber,F,1992-12-02,31,Sleeves,FR-O,72.9,76,92.5,100,107.5,107.5,52.5,57.5,62.5,62.5,120,130,140,140,310,SBD
1,Katie Baker #1,F,1994-04-12,29,Sleeves,FR-O,83.5,84,145,152.5,155,155,85,90,92.5,92.5,142.5,-150,-155,142.5,390,SBD
1,Sophie Gay,F,1987-10-21,36,Sleeves,FR-O,68.5,69,,,,,57.5,65,67.5,67.5,,,,,67.5,B
1,Jack Parker #1,M,2001-08-31,,Sleeves,MR-Jr,72.6,74,170,-180,-180,170,105,110,115,115,-215,220,230,230,515,SBD
1,Minh Nguyen #13,M,2000-08-03,23,Sleeves,MR-Jr,80.4,83,-145,152.5,167.5,167.5,95,105,-112.5,105,195,207.5,215,215,487.5,SBD
1,Ajoy Sarker,M,1967-07-10,56,Sleeves,MR-M2,72.6,74,130,140,150,150,-105,105,110,110,160,170,180,180,440,SBD
1,Simon Lace,M,1968-03-02,56,Sleeves,MR-M2,89.6,93,145,160,-162.5,160,102.5,107.5,-110,107.5,165,172.5,-175,172.5,440,SBD
1,Stephen Giles,M,1961-09-19,62,Sleeves,MR-M3,99.4,105,147.5,157.5,162.5,162.5,90,-100,-100,90,160,170,180,180,432.5,SBD
1,James Baldwin #2,M,1996-08-31,27,Sleeves,MR-O,82.4,83,190,202.5,207.5,207.5,135,140,-145,140,215,230,-240,230,577.5,SBD
1,Oliver Bates,M,1995-06-09,28,Sleeves,MR-O,90.6,93,197.5,210,215,215,-137.5,140,145,145,220,235,245,245,605,SBD
3,Joe Bee,M,1994-02-17,30,Sleeves,MR-O,90,93,95,105,115,115,65,70,75,75,130,140,150,150,340,SBD
1,Elliot Vaughan,M,1998-06-02,25,Sleeves,MR-O,97.8,105,197.5,207.5,217.5,217.5,125,-127.5,-127.5,125,255,270,280,280,622.5,SBD
2,George Reid,M,1997-12-05,26,Sleeves,MR-O,101.8,105,200,210,217.5,217.5,125,132.5,135,135,220,-235,235,235,587.5,SBD
3,Ben Griffiths,M,1999-12-20,24,Sleeves,MR-O,104.2,105,-200,200,212.5,212.5,120,-130,-130,120,200,-220,220,220,552.5,SBD
4,Connor Pimm,M,1996-07-14,27,Sleeves,MR-O,94.4,105,180,190,195,195,90,95,-100,95,205,215,227.5,227.5,517.5,SBD
1,Jason Brooks,M,1999-06-26,24,Sleeves,MR-O,120,120,200,207.5,212.5,212.5,105,110,-115,110,220,230,235,235,557.5,SBD
1,Toby Sheffield,M,1998-02-25,,Sleeves,MR-O,149.2,120+,210,222.5,-232.5,222.5,115,120,125,125,167.5,182.5,192.5,192.5,540,SBD
