Division,WeightClassKg,Place,Name,Team,BodyweightKg,Best3SquatKg,Best3BenchKg,Best3DeadliftKg,TotalKg,Equipment,Event,Sex,BirthDate
Boys,51.71,1,Marcelo Patino,Frisco Emerson,51.07,120.2,68.04,111.13,299.37,Unlimited,SBD,M,
Boys,51.71,2,Angel Olvera,Wolfe City,45.36,92.99,61.23,106.59,260.82,Unlimited,SBD,M,
Boys,51.71,3,Angel Delrio,Forney,51.26,95.25,45.36,106.59,247.21,Unlimited,SBD,M,
Boys,55.79,1,Henry Tran,Carrollton Turner,55.47,117.93,72.57,156.49,347,Unlimited,SBD,M,
Boys,55.79,2,Quadra Davis,Carrollton Ranchview,54.16,108.86,72.57,142.88,324.32,Unlimited,SBD,M,
Boys,55.79,3,Asher Apodaca,Little Elm,53.43,129.27,70.31,122.47,322.05,Unlimited,SBD,M,
Boys,55.79,4,Drew Salters,Forney,55.79,108.86,52.16,131.54,292.57,Unlimited,SBD,M,
Boys,59.87,1,Andy Mejia,Carrollton Creekview,59.69,179.17,99.79,192.78,471.74,Unlimited,SBD,M,
Boys,59.87,2,Nathan Vargas,Forney,59.87,142.88,77.11,156.49,376.48,Unlimited,SBD,M,
Boys,59.87,3,Conner Peterson,Frisco Heritage,59.78,133.81,81.65,136.08,351.53,Unlimited,SBD,M,
Boys,59.87,4,Eric Melendez,Carrollton Turner,57.47,113.4,61.23,127.01,301.64,Unlimited,SBD,M,
Boys,59.87,DQ,Max Moreno,Carrollton Ranchview,59.42,,,,,Unlimited,SBD,M,
Boys,59.87,DQ,Ayush Mitra,Frisco Lebanon Trail,58.97,,,,,Unlimited,SBD,M,
Boys,67.13,1,Jose Elisondo,Carrollton Turner,63.96,204.12,124.74,192.78,521.63,Unlimited,SBD,M,
Boys,67.13,2,Aidan Gray,Lewisville Marcus,63.96,158.76,104.33,165.56,428.64,Unlimited,SBD,M,
Boys,67.13,3,Kyle Barr,Little Elm,66.22,158.76,113.4,156.49,428.64,Unlimited,SBD,M,
Boys,67.13,4,David Benagh,Carrollton Creekview,67.09,151.95,106.59,167.83,426.38,Unlimited,SBD,M,
Boys,67.13,5,Cannon Miller,Wolfe City,63.78,165.56,95.25,154.22,415.04,Unlimited,SBD,M,
Boys,67.13,6,Hamza Ali,Little Elm,65.86,136.08,111.13,165.56,412.77,Unlimited,SBD,M,
Boys,67.13,7,Jayden Heath,Forney,67.13,142.88,86.18,158.76,387.82,Unlimited,SBD,M,
Boys,67.13,8,Christian Orona,Forney,67.13,145.15,102.06,136.08,383.29,Unlimited,SBD,M,
Boys,67.13,9,Oliver Nemec,Carrollton Turner,66.36,129.27,92.99,142.88,365.14,Unlimited,SBD,M,
Boys,67.13,10,Majd Aicha,Royse City,61.23,138.35,79.38,133.81,351.53,Unlimited,SBD,M,
Boys,67.13,11,Gabriel Méndez,Little Elm,65.23,117.93,83.91,142.88,344.73,Unlimited,SBD,M,
Boys,67.13,12,Bryan Arrington,Quinlan Boles,65.5,106.59,74.84,124.74,306.17,Unlimited,SBD,M,
Boys,67.13,13,John Wilson,Wolfe City,62.14,102.06,56.7,115.67,274.42,Unlimited,SBD,M,
Boys,74.84,1,Austin Stutts,Frisco Wakeland,74.03,208.65,140.61,222.26,571.53,Unlimited,SBD,M,
Boys,74.84,2,Besnik Hysenaj,Little Elm,73.21,210.92,154.22,204.12,569.26,Unlimited,SBD,M,
Boys,74.84,3,Jace Oliver,Royse City,71.03,192.78,102.06,188.24,483.08,Unlimited,SBD,M,
Boys,74.84,4,Raymond Jackson,Carrollton Creekview,71.85,165.56,115.67,185.97,467.2,Unlimited,SBD,M,
Boys,74.84,5,Brayden Neal,Carrollton Creekview,72.85,163.29,102.06,174.63,439.98,Unlimited,SBD,M,
Boys,74.84,6,Andres Aislant,Carrollton Turner,74.07,163.29,97.52,174.63,435.45,Unlimited,SBD,M,
Boys,74.84,7,Reniqui Martinez,Carrollton Ranchview,74.84,167.83,92.99,170.1,430.91,Unlimited,SBD,M,
Boys,74.84,8,Jacob Navarro,Wolfe City,69.94,163.29,86.18,174.63,424.11,Unlimited,SBD,M,
Boys,74.84,9,Kaelan McCuigan,Little Elm,73.39,156.49,102.06,165.56,424.11,Unlimited,SBD,M,
Boys,74.84,10,Zaelyn Leffall,Royse City,72.03,156.49,92.99,156.49,405.97,Unlimited,SBD,M,
Boys,74.84,11,Jacob James,Royse City,74.66,142.88,97.52,154.22,394.63,Unlimited,SBD,M,
Boys,74.84,12,Carlos Pineda,Carrollton Turner,74.43,142.88,104.33,145.15,392.36,Unlimited,SBD,M,
Boys,74.84,13,Luke Mateer,Little Elm,73.75,124.74,83.91,170.1,378.75,Unlimited,SBD,M,
Boys,74.84,14,Axel Moreno,Royse City,73.66,136.08,90.72,147.42,374.21,Unlimited,SBD,M,
Boys,74.84,15,Braylon Ellis,Carrollton Ranchview,74.84,113.4,77.11,161.03,351.53,Unlimited,SBD,M,
Boys,74.84,DQ,Cruz Elliott,Royse City,74.39,,,,,Unlimited,SBD,M,
Boys,74.84,DQ,Patrick Moreno,Carrollton Turner,71.4,,,,,Unlimited,SBD,M,
Boys,82.1,1,Bailey Ohrn,Frisco Emerson,79.2,265.35,192.78,247.21,705.34,Unlimited,SBD,M,
Boys,82.1,2,Bladimir Pena,Carrollton Turner,80.56,190.51,113.4,213.19,517.1,Unlimited,SBD,M,
Boys,82.1,3,Devin Gonzales,Little Elm,80.29,167.83,113.4,229.06,510.29,Unlimited,SBD,M,
Boys,82.1,4,Connor Valley,Little Elm,81.56,183.7,113.4,210.92,508.02,Unlimited,SBD,M,
Boys,82.1,5,Nate Cornelius,Denton Braswell,78.38,174.63,131.54,185.97,492.15,Unlimited,SBD,M,
Boys,82.1,6,Nathan Le,Frisco Liberty,80.47,165.56,136.08,188.24,489.88,Unlimited,SBD,M,
Boys,82.1,7,Randy Lantrip,Forney,81.47,183.7,120.2,174.63,478.54,Unlimited,SBD,M,
Boys,82.1,8,Jack York,Carrollton Creekview,79.38,138.35,117.93,185.97,442.25,Unlimited,SBD,M,
Boys,82.1,9,Maurice Harris,Carrollton Creekview,81.83,174.63,102.06,165.56,442.25,Unlimited,SBD,M,
Boys,82.1,10,Kelton Hiebert,Forney,80.2,174.63,102.06,158.76,435.45,Unlimited,SBD,M,
Boys,82.1,11,Warren Richardson,Wolfe City,78.74,151.95,106.59,161.03,419.57,Unlimited,SBD,M,
Boys,82.1,12,Daniel Starkey,Royse City,82.01,142.88,83.91,138.35,365.14,Unlimited,SBD,M,
Boys,82.1,13,Madoxx Mondragon,Royse City,78.93,124.74,88.45,142.88,356.07,Unlimited,SBD,M,
Boys,82.1,14,Akin Cervantes,Carrollton Turner,78.38,136.08,72.57,140.61,349.27,Unlimited,SBD,M,
Boys,82.1,15,Nicolas Lumbreras,Carrollton Creekview,78.11,115.67,92.99,138.35,347,Unlimited,SBD,M,
Boys,82.1,DQ,Dre Richardson,Carrollton Creekview,81.65,,,,,Unlimited,SBD,M,
Boys,89.81,1,Robbie Martinez,Carrollton Turner,83.51,235.87,154.22,235.87,625.96,Unlimited,SBD,M,
Boys,89.81,2,DaMarcus Cannon,Carrollton Creekview,89.81,213.19,129.27,226.8,569.26,Unlimited,SBD,M,
Boys,89.81,3,Edgar Castilla,Carrollton Turner,89.72,217.72,111.13,233.6,562.45,Unlimited,SBD,M,
Boys,89.81,4,Hd Davis,Wolfe City,86.55,226.8,129.27,183.7,539.77,Unlimited,SBD,M,
Boys,89.81,5,Gabriel Ramirez,Forney,86.82,199.58,111.13,204.12,514.83,Unlimited,SBD,M,
Boys,89.81,6,Kamron Webb,Carrollton Creekview,87.82,188.24,111.13,188.24,487.61,Unlimited,SBD,M,
Boys,89.81,7,Colby Langham,Royse City,89.54,181.44,111.13,158.76,451.32,Unlimited,SBD,M,
Boys,89.81,8,Kyle Wojtowicz,Forney,87.54,154.22,106.59,147.42,408.23,Unlimited,SBD,M,
Boys,89.81,9,Brody Gardner,Wolfe City,86.09,147.42,102.06,131.54,381.02,Unlimited,SBD,M,
Boys,89.81,10,Riley Crump,Wolfe City,87,102.06,72.57,142.88,317.51,Unlimited,SBD,M,
Boys,89.81,DQ,Dustin Sharp,Denton Braswell,89.81,,,,,Unlimited,SBD,M,
Boys,89.81,DQ,Tyreion Burns,Lancaster,89.36,,,,,Unlimited,SBD,M,
Boys,99.79,1,Malakai Meyer,Frisco Heritage,99.79,233.6,120.2,208.65,562.45,Unlimited,SBD,M,
Boys,99.79,2,Brenlon Ellis,Carrollton Ranchview,94.98,195.04,122.47,235.87,553.38,Unlimited,SBD,M,
Boys,99.79,3,Ozzy Granado,Quinlan Boles,98.79,215.46,120.2,217.72,553.38,Unlimited,SBD,M,
Boys,99.79,4,Sebastian Lopez,Royse City,99.79,217.72,131.54,192.78,542.04,Unlimited,SBD,M,
Boys,99.79,5,John Garcia-Mercado,Carrollton Turner,94.57,188.24,127.01,188.24,503.49,Unlimited,SBD,M,
Boys,99.79,6,Masias Quezada,Lewisville Marcus,96.43,163.29,142.88,183.7,489.88,Unlimited,SBD,M,
Boys,99.79,7,Gage Sanders,Wolfe City,99.34,190.51,106.59,183.7,480.81,Unlimited,SBD,M,
Boys,99.79,8,Cameron Shinn,Royse City,97.89,176.9,106.59,183.7,467.2,Unlimited,SBD,M,
Boys,99.79,9,Aiden Samples,Wolfe City,92.08,179.17,102.06,163.29,444.52,Unlimited,SBD,M,
Boys,99.79,10,Seth Joplin,Lewisville Marcus,96.8,151.95,83.91,167.83,403.7,Unlimited,SBD,M,
Boys,99.79,11,Logan Smith,Carrollton Creekview,97.98,124.74,102.06,142.88,369.68,Unlimited,SBD,M,
Boys,99.79,DQ,Daniel García,Wolfe City,99.79,,,,,Unlimited,SBD,M,
Boys,99.79,DQ,Jebrelin Fisher,Lancaster,90.36,142.88,106.59,,,Unlimited,SBD,M,
Boys,99.79,DQ,Givens Igwe,Lancaster,92.44,215.46,,,,Unlimited,SBD,M,
Boys,99.79,DQ,Dylan Sandles,Lancaster,94.17,142.88,102.06,,,Unlimited,SBD,M,
Boys,109.77,1,Tristan Rodelo,Carrollton Turner,105.96,272.16,129.27,240.4,641.83,Unlimited,SBD,M,
Boys,109.77,2,Nick Garza,Little Elm,105.69,263.08,140.61,224.53,628.23,Unlimited,SBD,M,
Boys,109.77,3,Kamden Dyess,Frisco Heritage,108.23,238.14,174.63,215.46,628.23,Unlimited,SBD,M,
Boys,109.77,4,Destin Deans,Carrollton Creekview,104.24,210.92,138.35,231.33,580.6,Unlimited,SBD,M,
Boys,109.77,5,Danilo Case,Carrollton Creekview,101.51,210.92,147.42,208.65,566.99,Unlimited,SBD,M,
Boys,109.77,6,Diego Cuara,Forney,106.05,204.12,142.88,183.7,530.7,Unlimited,SBD,M,
Boys,109.77,7,John Stepherson,Carrollton Creekview,102.33,183.7,102.06,174.63,460.4,Unlimited,SBD,M,
Boys,109.77,8,Dylan Martinez,Carrollton Ranchview,105.69,151.95,99.79,163.29,415.04,Unlimited,SBD,M,
Boys,109.77,DQ,Collin Graeff,Lancaster,109.32,,,,,Unlimited,SBD,M,
Boys,109.77,DQ,Sir'Christian Kirkwood,Lancaster,109.32,,,,,Unlimited,SBD,M,
Boys,109.77,DQ,Jeremiah Raynor,Lancaster,103.51,142.88,115.67,,,Unlimited,SBD,M,
Boys,124.74,1,Keondre Harris,Carrollton Ranchview,117.03,254.01,151.95,217.72,623.69,Unlimited,SBD,M,
Boys,124.74,2,Tony Le,Lewisville Marcus,113.13,224.53,136.08,206.38,566.99,Unlimited,SBD,M,
Boys,124.74,3,Pedro Borges,Denton Braswell,118.39,249.48,115.67,201.85,566.99,Unlimited,SBD,M,
Boys,124.74,4,Amjad Khazem,Frisco Heritage,121.38,247.21,120.2,183.7,551.11,Unlimited,SBD,M,
Boys,124.74,5,Alex Puentes,Wolfe City,115.21,215.46,145.15,167.83,528.44,Unlimited,SBD,M,
Boys,124.74,6,Trenton Dawson,Forney,113.85,176.9,124.74,206.38,508.02,Unlimited,SBD,M,
Boys,124.74,7,Dereon Flynn,Carrollton Turner,118.39,183.7,136.08,188.24,508.02,Unlimited,SBD,M,
Boys,124.74,8,Cody Killgo,Wolfe City,122.74,183.7,140.61,170.1,494.42,Unlimited,SBD,M,
Boys,124.74,9,Diego Gonzalez,Little Elm,119.66,185.97,120.2,181.44,487.61,Unlimited,SBD,M,
Boys,124.74,10,Jase Williams,Wolfe City,122.92,183.7,124.74,174.63,483.08,Unlimited,SBD,M,
Boys,124.74,11,Andy Diaz,Little Elm,114.4,165.56,115.67,176.9,458.13,Unlimited,SBD,M,
Boys,124.74,DQ,Davon Berry,Lancaster,117.12,199.58,106.59,,,Unlimited,SBD,M,
Boys,124.74,DQ,Jakoby Williams,Lancaster,116.75,163.29,115.67,,,Unlimited,SBD,M,
Boys,124.74,DQ,Jayden Shaw,Lancaster,111.95,195.04,106.59,,,Unlimited,SBD,M,
Boys,124.74,DQ,Kehdrien Davis,Lancaster,113.22,147.42,102.06,,,Unlimited,SBD,M,
Boys,139.71,1,Hugo Lopez,Forney,132.9,278.96,161.03,226.8,666.78,Unlimited,SBD,M,
Boys,139.71,2,Travis Chinamhora,Carrollton Creekview,127.46,229.06,170.1,208.65,607.81,Unlimited,SBD,M,
Boys,139.71,3,Sydney Ross,Denton Braswell,126.1,238.14,156.49,195.04,589.67,Unlimited,SBD,M,
Boys,139.71,4,Zacc Harris-Gulley,Denton Braswell,135.17,231.33,145.15,183.7,560.19,Unlimited,SBD,M,
Boys,139.71,5,Johan Castano,Carrollton Turner,131.27,226.8,149.69,172.37,548.85,Unlimited,SBD,M,
Boys,139.71,6,Matthew Phillips,Carrollton Creekview,136.53,156.49,108.86,183.7,449.06,Unlimited,SBD,M,
Boys,139.71,DQ,Kahlil Johnson,Carrollton Ranchview,139.25,,,,,Unlimited,SBD,M,
Boys,139.71,DQ,Cam McMillan,Lancaster,126.1,,,,,Unlimited,SBD,M,
Boys,139.71+,1,Christian Chukura,Denton Braswell,144.24,226.8,151.95,213.19,591.94,Unlimited,SBD,M,
Boys,139.71+,2,Jackson Ary,Carrollton Creekview,142.88,188.24,131.54,195.04,514.83,Unlimited,SBD,M,
Boys,139.71+,3,Adrian Gonzales,Carrollton Ranchview,156.94,154.22,92.99,174.63,421.84,Unlimited,SBD,M,
Boys,139.71+,DQ,Jace Bardwell,Lewisville Marcus,143.79,,,,,Unlimited,SBD,M,
