{
  "title": "Login Request Interface",
  "type": "object",
  "properties": {
    "publicKey": {
      "type": "string"
    },
    "email": {
      "type": "string"
    },
    "password": {
      "type": "string"
    }
  },
  "additionalProperties": false,
  "required": [
    "publicKey",
    "email",
    "password"
  ]
}