{
  "$schema": "https://json-schema.org/draft/2019-09/schema#",
  "annotations": {
    "type": "object",
    "patternProperties": {
      "^.+$": {
        "type": "string"
      }
    },
    "additionalProperties": false
  },
  "env": {
    "type": "array",
    "items": {
      "type": "object",
      "properties": {
        "name": {
          "type": "string"
        },
        "value": {
          "type": "string"
        }
      }
    }
  },
  "image": {
    "type": "object",
    "properties": {
      "repository": {
        "type": "string"
      },
      "tag": {
        "type": "string"
      },
      "pullPolicy": {
        "type": "string",
        "enum": [
          "Never",
          "IfNotPresent",
          "Always"
        ]
      }
    },
    "additionalProperties": false,
    "required": [
      "repository"
    ]
  },
  "labels": {
    "type": "object",
    "patternProperties": {
      "^.+$": {
        "type": "string"
      }
    },
    "additionalProperties": false
  },
  "podSecurityContext": {
    "type": "object",
    "properties": {
      "runAsUser": {
        "type": "integer"
      },
      "runAsGroup": {
        "type": "integer"
      },
      "fsGroup": {
        "type": "integer"
      }
    },
    "additionalProperties": false
  },
  "resources": {
    "type": "object",
    "properties": {
      "requests": {
        "properties": {
          "cpu": {
            "type": "string"
          },
          "memory": {
            "type": "string"
          }
        }
      },
      "limits": {
        "properties": {
          "cpu": {
            "type": "string"
          },
          "memory": {
            "type": "string"
          }
        }
      }
    },
    "additionalProperties": false
  }
}
