{
  "$schema": "https://json-schema.org/draft/2019-09/schema#",
  "type": "object",
  "properties": {
    "common": {
      "type": "object"
    },
    "nameOverride": {
      "type": "string"
    },
    "fullnameOverride": {
      "type": "string"
    },
    "global": {
      "type": "object",
      "properties": {
        "logLevel": {
          "type": "integer"
        }
      },
      "additionalProperties": false
    },
    "cainjector": {
      "type": "object"
    },
    "webhook": {
      "type": "object"
    },
    "deployment": {
      "$ref": "https://helm-schemas.br0.fr/deployment.json#"
    },
    "serviceMonitor": {
      "$ref": "https://helm-schemas.br0.fr/servicemonitor.json#"
    }
  },
  "additionalProperties": false,
  "required": [
    "deployment",
    "serviceMonitor"
  ]
}
