{
  "$schema": "https://json-schema.org/draft/2019-09/schema#",
  "type": "object",
  "properties": {
    "common": {
      "type": "object"
    },
    "nameOverride": {
      "type": "string"
    },
    "fullnameOverride": {
      "type": "string"
    },
    "config": {
      "type": "object",
      "properties": {
        "apiURL": {
          "type": "string"
        }
      },
      "additionalProperties": false,
      "required": [
        "apiURL"
      ]
    },
    "deployment": {
      "$ref": "https://helm-schemas.br0.fr/deployment.json#"
    },
    "serviceMonitor": {
      "$ref": "https://helm-schemas.br0.fr/servicemonitor.json#"
    }
  },
  "additionalProperties": false,
  "required": [
    "config",
    "deployment",
    "serviceMonitor"
  ]
}
