{
  "$schema": "https://json-schema.org/draft/2019-09/schema#",
  "type": "object",
  "properties": {
    "common": {
      "type": "object"
    },
    "nameOverride": {
      "type": "string"
    },
    "fullnameOverride": {
      "type": "string"
    },
    "config": {
      "type": "object",
      "properties": {
        "externalURL": {
          "type": "string"
        },
        "logLevel": {
          "type": "string",
          "enum": [
            "debug",
            "info",
            "warn",
            "error"
          ]
        }
      },
      "additionalProperties": false,
      "required": [
        "externalURL"
      ]
    },
    "statefulset": {
      "$ref": "https://helm-schemas.br0.fr/statefulset.json#"
    },
    "ingress": {
      "$ref": "https://helm-schemas.br0.fr/ingress.json#"
    },
    "serviceMonitor": {
      "$ref": "https://helm-schemas.br0.fr/servicemonitor.json#"
    }
  },
  "additionalProperties": false,
  "required": [
    "config",
    "statefulset",
    "ingress",
    "serviceMonitor"
  ]
}
