{
  "$schema": "https://json-schema.org/draft/2019-09/schema#",
  "type": "object",
  "properties": {
    "common": {
      "type": "object"
    },
    "nameOverride": {
      "type": "string"
    },
    "fullnameOverride": {
      "type": "string"
    },
    "config": {
      "type": "object",
      "properties": {
        "environment": {
          "type": "object"
        },
        "repositories": {
          "type": "array",
          "items": {
            "type": "string"
          }
        }
      },
      "additionalProperties": false,
      "required": [
        "repositories"
      ]
    },
    "cronJob": {
      "type": "object",
      "properties": {
        "concurrencyPolicy": {
          "type": "string",
          "enum": [
            "Allow",
            "Forbid",
            "Replace"
          ]
        },
        "schedule": {
          "type": "string"
        },
        "priorityClassName": {
          "type": "string"
        },
        "extraPodAnnotations": {
          "$ref": "https://helm-schemas.br0.fr/base.json#/annotations"
        },
        "extraPodLabels": {
          "$ref": "https://helm-schemas.br0.fr/base.json#/labels"
        },
        "podSecurityContext": {
          "$ref": "https://helm-schemas.br0.fr/base.json#/podSecurityContext"
        },
        "image": {
          "$ref": "https://helm-schemas.br0.fr/base.json#/image"
        },
        "extraArgs": {
          "type": "array"
        },
        "extraEnv": {
          "$ref": "https://helm-schemas.br0.fr/base.json#/env"
        },
        "resources": {
          "$ref": "https://helm-schemas.br0.fr/base.json#/resources"
        },
        "nodeSelector": {
          "type": "object"
        },
        "affinity": {
          "type": "object"
        },
        "tolerations": {
          "type": "array"
        }
      },
      "additionalProperties": false,
      "required": [
        "schedule",
        "image"
      ]
    }
  },
  "additionalProperties": false,
  "required": [
    "config",
    "cronJob"
  ]
}
