{
  "$schema": "https://json-schema.org/draft/2019-09/schema#",
  "type": "object",
  "properties": {
    "global": {
      "type": "object"
    },
    "enabled": {
      "type": "boolean"
    },
    "deployment": {
      "$ref": "https://helm-schemas.br0.fr/deployment.json#"
    },
    "serviceMonitor": {
      "$ref": "https://helm-schemas.br0.fr/servicemonitor.json#"
    }
  },
  "additionalProperties": false,
  "required": [
    "deployment",
    "serviceMonitor"
  ]
}
