digraph model_graph {
  // Dotfile by Django-Extensions graph_models
  // Created: 2020-06-14 15:46
  // Cli Options: -a

  fontname = "Roboto"
  fontsize = 8
  splines  = true

  node [
    fontname = "Roboto"
    fontsize = 8
    shape = "plaintext"
  ]

  edge [
    fontname = "Roboto"
    fontsize = 8
  ]

  // Labels
  subgraph cluster_django_contrib_admin {
    label=<
          <TABLE BORDER="0" CELLBORDER="0" CELLSPACING="0">
          <TR><TD COLSPAN="2" CELLPADDING="4" ALIGN="CENTER">
          <FONT FACE="Roboto" COLOR="Black" POINT-SIZE="10">
          <B>django.contrib.admin</B>
          </FONT>
          </TD></TR>
          </TABLE>
          >
    color=olivedrab4
    style="rounded"
  
    django_contrib_admin_models_LogEntry [label=<
      <TABLE BGCOLOR="white" BORDER="1" CELLBORDER="0" CELLSPACING="0">
      <TR><TD COLSPAN="2" CELLPADDING="5" ALIGN="CENTER" BGCOLOR="#1b563f">
      <FONT FACE="Roboto" COLOR="white" POINT-SIZE="10"><B>
      LogEntry
      </B></FONT></TD></TR>
    
    
      <TR><TD ALIGN="LEFT" BORDER="0">
      <FONT FACE="Roboto"><B>id</B></FONT>
      </TD><TD ALIGN="LEFT">
      <FONT FACE="Roboto"><B>AutoField</B></FONT>
      </TD></TR>
    
    
    
      <TR><TD ALIGN="LEFT" BORDER="0">
      <FONT COLOR="#7B7B7B" FACE="Roboto"><B>content_type</B></FONT>
      </TD><TD ALIGN="LEFT">
      <FONT COLOR="#7B7B7B" FACE="Roboto"><B>ForeignKey (id)</B></FONT>
      </TD></TR>
    
    
    
      <TR><TD ALIGN="LEFT" BORDER="0">
      <FONT FACE="Roboto"><B>user</B></FONT>
      </TD><TD ALIGN="LEFT">
      <FONT FACE="Roboto"><B>ForeignKey (id)</B></FONT>
      </TD></TR>
    
    
    
      <TR><TD ALIGN="LEFT" BORDER="0">
      <FONT FACE="Roboto">action_flag</FONT>
      </TD><TD ALIGN="LEFT">
      <FONT FACE="Roboto">PositiveSmallIntegerField</FONT>
      </TD></TR>
    
    
    
      <TR><TD ALIGN="LEFT" BORDER="0">
      <FONT FACE="Roboto">action_time</FONT>
      </TD><TD ALIGN="LEFT">
      <FONT FACE="Roboto">DateTimeField</FONT>
      </TD></TR>
    
    
    
      <TR><TD ALIGN="LEFT" BORDER="0">
      <FONT COLOR="#7B7B7B" FACE="Roboto">change_message</FONT>
      </TD><TD ALIGN="LEFT">
      <FONT COLOR="#7B7B7B" FACE="Roboto">TextField</FONT>
      </TD></TR>
    
    
    
      <TR><TD ALIGN="LEFT" BORDER="0">
      <FONT COLOR="#7B7B7B" FACE="Roboto">object_id</FONT>
      </TD><TD ALIGN="LEFT">
      <FONT COLOR="#7B7B7B" FACE="Roboto">TextField</FONT>
      </TD></TR>
    
    
    
      <TR><TD ALIGN="LEFT" BORDER="0">
      <FONT FACE="Roboto">object_repr</FONT>
      </TD><TD ALIGN="LEFT">
      <FONT FACE="Roboto">CharField</FONT>
      </TD></TR>
    
    
      </TABLE>
      >]

  }
  subgraph cluster_django_contrib_auth {
    label=<
          <TABLE BORDER="0" CELLBORDER="0" CELLSPACING="0">
          <TR><TD COLSPAN="2" CELLPADDING="4" ALIGN="CENTER">
          <FONT FACE="Roboto" COLOR="Black" POINT-SIZE="10">
          <B>django.contrib.auth</B>
          </FONT>
          </TD></TR>
          </TABLE>
          >
    color=olivedrab4
    style="rounded"
  
    django_contrib_auth_models_AbstractUser [label=<
      <TABLE BGCOLOR="white" BORDER="1" CELLBORDER="0" CELLSPACING="0">
      <TR><TD COLSPAN="2" CELLPADDING="5" ALIGN="CENTER" BGCOLOR="#1b563f">
      <FONT FACE="Roboto" COLOR="white" POINT-SIZE="10"><B>
      AbstractUser<BR/>&lt;<FONT FACE="Roboto"><I>AbstractBaseUser,PermissionsMixin</I></FONT>&gt;
      </B></FONT></TD></TR>
    
    
      <TR><TD ALIGN="LEFT" BORDER="0">
      <FONT FACE="Roboto">date_joined</FONT>
      </TD><TD ALIGN="LEFT">
      <FONT FACE="Roboto">DateTimeField</FONT>
      </TD></TR>
    
    
    
      <TR><TD ALIGN="LEFT" BORDER="0">
      <FONT COLOR="#7B7B7B" FACE="Roboto">email</FONT>
      </TD><TD ALIGN="LEFT">
      <FONT COLOR="#7B7B7B" FACE="Roboto">EmailField</FONT>
      </TD></TR>
    
    
    
      <TR><TD ALIGN="LEFT" BORDER="0">
      <FONT COLOR="#7B7B7B" FACE="Roboto">first_name</FONT>
      </TD><TD ALIGN="LEFT">
      <FONT COLOR="#7B7B7B" FACE="Roboto">CharField</FONT>
      </TD></TR>
    
    
    
      <TR><TD ALIGN="LEFT" BORDER="0">
      <FONT FACE="Roboto">is_active</FONT>
      </TD><TD ALIGN="LEFT">
      <FONT FACE="Roboto">BooleanField</FONT>
      </TD></TR>
    
    
    
      <TR><TD ALIGN="LEFT" BORDER="0">
      <FONT FACE="Roboto">is_staff</FONT>
      </TD><TD ALIGN="LEFT">
      <FONT FACE="Roboto">BooleanField</FONT>
      </TD></TR>
    
    
    
      <TR><TD ALIGN="LEFT" BORDER="0">
      <FONT FACE="Roboto"><I>is_superuser</I></FONT>
      </TD><TD ALIGN="LEFT">
      <FONT FACE="Roboto"><I>BooleanField</I></FONT>
      </TD></TR>
    
    
    
      <TR><TD ALIGN="LEFT" BORDER="0">
      <FONT COLOR="#7B7B7B" FACE="Roboto"><I>last_login</I></FONT>
      </TD><TD ALIGN="LEFT">
      <FONT COLOR="#7B7B7B" FACE="Roboto"><I>DateTimeField</I></FONT>
      </TD></TR>
    
    
    
      <TR><TD ALIGN="LEFT" BORDER="0">
      <FONT COLOR="#7B7B7B" FACE="Roboto">last_name</FONT>
      </TD><TD ALIGN="LEFT">
      <FONT COLOR="#7B7B7B" FACE="Roboto">CharField</FONT>
      </TD></TR>
    
    
    
      <TR><TD ALIGN="LEFT" BORDER="0">
      <FONT FACE="Roboto"><I>password</I></FONT>
      </TD><TD ALIGN="LEFT">
      <FONT FACE="Roboto"><I>CharField</I></FONT>
      </TD></TR>
    
    
    
      <TR><TD ALIGN="LEFT" BORDER="0">
      <FONT FACE="Roboto">username</FONT>
      </TD><TD ALIGN="LEFT">
      <FONT FACE="Roboto">CharField</FONT>
      </TD></TR>
    
    
      </TABLE>
      >]
  
    django_contrib_auth_models_Permission [label=<
      <TABLE BGCOLOR="white" BORDER="1" CELLBORDER="0" CELLSPACING="0">
      <TR><TD COLSPAN="2" CELLPADDING="5" ALIGN="CENTER" BGCOLOR="#1b563f">
      <FONT FACE="Roboto" COLOR="white" POINT-SIZE="10"><B>
      Permission
      </B></FONT></TD></TR>
    
    
      <TR><TD ALIGN="LEFT" BORDER="0">
      <FONT FACE="Roboto"><B>id</B></FONT>
      </TD><TD ALIGN="LEFT">
      <FONT FACE="Roboto"><B>AutoField</B></FONT>
      </TD></TR>
    
    
    
      <TR><TD ALIGN="LEFT" BORDER="0">
      <FONT FACE="Roboto"><B>content_type</B></FONT>
      </TD><TD ALIGN="LEFT">
      <FONT FACE="Roboto"><B>ForeignKey (id)</B></FONT>
      </TD></TR>
    
    
    
      <TR><TD ALIGN="LEFT" BORDER="0">
      <FONT FACE="Roboto">codename</FONT>
      </TD><TD ALIGN="LEFT">
      <FONT FACE="Roboto">CharField</FONT>
      </TD></TR>
    
    
    
      <TR><TD ALIGN="LEFT" BORDER="0">
      <FONT FACE="Roboto">name</FONT>
      </TD><TD ALIGN="LEFT">
      <FONT FACE="Roboto">CharField</FONT>
      </TD></TR>
    
    
      </TABLE>
      >]
  
    django_contrib_auth_models_Group [label=<
      <TABLE BGCOLOR="white" BORDER="1" CELLBORDER="0" CELLSPACING="0">
      <TR><TD COLSPAN="2" CELLPADDING="5" ALIGN="CENTER" BGCOLOR="#1b563f">
      <FONT FACE="Roboto" COLOR="white" POINT-SIZE="10"><B>
      Group
      </B></FONT></TD></TR>
    
    
      <TR><TD ALIGN="LEFT" BORDER="0">
      <FONT FACE="Roboto"><B>id</B></FONT>
      </TD><TD ALIGN="LEFT">
      <FONT FACE="Roboto"><B>AutoField</B></FONT>
      </TD></TR>
    
    
    
      <TR><TD ALIGN="LEFT" BORDER="0">
      <FONT FACE="Roboto">name</FONT>
      </TD><TD ALIGN="LEFT">
      <FONT FACE="Roboto">CharField</FONT>
      </TD></TR>
    
    
      </TABLE>
      >]
  
    django_contrib_auth_models_User [label=<
      <TABLE BGCOLOR="white" BORDER="1" CELLBORDER="0" CELLSPACING="0">
      <TR><TD COLSPAN="2" CELLPADDING="5" ALIGN="CENTER" BGCOLOR="#1b563f">
      <FONT FACE="Roboto" COLOR="white" POINT-SIZE="10"><B>
      User<BR/>&lt;<FONT FACE="Roboto"><I>AbstractUser</I></FONT>&gt;
      </B></FONT></TD></TR>
    
    
      <TR><TD ALIGN="LEFT" BORDER="0">
      <FONT FACE="Roboto"><B>id</B></FONT>
      </TD><TD ALIGN="LEFT">
      <FONT FACE="Roboto"><B>AutoField</B></FONT>
      </TD></TR>
    
    
    
      <TR><TD ALIGN="LEFT" BORDER="0">
      <FONT FACE="Roboto"><I>date_joined</I></FONT>
      </TD><TD ALIGN="LEFT">
      <FONT FACE="Roboto"><I>DateTimeField</I></FONT>
      </TD></TR>
    
    
    
      <TR><TD ALIGN="LEFT" BORDER="0">
      <FONT COLOR="#7B7B7B" FACE="Roboto"><I>email</I></FONT>
      </TD><TD ALIGN="LEFT">
      <FONT COLOR="#7B7B7B" FACE="Roboto"><I>EmailField</I></FONT>
      </TD></TR>
    
    
    
      <TR><TD ALIGN="LEFT" BORDER="0">
      <FONT COLOR="#7B7B7B" FACE="Roboto"><I>first_name</I></FONT>
      </TD><TD ALIGN="LEFT">
      <FONT COLOR="#7B7B7B" FACE="Roboto"><I>CharField</I></FONT>
      </TD></TR>
    
    
    
      <TR><TD ALIGN="LEFT" BORDER="0">
      <FONT FACE="Roboto"><I>is_active</I></FONT>
      </TD><TD ALIGN="LEFT">
      <FONT FACE="Roboto"><I>BooleanField</I></FONT>
      </TD></TR>
    
    
    
      <TR><TD ALIGN="LEFT" BORDER="0">
      <FONT FACE="Roboto"><I>is_staff</I></FONT>
      </TD><TD ALIGN="LEFT">
      <FONT FACE="Roboto"><I>BooleanField</I></FONT>
      </TD></TR>
    
    
    
      <TR><TD ALIGN="LEFT" BORDER="0">
      <FONT FACE="Roboto"><I>is_superuser</I></FONT>
      </TD><TD ALIGN="LEFT">
      <FONT FACE="Roboto"><I>BooleanField</I></FONT>
      </TD></TR>
    
    
    
      <TR><TD ALIGN="LEFT" BORDER="0">
      <FONT COLOR="#7B7B7B" FACE="Roboto"><I>last_login</I></FONT>
      </TD><TD ALIGN="LEFT">
      <FONT COLOR="#7B7B7B" FACE="Roboto"><I>DateTimeField</I></FONT>
      </TD></TR>
    
    
    
      <TR><TD ALIGN="LEFT" BORDER="0">
      <FONT COLOR="#7B7B7B" FACE="Roboto"><I>last_name</I></FONT>
      </TD><TD ALIGN="LEFT">
      <FONT COLOR="#7B7B7B" FACE="Roboto"><I>CharField</I></FONT>
      </TD></TR>
    
    
    
      <TR><TD ALIGN="LEFT" BORDER="0">
      <FONT FACE="Roboto"><I>password</I></FONT>
      </TD><TD ALIGN="LEFT">
      <FONT FACE="Roboto"><I>CharField</I></FONT>
      </TD></TR>
    
    
    
      <TR><TD ALIGN="LEFT" BORDER="0">
      <FONT FACE="Roboto"><I>username</I></FONT>
      </TD><TD ALIGN="LEFT">
      <FONT FACE="Roboto"><I>CharField</I></FONT>
      </TD></TR>
    
    
      </TABLE>
      >]

  }
  subgraph cluster_django_contrib_contenttypes {
    label=<
          <TABLE BORDER="0" CELLBORDER="0" CELLSPACING="0">
          <TR><TD COLSPAN="2" CELLPADDING="4" ALIGN="CENTER">
          <FONT FACE="Roboto" COLOR="Black" POINT-SIZE="10">
          <B>django.contrib.contenttypes</B>
          </FONT>
          </TD></TR>
          </TABLE>
          >
    color=olivedrab4
    style="rounded"
  
    django_contrib_contenttypes_models_ContentType [label=<
      <TABLE BGCOLOR="white" BORDER="1" CELLBORDER="0" CELLSPACING="0">
      <TR><TD COLSPAN="2" CELLPADDING="5" ALIGN="CENTER" BGCOLOR="#1b563f">
      <FONT FACE="Roboto" COLOR="white" POINT-SIZE="10"><B>
      ContentType
      </B></FONT></TD></TR>
    
    
      <TR><TD ALIGN="LEFT" BORDER="0">
      <FONT FACE="Roboto"><B>id</B></FONT>
      </TD><TD ALIGN="LEFT">
      <FONT FACE="Roboto"><B>AutoField</B></FONT>
      </TD></TR>
    
    
    
      <TR><TD ALIGN="LEFT" BORDER="0">
      <FONT FACE="Roboto">app_label</FONT>
      </TD><TD ALIGN="LEFT">
      <FONT FACE="Roboto">CharField</FONT>
      </TD></TR>
    
    
    
      <TR><TD ALIGN="LEFT" BORDER="0">
      <FONT FACE="Roboto">model</FONT>
      </TD><TD ALIGN="LEFT">
      <FONT FACE="Roboto">CharField</FONT>
      </TD></TR>
    
    
      </TABLE>
      >]

  }
  subgraph cluster_django_contrib_sessions {
    label=<
          <TABLE BORDER="0" CELLBORDER="0" CELLSPACING="0">
          <TR><TD COLSPAN="2" CELLPADDING="4" ALIGN="CENTER">
          <FONT FACE="Roboto" COLOR="Black" POINT-SIZE="10">
          <B>django.contrib.sessions</B>
          </FONT>
          </TD></TR>
          </TABLE>
          >
    color=olivedrab4
    style="rounded"
  
    django_contrib_sessions_base_session_AbstractBaseSession [label=<
      <TABLE BGCOLOR="white" BORDER="1" CELLBORDER="0" CELLSPACING="0">
      <TR><TD COLSPAN="2" CELLPADDING="5" ALIGN="CENTER" BGCOLOR="#1b563f">
      <FONT FACE="Roboto" COLOR="white" POINT-SIZE="10"><B>
      AbstractBaseSession
      </B></FONT></TD></TR>
    
    
      <TR><TD ALIGN="LEFT" BORDER="0">
      <FONT FACE="Roboto">expire_date</FONT>
      </TD><TD ALIGN="LEFT">
      <FONT FACE="Roboto">DateTimeField</FONT>
      </TD></TR>
    
    
    
      <TR><TD ALIGN="LEFT" BORDER="0">
      <FONT FACE="Roboto">session_data</FONT>
      </TD><TD ALIGN="LEFT">
      <FONT FACE="Roboto">TextField</FONT>
      </TD></TR>
    
    
      </TABLE>
      >]
  
    django_contrib_sessions_models_Session [label=<
      <TABLE BGCOLOR="white" BORDER="1" CELLBORDER="0" CELLSPACING="0">
      <TR><TD COLSPAN="2" CELLPADDING="5" ALIGN="CENTER" BGCOLOR="#1b563f">
      <FONT FACE="Roboto" COLOR="white" POINT-SIZE="10"><B>
      Session<BR/>&lt;<FONT FACE="Roboto"><I>AbstractBaseSession</I></FONT>&gt;
      </B></FONT></TD></TR>
    
    
      <TR><TD ALIGN="LEFT" BORDER="0">
      <FONT FACE="Roboto"><I><B>session_key</B></I></FONT>
      </TD><TD ALIGN="LEFT">
      <FONT FACE="Roboto"><I><B>CharField</B></I></FONT>
      </TD></TR>
    
    
    
      <TR><TD ALIGN="LEFT" BORDER="0">
      <FONT FACE="Roboto"><I>expire_date</I></FONT>
      </TD><TD ALIGN="LEFT">
      <FONT FACE="Roboto"><I>DateTimeField</I></FONT>
      </TD></TR>
    
    
    
      <TR><TD ALIGN="LEFT" BORDER="0">
      <FONT FACE="Roboto"><I>session_data</I></FONT>
      </TD><TD ALIGN="LEFT">
      <FONT FACE="Roboto"><I>TextField</I></FONT>
      </TD></TR>
    
    
      </TABLE>
      >]

  }
  subgraph cluster_catraca {
    label=<
          <TABLE BORDER="0" CELLBORDER="0" CELLSPACING="0">
          <TR><TD COLSPAN="2" CELLPADDING="4" ALIGN="CENTER">
          <FONT FACE="Roboto" COLOR="Black" POINT-SIZE="10">
          <B>catraca</B>
          </FONT>
          </TD></TR>
          </TABLE>
          >
    color=olivedrab4
    style="rounded"
  
    catraca_models_Usuario [label=<
      <TABLE BGCOLOR="white" BORDER="1" CELLBORDER="0" CELLSPACING="0">
      <TR><TD COLSPAN="2" CELLPADDING="5" ALIGN="CENTER" BGCOLOR="#1b563f">
      <FONT FACE="Roboto" COLOR="white" POINT-SIZE="10"><B>
      Usuario
      </B></FONT></TD></TR>
    
    
      <TR><TD ALIGN="LEFT" BORDER="0">
      <FONT FACE="Roboto"><B>id</B></FONT>
      </TD><TD ALIGN="LEFT">
      <FONT FACE="Roboto"><B>AutoField</B></FONT>
      </TD></TR>
    
    
    
      <TR><TD ALIGN="LEFT" BORDER="0">
      <FONT FACE="Roboto">cpf</FONT>
      </TD><TD ALIGN="LEFT">
      <FONT FACE="Roboto">IntegerField</FONT>
      </TD></TR>
    
    
    
      <TR><TD ALIGN="LEFT" BORDER="0">
      <FONT FACE="Roboto">email</FONT>
      </TD><TD ALIGN="LEFT">
      <FONT FACE="Roboto">EmailField</FONT>
      </TD></TR>
    
    
    
      <TR><TD ALIGN="LEFT" BORDER="0">
      <FONT FACE="Roboto">grupo</FONT>
      </TD><TD ALIGN="LEFT">
      <FONT FACE="Roboto">CharField</FONT>
      </TD></TR>
    
    
    
      <TR><TD ALIGN="LEFT" BORDER="0">
      <FONT FACE="Roboto">nome</FONT>
      </TD><TD ALIGN="LEFT">
      <FONT FACE="Roboto">CharField</FONT>
      </TD></TR>
    
    
    
      <TR><TD ALIGN="LEFT" BORDER="0">
      <FONT FACE="Roboto">rg</FONT>
      </TD><TD ALIGN="LEFT">
      <FONT FACE="Roboto">IntegerField</FONT>
      </TD></TR>
    
    
    
      <TR><TD ALIGN="LEFT" BORDER="0">
      <FONT FACE="Roboto">senha</FONT>
      </TD><TD ALIGN="LEFT">
      <FONT FACE="Roboto">CharField</FONT>
      </TD></TR>
    
    
    
      <TR><TD ALIGN="LEFT" BORDER="0">
      <FONT FACE="Roboto">status</FONT>
      </TD><TD ALIGN="LEFT">
      <FONT FACE="Roboto">CharField</FONT>
      </TD></TR>
    
    
    
      <TR><TD ALIGN="LEFT" BORDER="0">
      <FONT FACE="Roboto">user</FONT>
      </TD><TD ALIGN="LEFT">
      <FONT FACE="Roboto">CharField</FONT>
      </TD></TR>
    
    
      </TABLE>
      >]
  
    catraca_models_Motivo [label=<
      <TABLE BGCOLOR="white" BORDER="1" CELLBORDER="0" CELLSPACING="0">
      <TR><TD COLSPAN="2" CELLPADDING="5" ALIGN="CENTER" BGCOLOR="#1b563f">
      <FONT FACE="Roboto" COLOR="white" POINT-SIZE="10"><B>
      Motivo
      </B></FONT></TD></TR>
    
    
      <TR><TD ALIGN="LEFT" BORDER="0">
      <FONT FACE="Roboto"><B>id</B></FONT>
      </TD><TD ALIGN="LEFT">
      <FONT FACE="Roboto"><B>AutoField</B></FONT>
      </TD></TR>
    
    
    
      <TR><TD ALIGN="LEFT" BORDER="0">
      <FONT FACE="Roboto">descrmotivo</FONT>
      </TD><TD ALIGN="LEFT">
      <FONT FACE="Roboto">CharField</FONT>
      </TD></TR>
    
    
    
      <TR><TD ALIGN="LEFT" BORDER="0">
      <FONT FACE="Roboto">obs</FONT>
      </TD><TD ALIGN="LEFT">
      <FONT FACE="Roboto">TextField</FONT>
      </TD></TR>
    
    
      </TABLE>
      >]
  
    catraca_models_Curso [label=<
      <TABLE BGCOLOR="white" BORDER="1" CELLBORDER="0" CELLSPACING="0">
      <TR><TD COLSPAN="2" CELLPADDING="5" ALIGN="CENTER" BGCOLOR="#1b563f">
      <FONT FACE="Roboto" COLOR="white" POINT-SIZE="10"><B>
      Curso
      </B></FONT></TD></TR>
    
    
      <TR><TD ALIGN="LEFT" BORDER="0">
      <FONT FACE="Roboto"><B>id</B></FONT>
      </TD><TD ALIGN="LEFT">
      <FONT FACE="Roboto"><B>AutoField</B></FONT>
      </TD></TR>
    
    
    
      <TR><TD ALIGN="LEFT" BORDER="0">
      <FONT FACE="Roboto">descrcurso</FONT>
      </TD><TD ALIGN="LEFT">
      <FONT FACE="Roboto">CharField</FONT>
      </TD></TR>
    
    
      </TABLE>
      >]
  
    catraca_models_Pessoa [label=<
      <TABLE BGCOLOR="white" BORDER="1" CELLBORDER="0" CELLSPACING="0">
      <TR><TD COLSPAN="2" CELLPADDING="5" ALIGN="CENTER" BGCOLOR="#1b563f">
      <FONT FACE="Roboto" COLOR="white" POINT-SIZE="10"><B>
      Pessoa
      </B></FONT></TD></TR>
    
    
      <TR><TD ALIGN="LEFT" BORDER="0">
      <FONT FACE="Roboto"><B>id</B></FONT>
      </TD><TD ALIGN="LEFT">
      <FONT FACE="Roboto"><B>AutoField</B></FONT>
      </TD></TR>
    
    
    
      <TR><TD ALIGN="LEFT" BORDER="0">
      <FONT FACE="Roboto"><B>curso</B></FONT>
      </TD><TD ALIGN="LEFT">
      <FONT FACE="Roboto"><B>ForeignKey (id)</B></FONT>
      </TD></TR>
    
    
    
      <TR><TD ALIGN="LEFT" BORDER="0">
      <FONT FACE="Roboto">cpf</FONT>
      </TD><TD ALIGN="LEFT">
      <FONT FACE="Roboto">CharField</FONT>
      </TD></TR>
    
    
    
      <TR><TD ALIGN="LEFT" BORDER="0">
      <FONT FACE="Roboto">email</FONT>
      </TD><TD ALIGN="LEFT">
      <FONT FACE="Roboto">EmailField</FONT>
      </TD></TR>
    
    
    
      <TR><TD ALIGN="LEFT" BORDER="0">
      <FONT FACE="Roboto">foto</FONT>
      </TD><TD ALIGN="LEFT">
      <FONT FACE="Roboto">FileField</FONT>
      </TD></TR>
    
    
    
      <TR><TD ALIGN="LEFT" BORDER="0">
      <FONT FACE="Roboto">nome</FONT>
      </TD><TD ALIGN="LEFT">
      <FONT FACE="Roboto">CharField</FONT>
      </TD></TR>
    
    
    
      <TR><TD ALIGN="LEFT" BORDER="0">
      <FONT FACE="Roboto">ra</FONT>
      </TD><TD ALIGN="LEFT">
      <FONT FACE="Roboto">CharField</FONT>
      </TD></TR>
    
    
    
      <TR><TD ALIGN="LEFT" BORDER="0">
      <FONT FACE="Roboto">rg</FONT>
      </TD><TD ALIGN="LEFT">
      <FONT FACE="Roboto">CharField</FONT>
      </TD></TR>
    
    
    
      <TR><TD ALIGN="LEFT" BORDER="0">
      <FONT FACE="Roboto">sexo</FONT>
      </TD><TD ALIGN="LEFT">
      <FONT FACE="Roboto">CharField</FONT>
      </TD></TR>
    
    
    
      <TR><TD ALIGN="LEFT" BORDER="0">
      <FONT FACE="Roboto">status</FONT>
      </TD><TD ALIGN="LEFT">
      <FONT FACE="Roboto">CharField</FONT>
      </TD></TR>
    
    
    
      <TR><TD ALIGN="LEFT" BORDER="0">
      <FONT FACE="Roboto">telefone_fixo</FONT>
      </TD><TD ALIGN="LEFT">
      <FONT FACE="Roboto">CharField</FONT>
      </TD></TR>
    
    
    
      <TR><TD ALIGN="LEFT" BORDER="0">
      <FONT FACE="Roboto">telefone_movel</FONT>
      </TD><TD ALIGN="LEFT">
      <FONT FACE="Roboto">CharField</FONT>
      </TD></TR>
    
    
    
      <TR><TD ALIGN="LEFT" BORDER="0">
      <FONT FACE="Roboto">tipo</FONT>
      </TD><TD ALIGN="LEFT">
      <FONT FACE="Roboto">CharField</FONT>
      </TD></TR>
    
    
      </TABLE>
      >]
  
    catraca_models_INOUT [label=<
      <TABLE BGCOLOR="white" BORDER="1" CELLBORDER="0" CELLSPACING="0">
      <TR><TD COLSPAN="2" CELLPADDING="5" ALIGN="CENTER" BGCOLOR="#1b563f">
      <FONT FACE="Roboto" COLOR="white" POINT-SIZE="10"><B>
      INOUT
      </B></FONT></TD></TR>
    
    
      <TR><TD ALIGN="LEFT" BORDER="0">
      <FONT FACE="Roboto"><B>id</B></FONT>
      </TD><TD ALIGN="LEFT">
      <FONT FACE="Roboto"><B>AutoField</B></FONT>
      </TD></TR>
    
    
    
      <TR><TD ALIGN="LEFT" BORDER="0">
      <FONT FACE="Roboto"><B>codmotivo</B></FONT>
      </TD><TD ALIGN="LEFT">
      <FONT FACE="Roboto"><B>ForeignKey (id)</B></FONT>
      </TD></TR>
    
    
    
      <TR><TD ALIGN="LEFT" BORDER="0">
      <FONT FACE="Roboto"><B>codpessoa</B></FONT>
      </TD><TD ALIGN="LEFT">
      <FONT FACE="Roboto"><B>ForeignKey (id)</B></FONT>
      </TD></TR>
    
    
    
      <TR><TD ALIGN="LEFT" BORDER="0">
      <FONT FACE="Roboto"><B>coduser</B></FONT>
      </TD><TD ALIGN="LEFT">
      <FONT FACE="Roboto"><B>ForeignKey (id)</B></FONT>
      </TD></TR>
    
    
    
      <TR><TD ALIGN="LEFT" BORDER="0">
      <FONT COLOR="#7B7B7B" FACE="Roboto">dtocorrencia</FONT>
      </TD><TD ALIGN="LEFT">
      <FONT COLOR="#7B7B7B" FACE="Roboto">DateTimeField</FONT>
      </TD></TR>
    
    
      </TABLE>
      >]

  }
  subgraph cluster_global_permissions {
    label=<
          <TABLE BORDER="0" CELLBORDER="0" CELLSPACING="0">
          <TR><TD COLSPAN="2" CELLPADDING="4" ALIGN="CENTER">
          <FONT FACE="Roboto" COLOR="Black" POINT-SIZE="10">
          <B>global_permissions</B>
          </FONT>
          </TD></TR>
          </TABLE>
          >
    color=olivedrab4
    style="rounded"
  
    global_permissions_models_GlobalPermission [label=<
      <TABLE BGCOLOR="white" BORDER="1" CELLBORDER="0" CELLSPACING="0">
      <TR><TD COLSPAN="2" CELLPADDING="5" ALIGN="CENTER" BGCOLOR="#1b563f">
      <FONT FACE="Roboto" COLOR="white" POINT-SIZE="10"><B>
      GlobalPermission
      </B></FONT></TD></TR>
    
      </TABLE>
      >]

  }


  // Relations

  django_contrib_admin_models_LogEntry -> django_contrib_auth_models_User
  [label=" user (logentry)"] [arrowhead=none, arrowtail=dot, dir=both];

  django_contrib_admin_models_LogEntry -> django_contrib_contenttypes_models_ContentType
  [label=" content_type (logentry)"] [arrowhead=none, arrowtail=dot, dir=both];

  django_contrib_auth_base_user_AbstractBaseUser [label=<
  <TABLE BGCOLOR="white" BORDER="0" CELLBORDER="0" CELLSPACING="0">
  <TR><TD COLSPAN="2" CELLPADDING="4" ALIGN="CENTER" BGCOLOR="#1b563f">
  <FONT FACE="Roboto" POINT-SIZE="12" COLOR="white">AbstractBaseUser</FONT>
  </TD></TR>
  </TABLE>
  >]
  django_contrib_auth_models_AbstractUser -> django_contrib_auth_base_user_AbstractBaseUser
  [label=" abstract\ninheritance"] [arrowhead=empty, arrowtail=none, dir=both];
  django_contrib_auth_models_PermissionsMixin [label=<
  <TABLE BGCOLOR="white" BORDER="0" CELLBORDER="0" CELLSPACING="0">
  <TR><TD COLSPAN="2" CELLPADDING="4" ALIGN="CENTER" BGCOLOR="#1b563f">
  <FONT FACE="Roboto" POINT-SIZE="12" COLOR="white">PermissionsMixin</FONT>
  </TD></TR>
  </TABLE>
  >]
  django_contrib_auth_models_AbstractUser -> django_contrib_auth_models_PermissionsMixin
  [label=" abstract\ninheritance"] [arrowhead=empty, arrowtail=none, dir=both];

  django_contrib_auth_models_Permission -> django_contrib_contenttypes_models_ContentType
  [label=" content_type (permission)"] [arrowhead=none, arrowtail=dot, dir=both];

  django_contrib_auth_models_Group -> django_contrib_auth_models_Permission
  [label=" permissions (group)"] [arrowhead=dot arrowtail=dot, dir=both];

  django_contrib_auth_models_User -> django_contrib_auth_models_Group
  [label=" groups (user)"] [arrowhead=dot arrowtail=dot, dir=both];

  django_contrib_auth_models_User -> django_contrib_auth_models_Permission
  [label=" user_permissions (user)"] [arrowhead=dot arrowtail=dot, dir=both];

  django_contrib_auth_models_User -> django_contrib_auth_models_AbstractUser
  [label=" abstract\ninheritance"] [arrowhead=empty, arrowtail=none, dir=both];



  django_contrib_sessions_models_Session -> django_contrib_sessions_base_session_AbstractBaseSession
  [label=" abstract\ninheritance"] [arrowhead=empty, arrowtail=none, dir=both];


  catraca_models_Pessoa -> catraca_models_Curso
  [label=" curso (pessoa)"] [arrowhead=none, arrowtail=dot, dir=both];

  catraca_models_INOUT -> catraca_models_Pessoa
  [label=" codpessoa (inout)"] [arrowhead=none, arrowtail=dot, dir=both];

  catraca_models_INOUT -> catraca_models_Motivo
  [label=" codmotivo (inout)"] [arrowhead=none, arrowtail=dot, dir=both];

  catraca_models_INOUT -> django_contrib_auth_models_User
  [label=" coduser (inout)"] [arrowhead=none, arrowtail=dot, dir=both];


  global_permissions_models_GlobalPermission -> django_contrib_auth_models_Permission
  [label=" proxy\ninheritance"] [arrowhead=empty, arrowtail=none, dir=both];


}
