[0m  [0m[38;5;7mHeaders[0m              [0m[38;5;7mResponse[0m [0m[38;5;7mTools[0m                       [0m[38;5;7m.....[0m                                   
[0m[38;5;0m[48;5;4m====================================================================================================[0m
    [0m[38;5;7m[48;5;0m╭────────────────────────────────[0m[38;5;7mURL[0m [0m[38;5;7mto[0m [0m[38;5;7mQuery?[0m[38;5;7m[48;5;0m─────────────────────────────────────────────╮[0m    
    [0m[38;5;7m[48;5;0m│[0m[48;5;0m                                                                                          [0m[38;5;7m[48;5;0m│[0m    
    [0m[38;5;7m[48;5;0m╰──────────────────────────────────────────────────────────────────────────────────────────╯[0m    
                                                                                                    
    ╭────────────────────────────────[0m[38;5;7mResponse[0m [0m[38;5;7mBody[0m──────────────────────────────────────────────╮   
    │                                                                                           │   
    │                                                                                           │   
    │                                                                                           │   
    │                                                                                           │   
    │                                                                                           │   
    │                                                                                           │   
    │                                                                                           │   
    │                                                                                           │   
    │                                                                                           │   
    │                                                                                           │   
    │                                                                                           │   
    │                                                                                           │   
    │                                                                                           │   
    │                                                                                           │   
    │                                                                                           │   
    │                                                                                           │   
    │                                                                                           │   
    │                                                                                           │   
    │                                                                                           │   
    │                                                                                           │   
    │                                                                                           │   
    │                                                                                           │   
    │                                                                                           │   
    │                                                                                           │   
    │                                                                                           │   
    │                                                                                           │   
    │                                                                                           │   
    │                                                                                           │   
    │                                                                                           │   
    │                                                                                           │   
    │                                                                                           │   
    │                                                                                           │   
    │                                                                                           │   
    │                                                                                           │   
    │                                                                                           │   
    │                                                                                           │   
    │                                                                                           │   
    │                                                                                           │   
    │                                                                                           │   
    │                                                                                           │   
    │                                                                                           │   
    ╰───────────────────────────────────────────────────────────────────────────────────────────╯   
                                                                                                    
