{
  "tutorials": [
    {
      "id": 0,
      "title": "Monitor",
      "description": "Monitor",
      "published": false
    },
    {
      "title": "Mousepad1",
      "description": "Mousepad",
      "published": true,
      "id": 1
    },
    {
      "id": 2,
      "title": "Mouse",
      "description": "Mouse",
      "published": true
    },
    {
      "id": 3,
      "title": "Bottle",
      "description": "Bottle",
      "published": false
    },
    {
      "id": 4,
      "title": "Laptop",
      "description": "Laptop",
      "published": false
    },
    {
      "id": 5,
      "title": "HDMI Converter",
      "description": "HDMI Converter",
      "published": false
    }
  ]
}