%!PS-Adobe-2.0 EPSF-2.0
%%Title: ClassName
%%Creator: Doxygen
%%CreationDate: Time
%%For: 
%Magnification: 1.00
%%Orientation: Portrait
%%BoundingBox: 0 0 500 1259.044863
%%Pages: 0
%%BeginSetup
%%EndSetup
%%EndComments

% ----- variables -----

/boxwidth 0 def
/boxheight 40 def
/fontheight 24 def
/marginwidth 10 def
/distx 20 def
/disty 40 def
/boundaspect 0.397126 def  % aspect ratio of the BoundingBox (width/height)
/boundx 500 def
/boundy boundx boundaspect div def
/xspacing 0 def
/yspacing 0 def
/rows 87 def
/cols 2 def
/scalefactor 0 def
/boxfont /Times-Roman findfont fontheight scalefont def

% ----- procedures -----

/dotted { [1 4] 0 setdash } def
/dashed { [5] 0 setdash } def
/solid  { [] 0 setdash } def

/max % result = MAX(arg1,arg2)
{
  /a exch def
  /b exch def
  a b gt {a} {b} ifelse
} def

/xoffset % result = MAX(0,(scalefactor-(boxwidth*cols+distx*(cols-1)))/2)
{
  0 scalefactor boxwidth cols mul distx cols 1 sub mul add sub 2 div max
} def

/cw % boxwidth = MAX(boxwidth, stringwidth(arg1))
{
  /str exch def
  /boxwidth boxwidth str stringwidth pop max def
} def

/box % draws a box with text `arg1' at grid pos (arg2,arg3)
{ gsave
  2 setlinewidth
  newpath
  exch xspacing mul xoffset add
  exch yspacing mul
  moveto
  boxwidth 0 rlineto 
  0 boxheight rlineto 
  boxwidth neg 0 rlineto 
  0 boxheight neg rlineto 
  closepath
  dup stringwidth pop neg boxwidth add 2 div
  boxheight fontheight 2 div sub 2 div
  rmoveto show stroke
  grestore
} def  

/mark
{ newpath
  exch xspacing mul xoffset add boxwidth add
  exch yspacing mul
  moveto
  0 boxheight 4 div rlineto
  boxheight neg 4 div boxheight neg 4 div rlineto
  closepath
  eofill
  stroke
} def

/arrow
{ newpath
  moveto
  3 -8 rlineto
  -6 0 rlineto
  3 8 rlineto
  closepath
  eofill
  stroke
} def

/out % draws an output connector for the block at (arg1,arg2)
{
  newpath
  exch xspacing mul xoffset add boxwidth 2 div add
  exch yspacing mul boxheight add
  /y exch def
  /x exch def
  x y moveto
  0 disty 2 div rlineto 
  stroke
  1 eq { x y disty 2 div add arrow } if
} def

/in % draws an input connector for the block at (arg1,arg2)
{
  newpath
  exch xspacing mul xoffset add boxwidth 2 div add
  exch yspacing mul disty 2 div sub
  /y exch def
  /x exch def
  x y moveto
  0 disty 2 div rlineto
  stroke
  1 eq { x y disty 2 div add arrow } if
} def

/hedge
{
  exch xspacing mul xoffset add boxwidth 2 div add
  exch yspacing mul boxheight 2 div sub
  /y exch def
  /x exch def
  newpath
  x y moveto
  boxwidth 2 div distx add 0 rlineto
  stroke
  1 eq
  { newpath x boxwidth 2 div distx add add y moveto
    -8 3 rlineto
    0 -6 rlineto
    8 3 rlineto
    closepath
    eofill
    stroke
  } if
} def

/vedge
{
  /ye exch def
  /ys exch def
  /xs exch def
  newpath
  xs xspacing mul xoffset add boxwidth 2 div add dup
  ys yspacing mul boxheight 2 div sub
  moveto
  ye yspacing mul boxheight 2 div sub
  lineto
  stroke
} def

/conn % connections the blocks from col `arg1' to `arg2' of row `arg3'
{
  /ys exch def
  /xe exch def
  /xs exch def
  newpath
  xs xspacing mul xoffset add boxwidth 2 div add
  ys yspacing mul disty 2 div sub
  moveto
  xspacing xe xs sub mul 0
  rlineto
  stroke
} def

% ----- main ------

boxfont setfont
1 boundaspect scale
(dlib::noncopyable) cw
(dlib::bayes_node) cw
(dlib::bayesian_network_gibbs_sampler) cw
(dlib::bayesian_network_join_tree) cw
(dlib::binned_vector_feature_image< feature_extractor, hash_function_type_ >) cw
(dlib::bridge) cw
(dlib::bsp_context) cw
(dlib::column_major_layout::layout< T, num_rows, num_cols, mem_manager, 1 >) cw
(dlib::column_major_layout::layout< T, num_rows, num_cols, mem_manager, 2 >) cw
(dlib::column_major_layout::layout< T, num_rows, num_cols, mem_manager, 3 >) cw
(dlib::column_major_layout::layout< T, num_rows, num_cols, mem_manager, 4 >) cw
(dlib::column_major_layout::layout< T, num_rows, num_cols, mem_manager, 5 >) cw
(dlib::conditional_probability_table) cw
(dlib::const_temp_matrix< EXP >) cw
(dlib::database) cw
(dlib::directed_graph_kernel_1< T, E, mem_manager, is_checked >) cw
(dlib::fine_hog_image< cell_size_, block_size_, pixel_stride_, num_orientation_bins_, gradient_type_ >) cw
(dlib::graph_kernel_1< T, E, mem_manager, is_checked >) cw
(dlib::hashed_feature_image< feature_extractor, hash_function_type_ >) cw
(dlib::hessian_pyramid) cw
(dlib::hog_image< cell_size_, block_size_, cell_stride_, num_orientation_bins_, gradient_type_, interpolation_type_ >) cw
(dlib::impl1::thread_safe_message_queue) cw
(dlib::impl::impl_bridge< transmit_pipe_type, receive_pipe_type >) cw
(dlib::impl::pyramid_down_2_1) cw
(dlib::impl::pyramid_down_3_2) cw
(dlib::integral_image_generic< T >) cw
(dlib::jpeg_loader) cw
(dlib::kkmeans< kernel_type >) cw
(dlib::locally_change_current_dir) cw
(dlib::mlp_kernel_1) cw
(dlib::nearest_neighbor_feature_image< feature_extractor >) cw
(dlib::perspective_display) cw
(dlib::perspective_window) cw
(dlib::png_loader) cw
(dlib::poly_image< Downsample >) cw
(dlib::pyramid_disable) cw
(dlib::pyramid_down< N >) cw
(dlib::row_major_layout::layout< T, num_rows, num_cols, mem_manager, 1 >) cw
(dlib::row_major_layout::layout< T, num_rows, num_cols, mem_manager, 2 >) cw
(dlib::row_major_layout::layout< T, num_rows, num_cols, mem_manager, 3 >) cw
(dlib::row_major_layout::layout< T, num_rows, num_cols, mem_manager, 4 >) cw
(dlib::row_major_layout::layout< T, num_rows, num_cols, mem_manager, 5 >) cw
(dlib::scan_fhog_pyramid< Pyramid_type, Feature_extractor_type >) cw
(dlib::scan_image_boxes< Feature_extractor_type, Box_generator >) cw
(dlib::scan_image_custom< Feature_extractor_type >) cw
(dlib::scan_image_pyramid< Pyramid_type, Feature_extractor_type >) cw
(dlib::scoped_ptr< T, deleter >) cw
(dlib::scoped_ptr< T[], deleter >) cw
(dlib::stack_based_memory_block< bSIZE >) cw
(dlib::statement) cw
(dlib::structural_object_detection_trainer< image_scanner_type >) cw
(dlib::structural_svm_assignment_problem< feature_extractor >) cw
(dlib::structural_svm_graph_labeling_problem< graph_type >) cw
(dlib::structural_svm_object_detection_problem< image_scanner_type, image_array_type >) cw
(dlib::structural_svm_sequence_labeling_problem< feature_extractor >) cw
(dlib::svm_struct_controller_node) cw
(dlib::svm_struct_processing_node) cw
(dlib::transaction) cw
(dlib::type_safe_union< T1, T2, T3, T4, T5, T6, T7, T8, T9, T10, T11, T12, T13, T14, T15, T16, T17, T18, T19, T20 >) cw
(dlib::scan_fhog_pyramid< Pyramid_type, feature_extractor_type >) cw
(dlib::scoped_ptr< base >) cw
(dlib::scoped_ptr< dlib::any::base >) cw
(dlib::scoped_ptr< dlib::any_decision_function::base >) cw
(dlib::scoped_ptr< dlib::any_trainer::base >) cw
(dlib::scoped_ptr< dlib::bayesian_network_join_tree_helpers::bnjt >) cw
(dlib::scoped_ptr< dlib::button_style >) cw
(dlib::scoped_ptr< dlib::connection >) cw
(dlib::scoped_ptr< dlib::impl::impl_bridge_base >) cw
(dlib::scoped_ptr< dlib::kcentroid< kernel_type > >) cw
(dlib::scoped_ptr< dlib::list_box_style >) cw
(dlib::scoped_ptr< dlib::listener >) cw
(dlib::scoped_ptr< dlib::menu_item >) cw
(dlib::scoped_ptr< dlib::scroll_bar_style >) cw
(dlib::scoped_ptr< dlib::scrollable_region_style >) cw
(dlib::scoped_ptr< dlib::sockstreambuf >) cw
(dlib::scoped_ptr< dlib::svm_struct_processing_node::base >) cw
(dlib::scoped_ptr< dlib::text_box_style >) cw
(dlib::scoped_ptr< dlib::text_field_style >) cw
(dlib::scoped_ptr< dlib::thread_function >) cw
(dlib::scoped_ptr< dlib::thread_function::base_funct >) cw
(dlib::scoped_ptr< dlib::timeout >) cw
(dlib::scoped_ptr< dlib::toggle_button_style >) cw
(dlib::scoped_ptr< dlib::tooltip::data >) cw
(dlib::scoped_ptr< LibpngData >) cw
(dlib::stack_based_memory_block< max_size >) cw
(dlib::stack_based_memory_block< sizeof(dlib::bfp1_helpers::bound_function_helper_T)>) cw
(dlib::stack_based_memory_block< sizeof(dlib::mfp_kernel_1_base_class::mp_impl_T)+1 >) cw
/boxwidth boxwidth marginwidth 2 mul add def
/xspacing boxwidth distx add def
/yspacing boxheight disty add def
/scalefactor 
  boxwidth cols mul distx cols 1 sub mul add
  boxheight rows mul disty rows 1 sub mul add boundaspect mul 
  max def
boundx scalefactor div boundy scalefactor div scale

% ----- classes -----

 (dlib::noncopyable) 0.000000 86.000000 box
 (dlib::bayes_node) 1.000000 85.000000 box
 (dlib::bayesian_network_gibbs_sampler) 1.000000 84.000000 box
 (dlib::bayesian_network_join_tree) 1.000000 83.000000 box
 (dlib::binned_vector_feature_image< feature_extractor, hash_function_type_ >) 1.000000 82.000000 box
 (dlib::bridge) 1.000000 81.000000 box
 (dlib::bsp_context) 1.000000 80.000000 box
 (dlib::column_major_layout::layout< T, num_rows, num_cols, mem_manager, 1 >) 1.000000 79.000000 box
 (dlib::column_major_layout::layout< T, num_rows, num_cols, mem_manager, 2 >) 1.000000 78.000000 box
 (dlib::column_major_layout::layout< T, num_rows, num_cols, mem_manager, 3 >) 1.000000 77.000000 box
 (dlib::column_major_layout::layout< T, num_rows, num_cols, mem_manager, 4 >) 1.000000 76.000000 box
 (dlib::column_major_layout::layout< T, num_rows, num_cols, mem_manager, 5 >) 1.000000 75.000000 box
 (dlib::conditional_probability_table) 1.000000 74.000000 box
 (dlib::const_temp_matrix< EXP >) 1.000000 73.000000 box
 (dlib::database) 1.000000 72.000000 box
 (dlib::directed_graph_kernel_1< T, E, mem_manager, is_checked >) 1.000000 71.000000 box
 (dlib::fine_hog_image< cell_size_, block_size_, pixel_stride_, num_orientation_bins_, gradient_type_ >) 1.000000 70.000000 box
 (dlib::graph_kernel_1< T, E, mem_manager, is_checked >) 1.000000 69.000000 box
 (dlib::hashed_feature_image< feature_extractor, hash_function_type_ >) 1.000000 68.000000 box
 (dlib::hessian_pyramid) 1.000000 67.000000 box
 (dlib::hog_image< cell_size_, block_size_, cell_stride_, num_orientation_bins_, gradient_type_, interpolation_type_ >) 1.000000 66.000000 box
 (dlib::impl1::thread_safe_message_queue) 1.000000 65.000000 box
 (dlib::impl::impl_bridge< transmit_pipe_type, receive_pipe_type >) 1.000000 64.000000 box
 (dlib::impl::pyramid_down_2_1) 1.000000 63.000000 box
1.000000 63.000000 mark
 (dlib::impl::pyramid_down_3_2) 1.000000 62.000000 box
1.000000 62.000000 mark
 (dlib::integral_image_generic< T >) 1.000000 61.000000 box
 (dlib::jpeg_loader) 1.000000 60.000000 box
 (dlib::kkmeans< kernel_type >) 1.000000 59.000000 box
 (dlib::locally_change_current_dir) 1.000000 58.000000 box
 (dlib::mlp_kernel_1) 1.000000 57.000000 box
 (dlib::nearest_neighbor_feature_image< feature_extractor >) 1.000000 56.000000 box
 (dlib::perspective_display) 1.000000 55.000000 box
 (dlib::perspective_window) 1.000000 54.000000 box
 (dlib::png_loader) 1.000000 53.000000 box
 (dlib::poly_image< Downsample >) 1.000000 52.000000 box
 (dlib::pyramid_disable) 1.000000 51.000000 box
1.000000 51.000000 mark
 (dlib::pyramid_down< N >) 1.000000 50.000000 box
 (dlib::row_major_layout::layout< T, num_rows, num_cols, mem_manager, 1 >) 1.000000 49.000000 box
 (dlib::row_major_layout::layout< T, num_rows, num_cols, mem_manager, 2 >) 1.000000 48.000000 box
 (dlib::row_major_layout::layout< T, num_rows, num_cols, mem_manager, 3 >) 1.000000 47.000000 box
 (dlib::row_major_layout::layout< T, num_rows, num_cols, mem_manager, 4 >) 1.000000 46.000000 box
 (dlib::row_major_layout::layout< T, num_rows, num_cols, mem_manager, 5 >) 1.000000 45.000000 box
 (dlib::scan_fhog_pyramid< Pyramid_type, Feature_extractor_type >) 1.000000 44.000000 box
 (dlib::scan_image_boxes< Feature_extractor_type, Box_generator >) 1.000000 43.000000 box
 (dlib::scan_image_custom< Feature_extractor_type >) 1.000000 42.000000 box
 (dlib::scan_image_pyramid< Pyramid_type, Feature_extractor_type >) 1.000000 41.000000 box
 (dlib::scoped_ptr< T, deleter >) 1.000000 40.000000 box
 (dlib::scoped_ptr< T[], deleter >) 1.000000 39.000000 box
 (dlib::stack_based_memory_block< bSIZE >) 1.000000 38.000000 box
 (dlib::statement) 1.000000 37.000000 box
 (dlib::structural_object_detection_trainer< image_scanner_type >) 1.000000 36.000000 box
 (dlib::structural_svm_assignment_problem< feature_extractor >) 1.000000 35.000000 box
 (dlib::structural_svm_graph_labeling_problem< graph_type >) 1.000000 34.000000 box
 (dlib::structural_svm_object_detection_problem< image_scanner_type, image_array_type >) 1.000000 33.000000 box
 (dlib::structural_svm_sequence_labeling_problem< feature_extractor >) 1.000000 32.000000 box
 (dlib::svm_struct_controller_node) 1.000000 31.000000 box
 (dlib::svm_struct_processing_node) 1.000000 30.000000 box
 (dlib::transaction) 1.000000 29.000000 box
 (dlib::type_safe_union< T1, T2, T3, T4, T5, T6, T7, T8, T9, T10, T11, T12, T13, T14, T15, T16, T17, T18, T19, T20 >) 1.000000 28.000000 box
 (dlib::scan_fhog_pyramid< Pyramid_type, feature_extractor_type >) 1.000000 27.000000 box
 (dlib::scoped_ptr< base >) 1.000000 26.000000 box
 (dlib::scoped_ptr< dlib::any::base >) 1.000000 25.000000 box
 (dlib::scoped_ptr< dlib::any_decision_function::base >) 1.000000 24.000000 box
 (dlib::scoped_ptr< dlib::any_trainer::base >) 1.000000 23.000000 box
 (dlib::scoped_ptr< dlib::bayesian_network_join_tree_helpers::bnjt >) 1.000000 22.000000 box
 (dlib::scoped_ptr< dlib::button_style >) 1.000000 21.000000 box
 (dlib::scoped_ptr< dlib::connection >) 1.000000 20.000000 box
 (dlib::scoped_ptr< dlib::impl::impl_bridge_base >) 1.000000 19.000000 box
 (dlib::scoped_ptr< dlib::kcentroid< kernel_type > >) 1.000000 18.000000 box
 (dlib::scoped_ptr< dlib::list_box_style >) 1.000000 17.000000 box
 (dlib::scoped_ptr< dlib::listener >) 1.000000 16.000000 box
 (dlib::scoped_ptr< dlib::menu_item >) 1.000000 15.000000 box
 (dlib::scoped_ptr< dlib::scroll_bar_style >) 1.000000 14.000000 box
 (dlib::scoped_ptr< dlib::scrollable_region_style >) 1.000000 13.000000 box
 (dlib::scoped_ptr< dlib::sockstreambuf >) 1.000000 12.000000 box
 (dlib::scoped_ptr< dlib::svm_struct_processing_node::base >) 1.000000 11.000000 box
 (dlib::scoped_ptr< dlib::text_box_style >) 1.000000 10.000000 box
 (dlib::scoped_ptr< dlib::text_field_style >) 1.000000 9.000000 box
 (dlib::scoped_ptr< dlib::thread_function >) 1.000000 8.000000 box
 (dlib::scoped_ptr< dlib::thread_function::base_funct >) 1.000000 7.000000 box
 (dlib::scoped_ptr< dlib::timeout >) 1.000000 6.000000 box
 (dlib::scoped_ptr< dlib::toggle_button_style >) 1.000000 5.000000 box
 (dlib::scoped_ptr< dlib::tooltip::data >) 1.000000 4.000000 box
 (dlib::scoped_ptr< LibpngData >) 1.000000 3.000000 box
 (dlib::stack_based_memory_block< max_size >) 1.000000 2.000000 box
 (dlib::stack_based_memory_block< sizeof(dlib::bfp1_helpers::bound_function_helper_T)>) 1.000000 1.000000 box
 (dlib::stack_based_memory_block< sizeof(dlib::mfp_kernel_1_base_class::mp_impl_T)+1 >) 1.000000 0.000000 box

% ----- relations -----

solid
1 0.000000 85.250000 out
dotted
0 0.000000 85.500000 hedge
dotted
0 0.000000 84.500000 hedge
dotted
0 0.000000 83.500000 hedge
dotted
0 0.000000 82.500000 hedge
dotted
0 0.000000 81.500000 hedge
dotted
0 0.000000 80.500000 hedge
dotted
0 0.000000 79.500000 hedge
dotted
0 0.000000 78.500000 hedge
dotted
0 0.000000 77.500000 hedge
dotted
0 0.000000 76.500000 hedge
dotted
0 0.000000 75.500000 hedge
dotted
0 0.000000 74.500000 hedge
dotted
0 0.000000 73.500000 hedge
dotted
0 0.000000 72.500000 hedge
dotted
0 0.000000 71.500000 hedge
dotted
0 0.000000 70.500000 hedge
dotted
0 0.000000 69.500000 hedge
dotted
0 0.000000 68.500000 hedge
dotted
0 0.000000 67.500000 hedge
dotted
0 0.000000 66.500000 hedge
dotted
0 0.000000 65.500000 hedge
dotted
0 0.000000 64.500000 hedge
dotted
0 0.000000 63.500000 hedge
dotted
0 0.000000 62.500000 hedge
dotted
0 0.000000 61.500000 hedge
dotted
0 0.000000 60.500000 hedge
solid
0 0.000000 59.500000 hedge
dotted
0 0.000000 58.500000 hedge
dotted
0 0.000000 57.500000 hedge
dotted
0 0.000000 56.500000 hedge
dotted
0 0.000000 55.500000 hedge
dotted
0 0.000000 54.500000 hedge
dotted
0 0.000000 53.500000 hedge
dotted
0 0.000000 52.500000 hedge
dotted
0 0.000000 51.500000 hedge
dotted
0 0.000000 50.500000 hedge
dotted
0 0.000000 49.500000 hedge
dotted
0 0.000000 48.500000 hedge
dotted
0 0.000000 47.500000 hedge
dotted
0 0.000000 46.500000 hedge
dotted
0 0.000000 45.500000 hedge
dotted
0 0.000000 44.500000 hedge
dotted
0 0.000000 43.500000 hedge
dotted
0 0.000000 42.500000 hedge
dotted
0 0.000000 41.500000 hedge
dotted
0 0.000000 40.500000 hedge
dotted
0 0.000000 39.500000 hedge
dotted
0 0.000000 38.500000 hedge
dotted
0 0.000000 37.500000 hedge
dotted
0 0.000000 36.500000 hedge
dotted
0 0.000000 35.500000 hedge
dotted
0 0.000000 34.500000 hedge
dotted
0 0.000000 33.500000 hedge
dotted
0 0.000000 32.500000 hedge
dotted
0 0.000000 31.500000 hedge
dotted
0 0.000000 30.500000 hedge
dotted
0 0.000000 29.500000 hedge
dotted
0 0.000000 28.500000 hedge
dotted
0 0.000000 27.500000 hedge
dotted
0 0.000000 26.500000 hedge
dotted
0 0.000000 25.500000 hedge
dotted
0 0.000000 24.500000 hedge
dotted
0 0.000000 23.500000 hedge
dotted
0 0.000000 22.500000 hedge
dotted
0 0.000000 21.500000 hedge
dotted
0 0.000000 20.500000 hedge
dotted
0 0.000000 19.500000 hedge
dotted
0 0.000000 18.500000 hedge
dotted
0 0.000000 17.500000 hedge
dotted
0 0.000000 16.500000 hedge
dotted
0 0.000000 15.500000 hedge
dotted
0 0.000000 14.500000 hedge
dotted
0 0.000000 13.500000 hedge
dotted
0 0.000000 12.500000 hedge
dotted
0 0.000000 11.500000 hedge
dotted
0 0.000000 10.500000 hedge
dotted
0 0.000000 9.500000 hedge
dotted
0 0.000000 8.500000 hedge
dotted
0 0.000000 7.500000 hedge
dotted
0 0.000000 6.500000 hedge
dotted
0 0.000000 5.500000 hedge
dotted
0 0.000000 4.500000 hedge
dotted
0 0.000000 3.500000 hedge
dotted
0 0.000000 2.500000 hedge
dotted
0 0.000000 1.500000 hedge
dotted
0 0.000000 0.500000 hedge
solid
0.000000 86.000000 0.500000 vedge
