[
    {
        "name": "Lazy Cows",
        "joke": "Cuáles son las vacas más perezosas? Vacaciones!"
    },
    {
        "name": "Bees in the Gym",
        "joke": "¿Qué hace una abeja en el gimnasio? Zumba!"
    },
    {
        "name": "Apple Stop",
        "joke": "Una manzana está esperando el autobús. Llega una banana y le pregunta:\n«¿Hace mucho que usted espera?»\nY la manzana responde:\n«No, yo siempre fui manzana.»"
    },
    {
        "name": "2 Nuns",
        "joke": "Era un grupo de chicos sentados en el banco y pasan 2 monjas. Dice uno «Las conozco, una tiene una heladería y otra tiene una joyería.» «¿Cómo sabes tú eso?» «Porque una es Sor Bete, y la otra Sor Tija.»"
    },
    {
        "name": "bitter wine",
        "joke": "¿Cuál es el vino más amargo?\nVino mi suegra"
    },
    {
        "name": "La nueva cocinera ",
        "joke": " A: La nueva cocinera es un sol.\nB: ¿Cocina bien?\nA: No, lo quema todo"
    },
    {
        "name": "Ora",
        "joke": "A: Padre, ¿qué puedo hacer por mis pecados?\nB: Ora, hijo mío, ora.\nA: Las once y media, padre."
    },
    {
        "name": "Pez Activity",
        "joke": "Un pez pregunta a su amigo,\n“¿Qué hace tu padre?”\nEl otro dice: (The other fish says:)\n“Nada.”"
    },
    {
        "name": "snake free",
        "joke": "– ¡Socorro, me ha picado una víbora!\n– ¿Cobra?\n– No, gratis."
    }
]
