%!PS-Adobe-2.0 EPSF-2.0
%%Title: ClassName
%%Creator: Doxygen
%%CreationDate: Time
%%For: 
%Magnification: 1.00
%%Orientation: Portrait
%%BoundingBox: 0 0 500 1059.907834
%%Pages: 0
%%BeginSetup
%%EndSetup
%%EndComments

% ----- variables -----

/boxwidth 0 def
/boxheight 40 def
/fontheight 24 def
/marginwidth 10 def
/distx 20 def
/disty 40 def
/boundaspect 0.471739 def  % aspect ratio of the BoundingBox (width/height)
/boundx 500 def
/boundy boundx boundaspect div def
/xspacing 0 def
/yspacing 0 def
/rows 46 def
/cols 2 def
/scalefactor 0 def
/boxfont /Times-Roman findfont fontheight scalefont def

% ----- procedures -----

/dotted { [1 4] 0 setdash } def
/dashed { [5] 0 setdash } def
/solid  { [] 0 setdash } def

/max % result = MAX(arg1,arg2)
{
  /a exch def
  /b exch def
  a b gt {a} {b} ifelse
} def

/xoffset % result = MAX(0,(scalefactor-(boxwidth*cols+distx*(cols-1)))/2)
{
  0 scalefactor boxwidth cols mul distx cols 1 sub mul add sub 2 div max
} def

/cw % boxwidth = MAX(boxwidth, stringwidth(arg1))
{
  /str exch def
  /boxwidth boxwidth str stringwidth pop max def
} def

/box % draws a box with text `arg1' at grid pos (arg2,arg3)
{ gsave
  2 setlinewidth
  newpath
  exch xspacing mul xoffset add
  exch yspacing mul
  moveto
  boxwidth 0 rlineto 
  0 boxheight rlineto 
  boxwidth neg 0 rlineto 
  0 boxheight neg rlineto 
  closepath
  dup stringwidth pop neg boxwidth add 2 div
  boxheight fontheight 2 div sub 2 div
  rmoveto show stroke
  grestore
} def  

/mark
{ newpath
  exch xspacing mul xoffset add boxwidth add
  exch yspacing mul
  moveto
  0 boxheight 4 div rlineto
  boxheight neg 4 div boxheight neg 4 div rlineto
  closepath
  eofill
  stroke
} def

/arrow
{ newpath
  moveto
  3 -8 rlineto
  -6 0 rlineto
  3 8 rlineto
  closepath
  eofill
  stroke
} def

/out % draws an output connector for the block at (arg1,arg2)
{
  newpath
  exch xspacing mul xoffset add boxwidth 2 div add
  exch yspacing mul boxheight add
  /y exch def
  /x exch def
  x y moveto
  0 disty 2 div rlineto 
  stroke
  1 eq { x y disty 2 div add arrow } if
} def

/in % draws an input connector for the block at (arg1,arg2)
{
  newpath
  exch xspacing mul xoffset add boxwidth 2 div add
  exch yspacing mul disty 2 div sub
  /y exch def
  /x exch def
  x y moveto
  0 disty 2 div rlineto
  stroke
  1 eq { x y disty 2 div add arrow } if
} def

/hedge
{
  exch xspacing mul xoffset add boxwidth 2 div add
  exch yspacing mul boxheight 2 div sub
  /y exch def
  /x exch def
  newpath
  x y moveto
  boxwidth 2 div distx add 0 rlineto
  stroke
  1 eq
  { newpath x boxwidth 2 div distx add add y moveto
    -8 3 rlineto
    0 -6 rlineto
    8 3 rlineto
    closepath
    eofill
    stroke
  } if
} def

/vedge
{
  /ye exch def
  /ys exch def
  /xs exch def
  newpath
  xs xspacing mul xoffset add boxwidth 2 div add dup
  ys yspacing mul boxheight 2 div sub
  moveto
  ye yspacing mul boxheight 2 div sub
  lineto
  stroke
} def

/conn % connections the blocks from col `arg1' to `arg2' of row `arg3'
{
  /ys exch def
  /xe exch def
  /xs exch def
  newpath
  xs xspacing mul xoffset add boxwidth 2 div add
  ys yspacing mul disty 2 div sub
  moveto
  xspacing xe xs sub mul 0
  rlineto
  stroke
} def

% ----- main ------

boxfont setfont
1 boundaspect scale
(dlib::matrix_exp< EXP >) cw
(dlib::matrix_diag_exp< EXP >) cw
(dlib::matrix< double >) cw
(dlib::matrix< double, 0, 0, mem_manager_type >) cw
(dlib::matrix< double, 0, 1 >) cw
(dlib::matrix< double, 0, 1, mem_manager_type >) cw
(dlib::matrix< double, 1 >) cw
(dlib::matrix< double, 2, 2 >) cw
(dlib::matrix< double, 3, 3 >) cw
(dlib::matrix< double, 64, 1 >) cw
(dlib::matrix< double, block_size *block_size *num_orientation_bins, 1 >) cw
(dlib::matrix< double, I, 1 >) cw
(dlib::matrix< double, measurements, measurements >) cw
(dlib::matrix< double, measurements, states >) cw
(dlib::matrix< double, S, 1 >) cw
(dlib::matrix< double, S, I >) cw
(dlib::matrix< double, S, S >) cw
(dlib::matrix< double, states, 1 >) cw
(dlib::matrix< double, states, states >) cw
(dlib::matrix< edge_type, 0, 2 >) cw
(dlib::matrix< edge_type, 0, max_number_of_neighbors >) cw
(dlib::matrix< float, 0, 1 >) cw
(dlib::matrix< int32 >) cw
(dlib::matrix< long, 0, 1 >) cw
(dlib::matrix< long, NR, 1, mem_manager_type, layout_type >) cw
(dlib::matrix< qc_scalar_type, 0, 1 >) cw
(dlib::matrix< qc_scalar_type, dims, dims >) cw
(dlib::matrix< sample_type, 0, 1, mem_manager_type >) cw
(dlib::matrix< scalar_type >) cw
(dlib::matrix< scalar_type, 0, 0, mem_manager_type >) cw
(dlib::matrix< scalar_type, 0, 0, mem_manager_type, layout_type >) cw
(dlib::matrix< scalar_type, 0, 1 >) cw
(dlib::matrix< scalar_type, 0, 1, mem_manager_type >) cw
(dlib::matrix< scalar_type, 0, 1, mem_manager_type, layout_type >) cw
(dlib::matrix< scalar_type, 1, 0, mem_manager_type >) cw
(dlib::matrix< std::complex< double > >) cw
(dlib::matrix< std::complex< double >, 0, 1 >) cw
(dlib::matrix< T, NR, NC, mm, l >) cw
(dlib::matrix< type, 0, 0, mem_manager_type, dlib::column_major_layout >) cw
(dlib::matrix< type, 0, 0, mem_manager_type, layout_type >) cw
(dlib::matrix< type, 0, 1, mem_manager_type, column_major_layout >) cw
(dlib::matrix< type, 0, 1, mem_manager_type, layout_type >) cw
(dlib::matrix< type, 0, 1, typename M::mem_manager_type >) cw
(dlib::matrix< type, 0, NR, mem_manager_type, layout_type >) cw
(dlib::matrix< type, NR, 1, mem_manager_type, layout_type >) cw
(dlib::matrix< type, NR, NR, mem_manager_type, layout_type >) cw
/boxwidth boxwidth marginwidth 2 mul add def
/xspacing boxwidth distx add def
/yspacing boxheight disty add def
/scalefactor 
  boxwidth cols mul distx cols 1 sub mul add
  boxheight rows mul disty rows 1 sub mul add boundaspect mul 
  max def
boundx scalefactor div boundy scalefactor div scale

% ----- classes -----

 (dlib::matrix_exp< EXP >) 0.000000 45.000000 box
 (dlib::matrix_diag_exp< EXP >) 1.000000 44.000000 box
 (dlib::matrix< double >) 1.000000 43.000000 box
 (dlib::matrix< double, 0, 0, mem_manager_type >) 1.000000 42.000000 box
 (dlib::matrix< double, 0, 1 >) 1.000000 41.000000 box
 (dlib::matrix< double, 0, 1, mem_manager_type >) 1.000000 40.000000 box
 (dlib::matrix< double, 1 >) 1.000000 39.000000 box
 (dlib::matrix< double, 2, 2 >) 1.000000 38.000000 box
 (dlib::matrix< double, 3, 3 >) 1.000000 37.000000 box
 (dlib::matrix< double, 64, 1 >) 1.000000 36.000000 box
 (dlib::matrix< double, block_size *block_size *num_orientation_bins, 1 >) 1.000000 35.000000 box
 (dlib::matrix< double, I, 1 >) 1.000000 34.000000 box
 (dlib::matrix< double, measurements, measurements >) 1.000000 33.000000 box
 (dlib::matrix< double, measurements, states >) 1.000000 32.000000 box
 (dlib::matrix< double, S, 1 >) 1.000000 31.000000 box
 (dlib::matrix< double, S, I >) 1.000000 30.000000 box
 (dlib::matrix< double, S, S >) 1.000000 29.000000 box
 (dlib::matrix< double, states, 1 >) 1.000000 28.000000 box
 (dlib::matrix< double, states, states >) 1.000000 27.000000 box
 (dlib::matrix< edge_type, 0, 2 >) 1.000000 26.000000 box
 (dlib::matrix< edge_type, 0, max_number_of_neighbors >) 1.000000 25.000000 box
 (dlib::matrix< float, 0, 1 >) 1.000000 24.000000 box
 (dlib::matrix< int32 >) 1.000000 23.000000 box
 (dlib::matrix< long, 0, 1 >) 1.000000 22.000000 box
 (dlib::matrix< long, NR, 1, mem_manager_type, layout_type >) 1.000000 21.000000 box
 (dlib::matrix< qc_scalar_type, 0, 1 >) 1.000000 20.000000 box
 (dlib::matrix< qc_scalar_type, dims, dims >) 1.000000 19.000000 box
 (dlib::matrix< sample_type, 0, 1, mem_manager_type >) 1.000000 18.000000 box
 (dlib::matrix< scalar_type >) 1.000000 17.000000 box
 (dlib::matrix< scalar_type, 0, 0, mem_manager_type >) 1.000000 16.000000 box
 (dlib::matrix< scalar_type, 0, 0, mem_manager_type, layout_type >) 1.000000 15.000000 box
 (dlib::matrix< scalar_type, 0, 1 >) 1.000000 14.000000 box
 (dlib::matrix< scalar_type, 0, 1, mem_manager_type >) 1.000000 13.000000 box
 (dlib::matrix< scalar_type, 0, 1, mem_manager_type, layout_type >) 1.000000 12.000000 box
 (dlib::matrix< scalar_type, 1, 0, mem_manager_type >) 1.000000 11.000000 box
 (dlib::matrix< std::complex< double > >) 1.000000 10.000000 box
 (dlib::matrix< std::complex< double >, 0, 1 >) 1.000000 9.000000 box
 (dlib::matrix< T, NR, NC, mm, l >) 1.000000 8.000000 box
 (dlib::matrix< type, 0, 0, mem_manager_type, dlib::column_major_layout >) 1.000000 7.000000 box
 (dlib::matrix< type, 0, 0, mem_manager_type, layout_type >) 1.000000 6.000000 box
 (dlib::matrix< type, 0, 1, mem_manager_type, column_major_layout >) 1.000000 5.000000 box
 (dlib::matrix< type, 0, 1, mem_manager_type, layout_type >) 1.000000 4.000000 box
 (dlib::matrix< type, 0, 1, typename M::mem_manager_type >) 1.000000 3.000000 box
 (dlib::matrix< type, 0, NR, mem_manager_type, layout_type >) 1.000000 2.000000 box
 (dlib::matrix< type, NR, 1, mem_manager_type, layout_type >) 1.000000 1.000000 box
 (dlib::matrix< type, NR, NR, mem_manager_type, layout_type >) 1.000000 0.000000 box

% ----- relations -----

solid
1 0.000000 44.250000 out
solid
0 0.000000 44.500000 hedge
solid
0 0.000000 43.500000 hedge
solid
0 0.000000 42.500000 hedge
solid
0 0.000000 41.500000 hedge
solid
0 0.000000 40.500000 hedge
solid
0 0.000000 39.500000 hedge
solid
0 0.000000 38.500000 hedge
solid
0 0.000000 37.500000 hedge
solid
0 0.000000 36.500000 hedge
solid
0 0.000000 35.500000 hedge
solid
0 0.000000 34.500000 hedge
solid
0 0.000000 33.500000 hedge
solid
0 0.000000 32.500000 hedge
solid
0 0.000000 31.500000 hedge
solid
0 0.000000 30.500000 hedge
solid
0 0.000000 29.500000 hedge
solid
0 0.000000 28.500000 hedge
solid
0 0.000000 27.500000 hedge
solid
0 0.000000 26.500000 hedge
solid
0 0.000000 25.500000 hedge
solid
0 0.000000 24.500000 hedge
solid
0 0.000000 23.500000 hedge
solid
0 0.000000 22.500000 hedge
solid
0 0.000000 21.500000 hedge
solid
0 0.000000 20.500000 hedge
solid
0 0.000000 19.500000 hedge
solid
0 0.000000 18.500000 hedge
solid
0 0.000000 17.500000 hedge
solid
0 0.000000 16.500000 hedge
solid
0 0.000000 15.500000 hedge
solid
0 0.000000 14.500000 hedge
solid
0 0.000000 13.500000 hedge
solid
0 0.000000 12.500000 hedge
solid
0 0.000000 11.500000 hedge
solid
0 0.000000 10.500000 hedge
solid
0 0.000000 9.500000 hedge
solid
0 0.000000 8.500000 hedge
solid
0 0.000000 7.500000 hedge
solid
0 0.000000 6.500000 hedge
solid
0 0.000000 5.500000 hedge
solid
0 0.000000 4.500000 hedge
solid
0 0.000000 3.500000 hedge
solid
0 0.000000 2.500000 hedge
solid
0 0.000000 1.500000 hedge
solid
0 0.000000 0.500000 hedge
solid
0.000000 45.000000 0.500000 vedge
