%!PS-Adobe-2.0 EPSF-2.0
%%Title: ClassName
%%Creator: Doxygen
%%CreationDate: Time
%%For: 
%Magnification: 1.00
%%Orientation: Portrait
%%BoundingBox: 0 0 500 592.334495
%%Pages: 0
%%BeginSetup
%%EndSetup
%%EndComments

% ----- variables -----

/boxwidth 0 def
/boxheight 40 def
/fontheight 24 def
/marginwidth 10 def
/distx 20 def
/disty 40 def
/boundaspect 0.844118 def  % aspect ratio of the BoundingBox (width/height)
/boundx 500 def
/boundy boundx boundaspect div def
/xspacing 0 def
/yspacing 0 def
/rows 51 def
/cols 2 def
/scalefactor 0 def
/boxfont /Times-Roman findfont fontheight scalefont def

% ----- procedures -----

/dotted { [1 4] 0 setdash } def
/dashed { [5] 0 setdash } def
/solid  { [] 0 setdash } def

/max % result = MAX(arg1,arg2)
{
  /a exch def
  /b exch def
  a b gt {a} {b} ifelse
} def

/xoffset % result = MAX(0,(scalefactor-(boxwidth*cols+distx*(cols-1)))/2)
{
  0 scalefactor boxwidth cols mul distx cols 1 sub mul add sub 2 div max
} def

/cw % boxwidth = MAX(boxwidth, stringwidth(arg1))
{
  /str exch def
  /boxwidth boxwidth str stringwidth pop max def
} def

/box % draws a box with text `arg1' at grid pos (arg2,arg3)
{ gsave
  2 setlinewidth
  newpath
  exch xspacing mul xoffset add
  exch yspacing mul
  moveto
  boxwidth 0 rlineto 
  0 boxheight rlineto 
  boxwidth neg 0 rlineto 
  0 boxheight neg rlineto 
  closepath
  dup stringwidth pop neg boxwidth add 2 div
  boxheight fontheight 2 div sub 2 div
  rmoveto show stroke
  grestore
} def  

/mark
{ newpath
  exch xspacing mul xoffset add boxwidth add
  exch yspacing mul
  moveto
  0 boxheight 4 div rlineto
  boxheight neg 4 div boxheight neg 4 div rlineto
  closepath
  eofill
  stroke
} def

/arrow
{ newpath
  moveto
  3 -8 rlineto
  -6 0 rlineto
  3 8 rlineto
  closepath
  eofill
  stroke
} def

/out % draws an output connector for the block at (arg1,arg2)
{
  newpath
  exch xspacing mul xoffset add boxwidth 2 div add
  exch yspacing mul boxheight add
  /y exch def
  /x exch def
  x y moveto
  0 disty 2 div rlineto 
  stroke
  1 eq { x y disty 2 div add arrow } if
} def

/in % draws an input connector for the block at (arg1,arg2)
{
  newpath
  exch xspacing mul xoffset add boxwidth 2 div add
  exch yspacing mul disty 2 div sub
  /y exch def
  /x exch def
  x y moveto
  0 disty 2 div rlineto
  stroke
  1 eq { x y disty 2 div add arrow } if
} def

/hedge
{
  exch xspacing mul xoffset add boxwidth 2 div add
  exch yspacing mul boxheight 2 div sub
  /y exch def
  /x exch def
  newpath
  x y moveto
  boxwidth 2 div distx add 0 rlineto
  stroke
  1 eq
  { newpath x boxwidth 2 div distx add add y moveto
    -8 3 rlineto
    0 -6 rlineto
    8 3 rlineto
    closepath
    eofill
    stroke
  } if
} def

/vedge
{
  /ye exch def
  /ys exch def
  /xs exch def
  newpath
  xs xspacing mul xoffset add boxwidth 2 div add dup
  ys yspacing mul boxheight 2 div sub
  moveto
  ye yspacing mul boxheight 2 div sub
  lineto
  stroke
} def

/conn % connections the blocks from col `arg1' to `arg2' of row `arg3'
{
  /ys exch def
  /xe exch def
  /xs exch def
  newpath
  xs xspacing mul xoffset add boxwidth 2 div add
  ys yspacing mul disty 2 div sub
  moveto
  xspacing xe xs sub mul 0
  rlineto
  stroke
} def

% ----- main ------

boxfont setfont
1 boundaspect scale
(dlib::error) cw
(exception) cw
(dlib::base64::decode_error) cw
(dlib::bobyqa_failure) cw
(dlib::cast_to_string_error) cw
(dlib::cmd_line_parser_check_1< clp_base >::cmd_line_check_error) cw
(dlib::cmd_line_parser_kernel_1< charT, map, sequence, sequence2 >::cmd_line_parse_error) cw
(dlib::compress_stream_kernel_1< fce, fcd, crc32 >::decompression_error) cw
(dlib::compress_stream_kernel_2< fce, fcd, lz77_buffer, sliding_buffer, fce_length, fcd_length, fce_index, fcd_index, crc32 >::decompression_error) cw
(dlib::compress_stream_kernel_3< lzp_buf, crc32, buffer_size >::decompression_error) cw
(dlib::config_reader_kernel_1< map_string_string, map_string_void, tokenizer >::config_reader_access_error) cw
(dlib::config_reader_kernel_1< map_string_string, map_string_void, tokenizer >::config_reader_error) cw
(dlib::config_reader_kernel_1< map_string_string, map_string_void, tokenizer >::file_not_found) cw
(dlib::cross_validation_error) cw
(dlib::dir_create_error) cw
(dlib::dir_create_error) cw
(dlib::directory::dir_not_found) cw
(dlib::directory::dir_not_found) cw
(dlib::directory::listing_error) cw
(dlib::directory::listing_error) cw
(dlib::discriminant_pca< matrix_type >::discriminant_pca_error) cw
(dlib::empirical_kernel_map< kern_type >::empirical_kernel_map_error) cw
(dlib::fatal_error) cw
(dlib::file::file_not_found) cw
(dlib::file::file_not_found) cw
(dlib::gui_error) cw
(dlib::http_parse_error) cw
(dlib::image_hash_construction_failure) cw
(dlib::image_load_error) cw
(dlib::image_save_error) cw
(dlib::impossible_labeling_error) cw
(dlib::invalid_network_address) cw
(dlib::invalid_nu_error) cw
(dlib::invalid_qp3_error) cw
(dlib::invalid_utf8_error) cw
(dlib::logger_config_file_error) cw
(dlib::one_vs_all_trainer< any_trainer, label_type_ >::invalid_label) cw
(dlib::one_vs_one_trainer< any_trainer, label_type_ >::invalid_label) cw
(dlib::optimize_single_variable_failure) cw
(dlib::option_parse_error) cw
(dlib::parse_tree_to_string_error) cw
(dlib::sample_data_io_error) cw
(dlib::serialization_error) cw
(dlib::set_current_dir_error) cw
(dlib::set_current_dir_error) cw
(dlib::socket_error) cw
(dlib::sqlite_error) cw
(dlib::string_cast_error) cw
(dlib::svm_struct_controller_node::invalid_problem) cw
(dlib::thread_error) cw
(dlib::xml_parse_error) cw
/boxwidth boxwidth marginwidth 2 mul add def
/xspacing boxwidth distx add def
/yspacing boxheight disty add def
/scalefactor 
  boxwidth cols mul distx cols 1 sub mul add
  boxheight rows mul disty rows 1 sub mul add boundaspect mul 
  max def
boundx scalefactor div boundy scalefactor div scale

% ----- classes -----

 (dlib::error) 0.000000 49.000000 box
 (exception) 0.000000 50.000000 box
 (dlib::base64::decode_error) 1.000000 48.000000 box
 (dlib::bobyqa_failure) 1.000000 47.000000 box
 (dlib::cast_to_string_error) 1.000000 46.000000 box
 (dlib::cmd_line_parser_check_1< clp_base >::cmd_line_check_error) 1.000000 45.000000 box
 (dlib::cmd_line_parser_kernel_1< charT, map, sequence, sequence2 >::cmd_line_parse_error) 1.000000 44.000000 box
 (dlib::compress_stream_kernel_1< fce, fcd, crc32 >::decompression_error) 1.000000 43.000000 box
 (dlib::compress_stream_kernel_2< fce, fcd, lz77_buffer, sliding_buffer, fce_length, fcd_length, fce_index, fcd_index, crc32 >::decompression_error) 1.000000 42.000000 box
 (dlib::compress_stream_kernel_3< lzp_buf, crc32, buffer_size >::decompression_error) 1.000000 41.000000 box
 (dlib::config_reader_kernel_1< map_string_string, map_string_void, tokenizer >::config_reader_access_error) 1.000000 40.000000 box
 (dlib::config_reader_kernel_1< map_string_string, map_string_void, tokenizer >::config_reader_error) 1.000000 39.000000 box
 (dlib::config_reader_kernel_1< map_string_string, map_string_void, tokenizer >::file_not_found) 1.000000 38.000000 box
 (dlib::cross_validation_error) 1.000000 37.000000 box
 (dlib::dir_create_error) 1.000000 36.000000 box
 (dlib::dir_create_error) 1.000000 35.000000 box
 (dlib::directory::dir_not_found) 1.000000 34.000000 box
 (dlib::directory::dir_not_found) 1.000000 33.000000 box
 (dlib::directory::listing_error) 1.000000 32.000000 box
 (dlib::directory::listing_error) 1.000000 31.000000 box
 (dlib::discriminant_pca< matrix_type >::discriminant_pca_error) 1.000000 30.000000 box
 (dlib::empirical_kernel_map< kern_type >::empirical_kernel_map_error) 1.000000 29.000000 box
 (dlib::fatal_error) 1.000000 28.000000 box
 (dlib::file::file_not_found) 1.000000 27.000000 box
 (dlib::file::file_not_found) 1.000000 26.000000 box
 (dlib::gui_error) 1.000000 25.000000 box
 (dlib::http_parse_error) 1.000000 24.000000 box
 (dlib::image_hash_construction_failure) 1.000000 23.000000 box
 (dlib::image_load_error) 1.000000 22.000000 box
 (dlib::image_save_error) 1.000000 21.000000 box
 (dlib::impossible_labeling_error) 1.000000 20.000000 box
 (dlib::invalid_network_address) 1.000000 19.000000 box
 (dlib::invalid_nu_error) 1.000000 18.000000 box
 (dlib::invalid_qp3_error) 1.000000 17.000000 box
 (dlib::invalid_utf8_error) 1.000000 16.000000 box
 (dlib::logger_config_file_error) 1.000000 15.000000 box
 (dlib::one_vs_all_trainer< any_trainer, label_type_ >::invalid_label) 1.000000 14.000000 box
 (dlib::one_vs_one_trainer< any_trainer, label_type_ >::invalid_label) 1.000000 13.000000 box
 (dlib::optimize_single_variable_failure) 1.000000 12.000000 box
 (dlib::option_parse_error) 1.000000 11.000000 box
 (dlib::parse_tree_to_string_error) 1.000000 10.000000 box
 (dlib::sample_data_io_error) 1.000000 9.000000 box
 (dlib::serialization_error) 1.000000 8.000000 box
 (dlib::set_current_dir_error) 1.000000 7.000000 box
 (dlib::set_current_dir_error) 1.000000 6.000000 box
 (dlib::socket_error) 1.000000 5.000000 box
 (dlib::sqlite_error) 1.000000 4.000000 box
 (dlib::string_cast_error) 1.000000 3.000000 box
 (dlib::svm_struct_controller_node::invalid_problem) 1.000000 2.000000 box
 (dlib::thread_error) 1.000000 1.000000 box
 (dlib::xml_parse_error) 1.000000 0.000000 box

% ----- relations -----

solid
0 0.000000 49.000000 out
solid
1 0.000000 50.000000 in
solid
1 0.000000 48.250000 out
solid
0 0.000000 48.500000 hedge
solid
0 0.000000 47.500000 hedge
solid
0 0.000000 46.500000 hedge
solid
0 0.000000 45.500000 hedge
solid
0 0.000000 44.500000 hedge
solid
0 0.000000 43.500000 hedge
solid
0 0.000000 42.500000 hedge
solid
0 0.000000 41.500000 hedge
solid
0 0.000000 40.500000 hedge
solid
0 0.000000 39.500000 hedge
solid
0 0.000000 38.500000 hedge
solid
0 0.000000 37.500000 hedge
solid
0 0.000000 36.500000 hedge
solid
0 0.000000 35.500000 hedge
solid
0 0.000000 34.500000 hedge
solid
0 0.000000 33.500000 hedge
solid
0 0.000000 32.500000 hedge
solid
0 0.000000 31.500000 hedge
solid
0 0.000000 30.500000 hedge
solid
0 0.000000 29.500000 hedge
solid
0 0.000000 28.500000 hedge
solid
0 0.000000 27.500000 hedge
solid
0 0.000000 26.500000 hedge
solid
0 0.000000 25.500000 hedge
solid
0 0.000000 24.500000 hedge
solid
0 0.000000 23.500000 hedge
solid
0 0.000000 22.500000 hedge
solid
0 0.000000 21.500000 hedge
solid
0 0.000000 20.500000 hedge
solid
0 0.000000 19.500000 hedge
solid
0 0.000000 18.500000 hedge
solid
0 0.000000 17.500000 hedge
solid
0 0.000000 16.500000 hedge
solid
0 0.000000 15.500000 hedge
solid
0 0.000000 14.500000 hedge
solid
0 0.000000 13.500000 hedge
solid
0 0.000000 12.500000 hedge
solid
0 0.000000 11.500000 hedge
solid
0 0.000000 10.500000 hedge
solid
0 0.000000 9.500000 hedge
solid
0 0.000000 8.500000 hedge
solid
0 0.000000 7.500000 hedge
solid
0 0.000000 6.500000 hedge
solid
0 0.000000 5.500000 hedge
solid
0 0.000000 4.500000 hedge
solid
0 0.000000 3.500000 hedge
solid
0 0.000000 2.500000 hedge
solid
0 0.000000 1.500000 hedge
solid
0 0.000000 0.500000 hedge
solid
0.000000 49.000000 0.500000 vedge
