{
  "images" : [
    {
      "idiom" : "universal",
      "filename" : "little-header-card-kissou.png",
      "scale" : "1x"
    },
    {
      "idiom" : "universal",
      "filename" : "little-header-card-kissou@2x.png",
      "scale" : "2x"
    },
    {
      "idiom" : "universal",
      "filename" : "little-header-card-kissou@3x.png",
      "scale" : "3x"
    }
  ],
  "info" : {
    "version" : 1,
    "author" : "xcode"
  }
}