{'data_path': './data', 'outf': 'yelp_example', 'load_vocab': '', 'vocab_size': 30000, 'maxlen': 25, 'lowercase': True, 'emsize': 128, 'nhidden': 128, 'nlayers': 1, 'noise_r': 0.1, 'noise_anneal': 0.9995, 'hidden_init': False, 'arch_g': '128-128', 'arch_d': '128-128', 'arch_classify': '128-128', 'z_size': 32, 'temp': 1, 'dropout': 0.0, 'epochs': 25, 'batch_size': 64, 'niters_ae': 1, 'niters_gan_d': 5, 'niters_gan_g': 1, 'niters_gan_ae': 1, 'niters_gan_schedule': '', 'lr_ae': 1, 'lr_gan_g': 0.0001, 'lr_gan_d': 0.0001, 'lr_classify': 0.0001, 'beta1': 0.5, 'clip': 1, 'gan_gp_lambda': 0.1, 'grad_lambda': 0.01, 'lambda_class': 1, 'sample': False, 'log_interval': 200, 'seed': 1111, 'cuda': True, 'device_id': '0', 'ntokens': 30004}

Training...
