nohup: ignoring input
/student/zhh412/home/miniconda3/envs/DAST_env/lib/python3.6/site-packages/tensorflow/python/framework/dtypes.py:523: FutureWarning: Passing (type, 1) or '1type' as a synonym of type is deprecated; in a future version of numpy, it will be understood as (type, (1,)) / '(1,)type'.
  _np_qint8 = np.dtype([("qint8", np.int8, 1)])
/student/zhh412/home/miniconda3/envs/DAST_env/lib/python3.6/site-packages/tensorflow/python/framework/dtypes.py:524: FutureWarning: Passing (type, 1) or '1type' as a synonym of type is deprecated; in a future version of numpy, it will be understood as (type, (1,)) / '(1,)type'.
  _np_quint8 = np.dtype([("quint8", np.uint8, 1)])
/student/zhh412/home/miniconda3/envs/DAST_env/lib/python3.6/site-packages/tensorflow/python/framework/dtypes.py:525: FutureWarning: Passing (type, 1) or '1type' as a synonym of type is deprecated; in a future version of numpy, it will be understood as (type, (1,)) / '(1,)type'.
  _np_qint16 = np.dtype([("qint16", np.int16, 1)])
/student/zhh412/home/miniconda3/envs/DAST_env/lib/python3.6/site-packages/tensorflow/python/framework/dtypes.py:526: FutureWarning: Passing (type, 1) or '1type' as a synonym of type is deprecated; in a future version of numpy, it will be understood as (type, (1,)) / '(1,)type'.
  _np_quint16 = np.dtype([("quint16", np.uint16, 1)])
/student/zhh412/home/miniconda3/envs/DAST_env/lib/python3.6/site-packages/tensorflow/python/framework/dtypes.py:527: FutureWarning: Passing (type, 1) or '1type' as a synonym of type is deprecated; in a future version of numpy, it will be understood as (type, (1,)) / '(1,)type'.
  _np_qint32 = np.dtype([("qint32", np.int32, 1)])
/student/zhh412/home/miniconda3/envs/DAST_env/lib/python3.6/site-packages/tensorflow/python/framework/dtypes.py:532: FutureWarning: Passing (type, 1) or '1type' as a synonym of type is deprecated; in a future version of numpy, it will be understood as (type, (1,)) / '(1,)type'.
  np_resource = np.dtype([("resource", np.ubyte, 1)])
=> creating logs/DASTC
------------------------------------------------
Namespace(alpha=0.0, batch_size=64, beam=1, confidence=0.8, dataDir='data', dataset='GYAFC', dim_d=50, dim_emb=100, dim_y=200, dim_z=500, domain_adapt=True, domain_classifier_path='save_model/classifier/filter_imdb_GYAFC_domain_adapt', dropout_rate=0.5, filter_sizes='1,2,3,4,5', gamma_decay=1, gamma_init=0.1, gamma_min=0.1, learning_rate=0.0005, load_model=False, logDir='logs/DASTC/', max_epochs=20, max_len=20, modelDir='save_model', multi_vocab='data/filter_imdb_GYAFC_multi_vocab', n_filters=128, n_layers=1, network='DASTC', noise_word=False, online_test=False, order_data=False, pretrain_epochs=10, rho=1, save_model=False, save_samples=False, source_classifier_path='save_model/classifier/filter_imdb', source_dataset='filter_imdb', source_test_path='data/filter_imdb/test', source_train_path='data/filter_imdb/train', source_training_portion=1.0, source_valid_path='data/filter_imdb/valid', source_vocab='data/filter_imdb/vocab', styler_path='save_model/domain_adapt_styler', suffix='DASTC__2020-03-02-16-00', target_classifier_path='save_model/classifier/GYAFC', target_test_path='data/GYAFC/test', target_train_path='data/GYAFC/train', target_valid_path='data/GYAFC/valid', target_vocab='data/GYAFC/vocab', train_checkpoint_frequency=4, training_portion=0.1, trim_padding=False)
------------------------------------------------
vocabulary size: 31270
loading target dataset: GYAFC
train file has 51967 positive unique sentences.
train file has 51967 negative unique sentences.
train file has 103934 total unique sentences.
valid file has 2247 positive unique sentences.
valid file has 2788 negative unique sentences.
valid file has 5035 total unique sentences.
test file has 1019 positive unique sentences.
test file has 1332 negative unique sentences.
test file has 2351 total unique sentences.
loading source dataset: filter_imdb
train file has 181432 positive unique sentences.
train file has 162742 negative unique sentences.
train file has 344174 total unique sentences.
valid file has 14965 positive unique sentences.
valid file has 12564 negative unique sentences.
valid file has 27529 total unique sentences.
test file has 14965 positive unique sentences.
test file has 12564 negative unique sentences.
test file has 27529 total unique sentences.
2020-03-02 16:01:03.983690: I tensorflow/core/platform/cpu_feature_guard.cc:141] Your CPU supports instructions that this TensorFlow binary was not compiled to use: SSE4.1 SSE4.2 AVX AVX2 AVX512F FMA
2020-03-02 16:01:06.480593: I tensorflow/core/common_runtime/gpu/gpu_device.cc:1432] Found device 0 with properties: 
name: GeForce RTX 2080 Ti major: 7 minor: 5 memoryClockRate(GHz): 1.545
pciBusID: 0000:67:00.0
totalMemory: 10.76GiB freeMemory: 10.60GiB
2020-03-02 16:01:06.480622: I tensorflow/core/common_runtime/gpu/gpu_device.cc:1511] Adding visible gpu devices: 0
2020-03-02 16:01:06.700327: I tensorflow/core/common_runtime/gpu/gpu_device.cc:982] Device interconnect StreamExecutor with strength 1 edge matrix:
2020-03-02 16:01:06.700364: I tensorflow/core/common_runtime/gpu/gpu_device.cc:988]      0 
2020-03-02 16:01:06.700370: I tensorflow/core/common_runtime/gpu/gpu_device.cc:1001] 0:   N 
2020-03-02 16:01:06.700452: I tensorflow/core/common_runtime/gpu/gpu_device.cc:1115] Created TensorFlow device (/job:localhost/replica:0/task:0/device:GPU:0 with 10232 MB memory) -> physical GPU (device: 0, name: GeForce RTX 2080 Ti, pci bus id: 0000:67:00.0, compute capability: 7.5)
-----Creating styler model with fresh parameters.-----
INFO:tensorflow:Restoring parameters from save_model/classifier/GYAFC/model
Restoring parameters from save_model/classifier/GYAFC/model
-----target classifier model loading from save_model/classifier/GYAFC successfully!-----
INFO:tensorflow:Restoring parameters from save_model/classifier/filter_imdb_GYAFC_domain_adapt/model
Restoring parameters from save_model/classifier/filter_imdb_GYAFC_domain_adapt/model
-----domain classifier model loading from save_model/classifier/filter_imdb_GYAFC_domain_adapt successfully!-----
--------------------epoch 1--------------------
learning_rate: 0.0005  gamma: 0.1000
step 700, time 135s, td_loss_rec 63.40, td_loss_g 0.91, td_loss_d 0.34, sd_loss_rec 65.99
---evaluating target domain:
valid td_loss_rec 51.49, td_loss_g 0.94, td_loss_d 0.54
domain acc: 0.9996
transfer acc: 0.6590
Bleu score: 0.0105
step 1400, time 290s, td_loss_rec 44.46, td_loss_g 1.01, td_loss_d 0.06, sd_loss_rec 52.10
---evaluating target domain:
valid td_loss_rec 40.45, td_loss_g 1.17, td_loss_d 0.80
domain acc: 0.9980
transfer acc: 0.6266
Bleu score: 0.0616
step 2100, time 443s, td_loss_rec 31.83, td_loss_g 1.24, td_loss_d 0.02, sd_loss_rec 43.72
---evaluating target domain:
valid td_loss_rec 33.66, td_loss_g 1.40, td_loss_d 0.97
domain acc: 0.9978
transfer acc: 0.6002
Bleu score: 0.1252
step 2800, time 595s, td_loss_rec 22.90, td_loss_g 1.55, td_loss_d 0.01, sd_loss_rec 37.88
---evaluating target domain:
valid td_loss_rec 28.88, td_loss_g 1.71, td_loss_d 1.13
domain acc: 0.9976
transfer acc: 0.5555
Bleu score: 0.2029
--------------------epoch 2--------------------
learning_rate: 0.0005  gamma: 0.1000
step 3500, time 748s, td_loss_rec 16.59, td_loss_g 2.04, td_loss_d 0.01, sd_loss_rec 33.60
---evaluating target domain:
valid td_loss_rec 25.66, td_loss_g 2.20, td_loss_d 1.22
domain acc: 0.9970
transfer acc: 0.5275
Bleu score: 0.2775
step 4200, time 900s, td_loss_rec 12.04, td_loss_g 2.69, td_loss_d 0.01, sd_loss_rec 29.73
---evaluating target domain:
valid td_loss_rec 23.43, td_loss_g 2.65, td_loss_d 1.32
domain acc: 0.9978
transfer acc: 0.4894
Bleu score: 0.3343
step 4900, time 1052s, td_loss_rec 8.89, td_loss_g 3.53, td_loss_d 0.01, sd_loss_rec 26.84
---evaluating target domain:
valid td_loss_rec 21.69, td_loss_g 2.99, td_loss_d 1.42
domain acc: 0.9974
transfer acc: 0.4723
Bleu score: 0.3853
step 5600, time 1205s, td_loss_rec 6.86, td_loss_g 4.40, td_loss_d 0.01, sd_loss_rec 24.53
---evaluating target domain:
valid td_loss_rec 20.53, td_loss_g 3.66, td_loss_d 1.49
domain acc: 0.9974
transfer acc: 0.4391
Bleu score: 0.4187
--------------------epoch 3--------------------
learning_rate: 0.0005  gamma: 0.1000
step 6300, time 1358s, td_loss_rec 5.09, td_loss_g 5.43, td_loss_d 0.00, sd_loss_rec 22.34
---evaluating target domain:
valid td_loss_rec 19.57, td_loss_g 4.05, td_loss_d 1.58
domain acc: 0.9944
transfer acc: 0.4248
Bleu score: 0.4512
step 7000, time 1510s, td_loss_rec 3.96, td_loss_g 6.40, td_loss_d 0.01, sd_loss_rec 20.28
---evaluating target domain:
valid td_loss_rec 18.76, td_loss_g 4.54, td_loss_d 1.67
domain acc: 0.9970
transfer acc: 0.3974
Bleu score: 0.4778
step 7700, time 1662s, td_loss_rec 3.15, td_loss_g 7.47, td_loss_d 0.00, sd_loss_rec 18.73
---evaluating target domain:
valid td_loss_rec 18.15, td_loss_g 5.17, td_loss_d 1.78
domain acc: 0.9970
transfer acc: 0.3742
Bleu score: 0.5027
step 8400, time 1815s, td_loss_rec 2.68, td_loss_g 8.33, td_loss_d 0.00, sd_loss_rec 17.41
---evaluating target domain:
valid td_loss_rec 17.66, td_loss_g 5.50, td_loss_d 1.81
domain acc: 0.9972
transfer acc: 0.3750
Bleu score: 0.5176
--------------------epoch 4--------------------
learning_rate: 0.0005  gamma: 0.1000
step 9100, time 1967s, td_loss_rec 2.04, td_loss_g 9.31, td_loss_d 0.00, sd_loss_rec 15.98
---evaluating target domain:
valid td_loss_rec 17.25, td_loss_g 6.03, td_loss_d 1.82
domain acc: 0.9952
transfer acc: 0.3643
Bleu score: 0.5352
step 9800, time 2120s, td_loss_rec 1.88, td_loss_g 10.21, td_loss_d 0.00, sd_loss_rec 14.94
---evaluating target domain:
valid td_loss_rec 16.78, td_loss_g 6.42, td_loss_d 1.91
domain acc: 0.9966
transfer acc: 0.3549
Bleu score: 0.5535
step 10500, time 2272s, td_loss_rec 1.58, td_loss_g 11.01, td_loss_d 0.00, sd_loss_rec 13.84
---evaluating target domain:
valid td_loss_rec 16.37, td_loss_g 6.77, td_loss_d 1.99
domain acc: 0.9974
transfer acc: 0.3430
Bleu score: 0.5655
step 11200, time 2425s, td_loss_rec 1.23, td_loss_g 11.76, td_loss_d 0.00, sd_loss_rec 12.69
---evaluating target domain:
valid td_loss_rec 16.29, td_loss_g 7.08, td_loss_d 2.00
domain acc: 0.9978
transfer acc: 0.3440
Bleu score: 0.5756
--------------------epoch 5--------------------
learning_rate: 0.0005  gamma: 0.1000
step 11900, time 2577s, td_loss_rec 1.24, td_loss_g 12.59, td_loss_d 0.00, sd_loss_rec 12.14
---evaluating target domain:
valid td_loss_rec 15.96, td_loss_g 7.51, td_loss_d 2.08
domain acc: 0.9976
transfer acc: 0.3353
Bleu score: 0.5840
step 12600, time 2730s, td_loss_rec 1.62, td_loss_g 13.08, td_loss_d 0.00, sd_loss_rec 11.98
---evaluating target domain:
valid td_loss_rec 15.55, td_loss_g 7.86, td_loss_d 2.15
domain acc: 0.9968
transfer acc: 0.3335
Bleu score: 0.5953
step 13300, time 2882s, td_loss_rec 0.84, td_loss_g 14.02, td_loss_d 0.00, sd_loss_rec 10.44
---evaluating target domain:
valid td_loss_rec 15.41, td_loss_g 8.15, td_loss_d 2.15
domain acc: 0.9974
transfer acc: 0.3311
Bleu score: 0.6045
step 14000, time 3035s, td_loss_rec 0.99, td_loss_g 14.51, td_loss_d 0.00, sd_loss_rec 10.11
---evaluating target domain:
valid td_loss_rec 15.04, td_loss_g 8.26, td_loss_d 2.19
domain acc: 0.9968
transfer acc: 0.3210
Bleu score: 0.6151
--------------------epoch 6--------------------
learning_rate: 0.0005  gamma: 0.1000
step 14700, time 3187s, td_loss_rec 0.70, td_loss_g 15.37, td_loss_d 0.00, sd_loss_rec 9.35
---evaluating target domain:
valid td_loss_rec 14.90, td_loss_g 9.00, td_loss_d 2.27
domain acc: 0.9968
transfer acc: 0.3130
Bleu score: 0.6233
step 15400, time 3339s, td_loss_rec 1.09, td_loss_g 15.73, td_loss_d 0.00, sd_loss_rec 9.38
---evaluating target domain:
valid td_loss_rec 14.60, td_loss_g 9.36, td_loss_d 2.32
domain acc: 0.9958
transfer acc: 0.3154
Bleu score: 0.6285
step 16100, time 3492s, td_loss_rec 0.64, td_loss_g 16.54, td_loss_d 0.00, sd_loss_rec 8.34
---evaluating target domain:
valid td_loss_rec 14.50, td_loss_g 9.42, td_loss_d 2.41
domain acc: 0.9964
transfer acc: 0.3059
Bleu score: 0.6379
step 16800, time 3644s, td_loss_rec 0.55, td_loss_g 17.18, td_loss_d 0.00, sd_loss_rec 7.85
---evaluating target domain:
valid td_loss_rec 14.30, td_loss_g 9.81, td_loss_d 2.44
domain acc: 0.9956
transfer acc: 0.3063
Bleu score: 0.6430
--------------------epoch 7--------------------
learning_rate: 0.0005  gamma: 0.1000
step 17500, time 3796s, td_loss_rec 0.78, td_loss_g 17.51, td_loss_d 0.00, sd_loss_rec 7.87
---evaluating target domain:
valid td_loss_rec 14.20, td_loss_g 10.05, td_loss_d 2.50
domain acc: 0.9962
transfer acc: 0.3069
Bleu score: 0.6504
step 18200, time 3948s, td_loss_rec 0.46, td_loss_g 18.35, td_loss_d 0.00, sd_loss_rec 7.07
---evaluating target domain:
valid td_loss_rec 14.11, td_loss_g 10.54, td_loss_d 2.52
domain acc: 0.9954
transfer acc: 0.3015
Bleu score: 0.6602
step 18900, time 4101s, td_loss_rec 0.46, td_loss_g 18.87, td_loss_d 0.00, sd_loss_rec 6.67
---evaluating target domain:
valid td_loss_rec 13.83, td_loss_g 10.81, td_loss_d 2.62
domain acc: 0.9946
transfer acc: 0.3031
Bleu score: 0.6655
step 19600, time 4253s, td_loss_rec 0.43, td_loss_g 19.43, td_loss_d 0.00, sd_loss_rec 6.38
---evaluating target domain:
valid td_loss_rec 13.79, td_loss_g 11.13, td_loss_d 2.67
domain acc: 0.9958
transfer acc: 0.2969
Bleu score: 0.6674
--------------------epoch 8--------------------
learning_rate: 0.0005  gamma: 0.1000
step 20300, time 4405s, td_loss_rec 0.41, td_loss_g 19.99, td_loss_d 0.00, sd_loss_rec 6.14
---evaluating target domain:
valid td_loss_rec 13.65, td_loss_g 11.13, td_loss_d 2.84
domain acc: 0.9954
transfer acc: 0.2908
Bleu score: 0.6729
step 21000, time 4557s, td_loss_rec 0.38, td_loss_g 20.41, td_loss_d 0.00, sd_loss_rec 5.83
---evaluating target domain:
valid td_loss_rec 13.44, td_loss_g 11.89, td_loss_d 2.77
domain acc: 0.9934
transfer acc: 0.2880
Bleu score: 0.6801
step 21700, time 4709s, td_loss_rec 1.10, td_loss_g 20.35, td_loss_d 0.00, sd_loss_rec 6.45
---evaluating target domain:
valid td_loss_rec 13.38, td_loss_g 11.70, td_loss_d 2.81
domain acc: 0.9940
transfer acc: 0.2890
Bleu score: 0.6800
step 22400, time 4862s, td_loss_rec 0.32, td_loss_g 21.68, td_loss_d 0.00, sd_loss_rec 5.25
---evaluating target domain:
valid td_loss_rec 13.02, td_loss_g 12.57, td_loss_d 2.86
domain acc: 0.9930
transfer acc: 0.2775
Bleu score: 0.6865
--------------------epoch 9--------------------
learning_rate: 0.0005  gamma: 0.1000
step 23100, time 5014s, td_loss_rec 0.31, td_loss_g 22.42, td_loss_d 0.00, sd_loss_rec 5.05
---evaluating target domain:
valid td_loss_rec 13.24, td_loss_g 12.85, td_loss_d 2.97
domain acc: 0.9942
transfer acc: 0.2743
Bleu score: 0.6879
step 23800, time 5166s, td_loss_rec 0.30, td_loss_g 22.89, td_loss_d 0.00, sd_loss_rec 4.85
---evaluating target domain:
valid td_loss_rec 13.22, td_loss_g 12.97, td_loss_d 3.01
domain acc: 0.9950
transfer acc: 0.2781
Bleu score: 0.6915
step 24500, time 5318s, td_loss_rec 0.37, td_loss_g 23.20, td_loss_d 0.00, sd_loss_rec 4.74
---evaluating target domain:
valid td_loss_rec 13.22, td_loss_g 13.35, td_loss_d 3.08
domain acc: 0.9934
transfer acc: 0.2769
Bleu score: 0.6961
step 25200, time 5470s, td_loss_rec 0.28, td_loss_g 23.69, td_loss_d 0.00, sd_loss_rec 4.46
---evaluating target domain:
valid td_loss_rec 13.09, td_loss_g 13.47, td_loss_d 3.06
domain acc: 0.9950
transfer acc: 0.2739
Bleu score: 0.7011
--------------------epoch 10--------------------
learning_rate: 0.0005  gamma: 0.1000
step 25900, time 5623s, td_loss_rec 0.28, td_loss_g 23.95, td_loss_d 0.00, sd_loss_rec 4.36
---evaluating target domain:
valid td_loss_rec 12.78, td_loss_g 13.87, td_loss_d 3.12
domain acc: 0.9954
transfer acc: 0.2753
Bleu score: 0.7039
step 26600, time 5775s, td_loss_rec 0.27, td_loss_g 24.30, td_loss_d 0.00, sd_loss_rec 4.18
---evaluating target domain:
valid td_loss_rec 12.80, td_loss_g 14.14, td_loss_d 3.12
domain acc: 0.9948
transfer acc: 0.2733
Bleu score: 0.7073
step 27300, time 5927s, td_loss_rec 0.26, td_loss_g 24.40, td_loss_d 0.00, sd_loss_rec 3.98
---evaluating target domain:
valid td_loss_rec 13.23, td_loss_g 14.27, td_loss_d 3.14
domain acc: 0.9952
transfer acc: 0.2624
Bleu score: 0.7072
step 28000, time 6079s, td_loss_rec 0.25, td_loss_g 25.13, td_loss_d 0.00, sd_loss_rec 3.87
---evaluating target domain:
valid td_loss_rec 12.90, td_loss_g 14.42, td_loss_d 3.31
domain acc: 0.9940
transfer acc: 0.2711
Bleu score: 0.7077
--------------------epoch 11--------------------
learning_rate: 0.0005  gamma: 0.1000
2020-03-02 17:44:00.750621: E tensorflow/core/grappler/optimizers/dependency_optimizer.cc:666] Iteration = 0, topological sort failed with message: The graph couldn't be sorted in topological order.
2020-03-02 17:44:00.827233: E tensorflow/core/grappler/optimizers/dependency_optimizer.cc:666] Iteration = 1, topological sort failed with message: The graph couldn't be sorted in topological order.
2020-03-02 17:44:01.277881: E tensorflow/core/grappler/optimizers/dependency_optimizer.cc:666] Iteration = 0, topological sort failed with message: The graph couldn't be sorted in topological order.
2020-03-02 17:44:01.311670: E tensorflow/core/grappler/optimizers/dependency_optimizer.cc:666] Iteration = 1, topological sort failed with message: The graph couldn't be sorted in topological order.
step 28700, time 6267s, td_loss_rec 5.74, td_loss_g 15.12, td_loss_d 0.00, sd_loss_rec 7.53
---evaluating target domain:
valid td_loss_rec 18.42, td_loss_g 1.90, td_loss_d 3.33
domain acc: 0.9762
transfer acc: 0.6481
Bleu score: 0.4708
step 29400, time 6487s, td_loss_rec 7.14, td_loss_g 2.55, td_loss_d 0.00, sd_loss_rec 8.73
---evaluating target domain:
valid td_loss_rec 16.60, td_loss_g 1.63, td_loss_d 3.33
domain acc: 0.9921
transfer acc: 0.6818
Bleu score: 0.5047
step 30100, time 6706s, td_loss_rec 5.26, td_loss_g 1.93, td_loss_d 0.00, sd_loss_rec 7.45
---evaluating target domain:
valid td_loss_rec 15.91, td_loss_g 1.24, td_loss_d 3.33
domain acc: 0.9940
transfer acc: 0.7263
Bleu score: 0.5107
step 30800, time 6925s, td_loss_rec 4.20, td_loss_g 1.68, td_loss_d 0.00, sd_loss_rec 6.77
---evaluating target domain:
valid td_loss_rec 15.12, td_loss_g 1.24, td_loss_d 3.33
domain acc: 0.9932
transfer acc: 0.7069
Bleu score: 0.5297
--------------------epoch 12--------------------
learning_rate: 0.0005  gamma: 0.1000
step 31500, time 7145s, td_loss_rec 3.57, td_loss_g 1.53, td_loss_d 0.00, sd_loss_rec 6.50
---evaluating target domain:
valid td_loss_rec 15.64, td_loss_g 1.14, td_loss_d 3.33
domain acc: 0.9940
transfer acc: 0.7233
Bleu score: 0.5226
step 32200, time 7364s, td_loss_rec 3.08, td_loss_g 1.34, td_loss_d 0.00, sd_loss_rec 6.28
---evaluating target domain:
valid td_loss_rec 15.21, td_loss_g 1.19, td_loss_d 3.33
domain acc: 0.9972
transfer acc: 0.7303
Bleu score: 0.5348
step 32900, time 7584s, td_loss_rec 2.85, td_loss_g 1.21, td_loss_d 0.00, sd_loss_rec 5.91
---evaluating target domain:
valid td_loss_rec 15.26, td_loss_g 1.19, td_loss_d 3.33
domain acc: 0.9956
transfer acc: 0.7154
Bleu score: 0.5433
step 33600, time 7803s, td_loss_rec 2.59, td_loss_g 1.15, td_loss_d 0.00, sd_loss_rec 5.73
---evaluating target domain:
valid td_loss_rec 15.20, td_loss_g 1.04, td_loss_d 3.33
domain acc: 0.9881
transfer acc: 0.7351
Bleu score: 0.5324
--------------------epoch 13--------------------
learning_rate: 0.0005  gamma: 0.1000
step 34300, time 8022s, td_loss_rec 2.49, td_loss_g 1.04, td_loss_d 0.00, sd_loss_rec 5.68
---evaluating target domain:
valid td_loss_rec 15.53, td_loss_g 1.00, td_loss_d 3.33
domain acc: 0.9877
transfer acc: 0.7462
Bleu score: 0.5328
step 35000, time 8241s, td_loss_rec 2.25, td_loss_g 1.01, td_loss_d 0.00, sd_loss_rec 5.61
---evaluating target domain:
valid td_loss_rec 15.62, td_loss_g 0.99, td_loss_d 3.33
domain acc: 0.9907
transfer acc: 0.7347
Bleu score: 0.5268
step 35700, time 8461s, td_loss_rec 2.08, td_loss_g 0.92, td_loss_d 0.00, sd_loss_rec 5.30
---evaluating target domain:
valid td_loss_rec 15.93, td_loss_g 0.80, td_loss_d 3.33
domain acc: 0.9925
transfer acc: 0.7633
Bleu score: 0.5161
step 36400, time 8680s, td_loss_rec 1.98, td_loss_g 0.86, td_loss_d 0.00, sd_loss_rec 5.22
---evaluating target domain:
valid td_loss_rec 15.22, td_loss_g 0.95, td_loss_d 3.33
domain acc: 0.9905
transfer acc: 0.7404
Bleu score: 0.5310
--------------------epoch 14--------------------
learning_rate: 0.0005  gamma: 0.1000
step 37100, time 8900s, td_loss_rec 1.89, td_loss_g 0.82, td_loss_d 0.00, sd_loss_rec 5.15
---evaluating target domain:
valid td_loss_rec 14.92, td_loss_g 0.99, td_loss_d 3.33
domain acc: 0.9865
transfer acc: 0.7442
Bleu score: 0.5379
step 37800, time 9119s, td_loss_rec 1.69, td_loss_g 0.78, td_loss_d 0.00, sd_loss_rec 5.08
---evaluating target domain:
valid td_loss_rec 15.19, td_loss_g 0.91, td_loss_d 3.33
domain acc: 0.9911
transfer acc: 0.7531
Bleu score: 0.5301
step 38500, time 9338s, td_loss_rec 1.63, td_loss_g 0.73, td_loss_d 0.00, sd_loss_rec 4.83
---evaluating target domain:
valid td_loss_rec 15.09, td_loss_g 0.83, td_loss_d 3.33
domain acc: 0.9893
transfer acc: 0.7353
Bleu score: 0.5363
step 39200, time 9557s, td_loss_rec 1.53, td_loss_g 0.69, td_loss_d 0.00, sd_loss_rec 4.71
---evaluating target domain:
valid td_loss_rec 15.11, td_loss_g 0.88, td_loss_d 3.33
domain acc: 0.9930
transfer acc: 0.7615
Bleu score: 0.5336
--------------------epoch 15--------------------
learning_rate: 0.0005  gamma: 0.1000
step 39900, time 9776s, td_loss_rec 1.46, td_loss_g 0.67, td_loss_d 0.00, sd_loss_rec 4.63
---evaluating target domain:
valid td_loss_rec 14.83, td_loss_g 1.04, td_loss_d 3.33
domain acc: 0.9895
transfer acc: 0.7436
Bleu score: 0.5420
step 40600, time 9996s, td_loss_rec 1.36, td_loss_g 0.65, td_loss_d 0.00, sd_loss_rec 4.58
---evaluating target domain:
valid td_loss_rec 14.78, td_loss_g 0.90, td_loss_d 3.33
domain acc: 0.9863
transfer acc: 0.7690
Bleu score: 0.5406
step 41300, time 10215s, td_loss_rec 1.28, td_loss_g 0.58, td_loss_d 0.00, sd_loss_rec 4.36
---evaluating target domain:
valid td_loss_rec 15.08, td_loss_g 0.81, td_loss_d 3.33
domain acc: 0.9821
transfer acc: 0.7740
Bleu score: 0.5361
step 42000, time 10434s, td_loss_rec 1.22, td_loss_g 0.56, td_loss_d 0.00, sd_loss_rec 4.25
---evaluating target domain:
valid td_loss_rec 14.96, td_loss_g 0.76, td_loss_d 3.33
domain acc: 0.9891
transfer acc: 0.7974
Bleu score: 0.5202
--------------------epoch 16--------------------
learning_rate: 0.0005  gamma: 0.1000
step 42700, time 10653s, td_loss_rec 1.16, td_loss_g 0.52, td_loss_d 0.00, sd_loss_rec 4.17
---evaluating target domain:
valid td_loss_rec 16.18, td_loss_g 0.66, td_loss_d 3.33
domain acc: 0.9897
transfer acc: 0.8024
Bleu score: 0.5112
step 43400, time 10872s, td_loss_rec 1.11, td_loss_g 0.51, td_loss_d 0.00, sd_loss_rec 4.11
---evaluating target domain:
valid td_loss_rec 15.10, td_loss_g 0.70, td_loss_d 3.33
domain acc: 0.9907
transfer acc: 0.7927
Bleu score: 0.5165
step 44100, time 11092s, td_loss_rec 1.05, td_loss_g 0.46, td_loss_d 0.00, sd_loss_rec 3.95
---evaluating target domain:
valid td_loss_rec 15.15, td_loss_g 0.62, td_loss_d 3.33
domain acc: 0.9891
transfer acc: 0.8040
Bleu score: 0.5147
step 44800, time 11311s, td_loss_rec 1.00, td_loss_g 0.41, td_loss_d 0.00, sd_loss_rec 3.85
---evaluating target domain:
valid td_loss_rec 14.87, td_loss_g 0.71, td_loss_d 3.33
domain acc: 0.9897
transfer acc: 0.8081
Bleu score: 0.5130
--------------------epoch 17--------------------
learning_rate: 0.0005  gamma: 0.1000
step 45500, time 11530s, td_loss_rec 0.94, td_loss_g 0.39, td_loss_d 0.00, sd_loss_rec 3.75
---evaluating target domain:
valid td_loss_rec 14.94, td_loss_g 0.75, td_loss_d 3.33
domain acc: 0.9903
transfer acc: 0.7950
Bleu score: 0.5068
step 46200, time 11749s, td_loss_rec 0.85, td_loss_g 0.36, td_loss_d 0.00, sd_loss_rec 3.65
---evaluating target domain:
valid td_loss_rec 15.02, td_loss_g 0.82, td_loss_d 3.33
domain acc: 0.9857
transfer acc: 0.7839
Bleu score: 0.5281
step 46900, time 11968s, td_loss_rec 0.85, td_loss_g 0.33, td_loss_d 0.00, sd_loss_rec 3.52
---evaluating target domain:
valid td_loss_rec 14.94, td_loss_g 0.76, td_loss_d 3.33
domain acc: 0.9857
transfer acc: 0.7885
Bleu score: 0.5256
step 47600, time 12187s, td_loss_rec 0.76, td_loss_g 0.29, td_loss_d 0.00, sd_loss_rec 3.42
---evaluating target domain:
valid td_loss_rec 15.16, td_loss_g 0.68, td_loss_d 3.33
domain acc: 0.9831
transfer acc: 0.8143
Bleu score: 0.5096
--------------------epoch 18--------------------
learning_rate: 0.0005  gamma: 0.1000
step 48300, time 12407s, td_loss_rec 0.76, td_loss_g 0.31, td_loss_d 0.00, sd_loss_rec 3.37
---evaluating target domain:
valid td_loss_rec 15.07, td_loss_g 0.94, td_loss_d 3.33
domain acc: 0.9849
transfer acc: 0.7825
Bleu score: 0.5217
step 49000, time 12626s, td_loss_rec 0.73, td_loss_g 0.30, td_loss_d 0.00, sd_loss_rec 3.36
---evaluating target domain:
valid td_loss_rec 15.35, td_loss_g 0.67, td_loss_d 3.33
domain acc: 0.9799
transfer acc: 0.8189
Bleu score: 0.4961
step 49700, time 12845s, td_loss_rec 0.68, td_loss_g 0.26, td_loss_d 0.00, sd_loss_rec 3.18
---evaluating target domain:
valid td_loss_rec 15.27, td_loss_g 0.78, td_loss_d 3.33
domain acc: 0.9799
transfer acc: 0.8175
Bleu score: 0.5003
step 50400, time 13064s, td_loss_rec 0.63, td_loss_g 0.24, td_loss_d 0.00, sd_loss_rec 3.07
---evaluating target domain:
valid td_loss_rec 15.31, td_loss_g 0.76, td_loss_d 3.33
domain acc: 0.9915
transfer acc: 0.8354
Bleu score: 0.4911
--------------------epoch 19--------------------
learning_rate: 0.0005  gamma: 0.1000
step 51100, time 13283s, td_loss_rec 0.62, td_loss_g 0.23, td_loss_d 0.00, sd_loss_rec 3.03
---evaluating target domain:
valid td_loss_rec 15.61, td_loss_g 0.72, td_loss_d 3.33
domain acc: 0.9891
transfer acc: 0.8405
Bleu score: 0.4723
step 51800, time 13502s, td_loss_rec 0.57, td_loss_g 0.24, td_loss_d 0.00, sd_loss_rec 3.00
---evaluating target domain:
valid td_loss_rec 15.40, td_loss_g 0.64, td_loss_d 3.33
domain acc: 0.9905
transfer acc: 0.8330
Bleu score: 0.4948
step 52500, time 13721s, td_loss_rec 0.54, td_loss_g 0.22, td_loss_d 0.00, sd_loss_rec 2.85
---evaluating target domain:
valid td_loss_rec 15.22, td_loss_g 0.74, td_loss_d 3.33
domain acc: 0.9809
transfer acc: 0.8320
Bleu score: 0.5062
step 53200, time 13940s, td_loss_rec 0.54, td_loss_g 0.21, td_loss_d 0.00, sd_loss_rec 2.79
---evaluating target domain:
valid td_loss_rec 15.63, td_loss_g 0.77, td_loss_d 3.33
domain acc: 0.9883
transfer acc: 0.8234
Bleu score: 0.4790
--------------------epoch 20--------------------
learning_rate: 0.0005  gamma: 0.1000
step 53900, time 14159s, td_loss_rec 0.54, td_loss_g 0.19, td_loss_d 0.00, sd_loss_rec 2.75
---evaluating target domain:
valid td_loss_rec 15.60, td_loss_g 0.87, td_loss_d 3.33
domain acc: 0.9845
transfer acc: 0.8479
Bleu score: 0.4579
step 54600, time 14378s, td_loss_rec 0.51, td_loss_g 0.19, td_loss_d 0.00, sd_loss_rec 2.74
---evaluating target domain:
valid td_loss_rec 15.70, td_loss_g 0.76, td_loss_d 3.33
domain acc: 0.9905
transfer acc: 0.8197
Bleu score: 0.4705
step 55300, time 14598s, td_loss_rec 0.45, td_loss_g 0.19, td_loss_d 0.00, sd_loss_rec 2.60
---evaluating target domain:
valid td_loss_rec 15.33, td_loss_g 0.82, td_loss_d 3.33
domain acc: 0.9865
transfer acc: 0.8254
Bleu score: 0.4781
step 56000, time 14817s, td_loss_rec 0.48, td_loss_g 0.17, td_loss_d 0.00, sd_loss_rec 2.57
---evaluating target domain:
valid td_loss_rec 15.39, td_loss_g 0.92, td_loss_d 3.33
domain acc: 0.9833
transfer acc: 0.8332
Bleu score: 0.4752
step 56700, time 15036s, td_loss_rec 0.47, td_loss_g 0.17, td_loss_d 0.00, sd_loss_rec 2.51
---evaluating target domain:
valid td_loss_rec 15.33, td_loss_g 0.92, td_loss_d 3.33
domain acc: 0.9885
transfer acc: 0.8332
Bleu score: 0.4866
---testing target domain:
test td_loss_rec 15.74, td_loss_g 0.89, td_loss_d 3.22
domain acc: 0.9830
transfer acc: 0.8354
Bleu score: 0.4858
