{
  "shell": "src/main-application.js",
  "entrypoint": "index.html",
  "fragments": [
    "src/my-title.js",
    "src/my-sub-title.js",
    "/src/buddies-list.js"
  ],
  "npm": true,
  "moduleResolution": "node",
  "sources": ["src/main-application.js", "package.json"],
  "extraDependencies": [
    "node_modules/@webcomponents/webcomponentsjs/**"
  ],
  "builds": [{
    "bundle": true,
    "js": { 
      "minify": false,
      "compile": "es5",
      "transformModulesToAmd": true
    },
    "addServiceWorker": true,
    "addPushManifest": true
  }]
}
