{
  "entrypoint": "index.html",
  "moduleResolution": "node",
  "npm": true,
  "extraDependencies": [
    "node_modules/@webcomponents/webcomponentsjs/**",
    "node_modules/@webcomponents/webcomponentsjs/**/*.map"
  ],
  "builds": [{
    "name": "es6-bundled",
    "browserCapabilities": ["es2015"],
    "js": {
      "compile": "es2015",
      "minify": true,
      "transformModulesToAmd": true
    },
    "css": {"minify": true},
    "html": {"minify": true},
    "bundle": true,
    "addServiceWorker": true,
    "addPushManifest": true
  }]
}