TASK NAME	KG USED	MEAN f1	STD
task_a_germ_evl	auth_only_./test_env/wikidata/rotate_wikidata5m.pkl	0.8102080865707417	0.007369582667848668
task_a_germ_evl	auth_only_./test_env/wikidata/complex_wikidata5m.pkl	0.8193770252054116	0.00708991831139861
task_a_germ_evl	auth_only_./test_env/wikidata/simple_wikidata5m.pkl	0.81586195779396	0.015843794294123394
task_a_germ_evl	auth_only_./test_env/wikidata/distmult_wikidata5m.pkl	0.8062351212378196	0.011348651618572632
task_a_germ_evl	auth_only_./test_env/wikidata/transe_wikidata5m.pkl	0.8121955037227568	0.011741658931517315
task_a_germ_evl	auth_only_./test_env/wikidata/quate_wikidata5m.pkl	0.8173906593496449	0.008800605075365476
