TASK NAME	KG USED	MEAN f1	STD
task_a_germ_evl	none	0.6963630990344428	0.0006937617543277663
task_a_germ_evl	./test_env/wikidata/rotate_wikidata5m.pkl	0.7735356027315012	0.020474218616808957
task_a_germ_evl	./test_env/wikidata/complex_wikidata5m.pkl	0.8144868623012174	0.010084019974155728
task_a_germ_evl	./test_env/wikidata/simple_wikidata5m.pkl	0.8123473576252854	0.021786476559589662
task_a_germ_evl	./test_env/wikidata/distmult_wikidata5m.pkl	0.8033316746214749	0.009366555732025623
task_a_germ_evl	./test_env/wikidata/transe_wikidata5m.pkl	0.7842320748149134	0.025230270080034853
task_a_germ_evl	./test_env/wikidata/quate_wikidata5m.pkl	0.8118896933252033	0.008638758389030237
