MODEL	KG USED	TEST_VAL	MEAN f1	STD
SGD_256_f_5000	./test_env/wikidata/rotate_wikidata5m.pkl	0.8090909090909091	0.6770981507823612	1.3541963015647225
LR_256_f_5000	./test_env/wikidata/rotate_wikidata5m.pkl	0.7136363636363636	0.6736540575356365	1.347308115071273
SGD_512_f_5000	./test_env/wikidata/rotate_wikidata5m.pkl	0.6541176470588235	0.7034139402560455	1.406827880512091
LR_512_f_5000	./test_env/wikidata/rotate_wikidata5m.pkl	0.7136363636363636	0.6736540575356365	1.347308115071273
SGD_768_f_5000	./test_env/wikidata/rotate_wikidata5m.pkl	0.5689149560117301	0.6718349928876245	1.343669985775249
LR_768_f_5000	./test_env/wikidata/rotate_wikidata5m.pkl	0.7136363636363636	0.6736540575356365	1.347308115071273
SGD_256_f_10000	./test_env/wikidata/rotate_wikidata5m.pkl	0.8090909090909091	0.666429587482219	1.332859174964438
LR_256_f_10000	./test_env/wikidata/rotate_wikidata5m.pkl	0.7083333333333333	0.6522622203543256	1.3045244407086511
SGD_512_f_10000	./test_env/wikidata/rotate_wikidata5m.pkl	0.6971153846153846	0.6288762446657182	1.2577524893314365
LR_512_f_10000	./test_env/wikidata/rotate_wikidata5m.pkl	0.7083333333333333	0.6522622203543256	1.3045244407086511
SGD_768_f_10000	./test_env/wikidata/rotate_wikidata5m.pkl	0.7597254004576658	0.6453769559032716	1.2907539118065432
LR_768_f_10000	./test_env/wikidata/rotate_wikidata5m.pkl	0.7083333333333333	0.6522622203543256	1.3045244407086511
MODEL	KG USED	TEST_VAL	MEAN f1	STD
SGD_256_f_5000	./test_env/wikidata/complex_wikidata5m.pkl	0.7083333333333333	0.6715504978662874	1.3431009957325748
LR_256_f_5000	./test_env/wikidata/complex_wikidata5m.pkl	0.7083333333333333	0.7237099200513836	1.4474198401027671
SGD_512_f_5000	./test_env/wikidata/complex_wikidata5m.pkl	0.6370370370370371	0.6874822190611665	1.374964438122333
LR_512_f_5000	./test_env/wikidata/complex_wikidata5m.pkl	0.7083333333333333	0.7237099200513836	1.4474198401027671
SGD_768_f_5000	./test_env/wikidata/complex_wikidata5m.pkl	0.7529411764705882	0.7082503556187767	1.4165007112375534
LR_768_f_5000	./test_env/wikidata/complex_wikidata5m.pkl	0.7083333333333333	0.7237099200513836	1.4474198401027671
SGD_256_f_10000	./test_env/wikidata/complex_wikidata5m.pkl	0.7083333333333333	0.7142247510668563	1.4284495021337127
LR_256_f_10000	./test_env/wikidata/complex_wikidata5m.pkl	0.7083333333333333	0.7030236714447241	1.4060473428894482
SGD_512_f_10000	./test_env/wikidata/complex_wikidata5m.pkl	0.7083333333333333	0.7399715504978663	1.4799431009957327
LR_512_f_10000	./test_env/wikidata/complex_wikidata5m.pkl	0.7083333333333333	0.7082467082467083	1.4164934164934166
SGD_768_f_10000	./test_env/wikidata/complex_wikidata5m.pkl	0.7083333333333333	0.724466571834993	1.448933143669986
LR_768_f_10000	./test_env/wikidata/complex_wikidata5m.pkl	0.7083333333333333	0.7082467082467083	1.4164934164934166
MODEL	KG USED	TEST_VAL	MEAN f1	STD
SGD_256_f_5000	./test_env/wikidata/simple_wikidata5m.pkl	0.7083333333333333	0.6559032716927453	1.3118065433854906
LR_256_f_5000	./test_env/wikidata/simple_wikidata5m.pkl	0.7083333333333333	0.6479767695905467	1.2959535391810935
SGD_512_f_5000	./test_env/wikidata/simple_wikidata5m.pkl	0.8090909090909091	0.6611664295874822	1.3223328591749643
LR_512_f_5000	./test_env/wikidata/simple_wikidata5m.pkl	0.7083333333333333	0.6479767695905467	1.2959535391810935
SGD_768_f_5000	./test_env/wikidata/simple_wikidata5m.pkl	0.6541176470588235	0.6877667140825036	1.3755334281650071
LR_768_f_5000	./test_env/wikidata/simple_wikidata5m.pkl	0.7083333333333333	0.6479767695905467	1.2959535391810935
SGD_256_f_10000	./test_env/wikidata/simple_wikidata5m.pkl	0.7083333333333333	0.656045519203414	1.312091038406828
LR_256_f_10000	./test_env/wikidata/simple_wikidata5m.pkl	0.7083333333333333	0.6542584951063322	1.3085169902126643
SGD_512_f_10000	./test_env/wikidata/simple_wikidata5m.pkl	0.7597254004576658	0.6503556187766714	1.3007112375533427
LR_512_f_10000	./test_env/wikidata/simple_wikidata5m.pkl	0.7083333333333333	0.6542584951063322	1.3085169902126643
SGD_768_f_10000	./test_env/wikidata/simple_wikidata5m.pkl	0.7136363636363636	0.6291607396870555	1.258321479374111
LR_768_f_10000	./test_env/wikidata/simple_wikidata5m.pkl	0.7083333333333333	0.6542584951063322	1.3085169902126643
MODEL	KG USED	TEST_VAL	MEAN f1	STD
SGD_256_f_5000	./test_env/wikidata/distmult_wikidata5m.pkl	0.6636155606407322	0.6876244665718351	1.3752489331436701
LR_256_f_5000	./test_env/wikidata/distmult_wikidata5m.pkl	0.6636155606407322	0.6867098797650788	1.3734197595301576
SGD_512_f_5000	./test_env/wikidata/distmult_wikidata5m.pkl	0.7597254004576658	0.7295874822190611	1.4591749644381222
LR_512_f_5000	./test_env/wikidata/distmult_wikidata5m.pkl	0.6636155606407322	0.6919108499660489	1.3838216999320978
SGD_768_f_5000	./test_env/wikidata/distmult_wikidata5m.pkl	0.6181818181818182	0.6763869132290184	1.352773826458037
LR_768_f_5000	./test_env/wikidata/distmult_wikidata5m.pkl	0.6636155606407322	0.6919108499660489	1.3838216999320978
SGD_256_f_10000	./test_env/wikidata/distmult_wikidata5m.pkl	0.7083333333333333	0.6557610241820768	1.3115220483641536
LR_256_f_10000	./test_env/wikidata/distmult_wikidata5m.pkl	0.7136363636363636	0.7077456461666987	1.4154912923333973
SGD_512_f_10000	./test_env/wikidata/distmult_wikidata5m.pkl	0.7136363636363636	0.6766714082503557	1.3533428165007113
LR_512_f_10000	./test_env/wikidata/distmult_wikidata5m.pkl	0.7136363636363636	0.7077456461666987	1.4154912923333973
SGD_768_f_10000	./test_env/wikidata/distmult_wikidata5m.pkl	0.7136363636363636	0.6455192034139403	1.2910384068278806
LR_768_f_10000	./test_env/wikidata/distmult_wikidata5m.pkl	0.7136363636363636	0.7077456461666987	1.4154912923333973
MODEL	KG USED	TEST_VAL	MEAN f1	STD
SGD_256_f_5000	./test_env/wikidata/transe_wikidata5m.pkl	0.7083333333333333	0.6769559032716927	1.3539118065433855
LR_256_f_5000	./test_env/wikidata/transe_wikidata5m.pkl	0.6541176470588235	0.6580036411305761	1.3160072822611522
SGD_512_f_5000	./test_env/wikidata/transe_wikidata5m.pkl	0.7597254004576658	0.6770981507823614	1.3541963015647227
LR_512_f_5000	./test_env/wikidata/transe_wikidata5m.pkl	0.6541176470588235	0.6580036411305761	1.3160072822611522
SGD_768_f_5000	./test_env/wikidata/transe_wikidata5m.pkl	0.6971153846153846	0.6556187766714082	1.3112375533428164
LR_768_f_5000	./test_env/wikidata/transe_wikidata5m.pkl	0.6541176470588235	0.6580036411305761	1.3160072822611522
SGD_256_f_10000	./test_env/wikidata/transe_wikidata5m.pkl	0.8090909090909091	0.6450924608819346	1.2901849217638692
LR_256_f_10000	./test_env/wikidata/transe_wikidata5m.pkl	0.7083333333333333	0.6580036411305761	1.3160072822611522
SGD_512_f_10000	./test_env/wikidata/transe_wikidata5m.pkl	0.8090909090909091	0.666429587482219	1.332859174964438
LR_512_f_10000	./test_env/wikidata/transe_wikidata5m.pkl	0.7083333333333333	0.6580036411305761	1.3160072822611522
SGD_768_f_10000	./test_env/wikidata/transe_wikidata5m.pkl	0.7083333333333333	0.65049786628734	1.30099573257468
LR_768_f_10000	./test_env/wikidata/transe_wikidata5m.pkl	0.7083333333333333	0.6580036411305761	1.3160072822611522
MODEL	KG USED	TEST_VAL	MEAN f1	STD
SGD_256_f_5000	./test_env/wikidata/quate_wikidata5m.pkl	0.7529411764705882	0.6341394025604552	1.2682788051209104
LR_256_f_5000	./test_env/wikidata/quate_wikidata5m.pkl	0.6636155606407322	0.6915428276573787	1.3830856553147575
SGD_512_f_5000	./test_env/wikidata/quate_wikidata5m.pkl	0.7597254004576658	0.6288762446657182	1.2577524893314365
LR_512_f_5000	./test_env/wikidata/quate_wikidata5m.pkl	0.6636155606407322	0.6915428276573787	1.3830856553147575
SGD_768_f_5000	./test_env/wikidata/quate_wikidata5m.pkl	0.7083333333333333	0.6773826458036984	1.354765291607397
LR_768_f_5000	./test_env/wikidata/quate_wikidata5m.pkl	0.6636155606407322	0.6915428276573787	1.3830856553147575
SGD_256_f_10000	./test_env/wikidata/quate_wikidata5m.pkl	0.7136363636363636	0.6503556187766714	1.3007112375533427
LR_256_f_10000	./test_env/wikidata/quate_wikidata5m.pkl	0.6636155606407322	0.6861205000739884	1.3722410001479768
SGD_512_f_10000	./test_env/wikidata/quate_wikidata5m.pkl	0.7980769230769231	0.6614509246088194	1.3229018492176388
LR_512_f_10000	./test_env/wikidata/quate_wikidata5m.pkl	0.6636155606407322	0.6861205000739884	1.3722410001479768
SGD_768_f_10000	./test_env/wikidata/quate_wikidata5m.pkl	0.6541176470588235	0.65049786628734	1.30099573257468
LR_768_f_10000	./test_env/wikidata/quate_wikidata5m.pkl	0.6636155606407322	0.6861205000739884	1.3722410001479768
