TASK NAME	KG USED	MEAN 					f1			STD
task_a_germ_evl						none	0.8300734972888237	0.009919479411425213
task_a_germ_evl	./test_env/wikidata/rotate_wikidata5m.pkl	0.869652698443848	0.013849891393908426
task_a_germ_evl	./test_env/wikidata/complex_wikidata5m.pkl	0.8452022343549597	0.007225636401422981
task_a_germ_evl	./test_env/wikidata/simple_wikidata5m.pkl	0.8484110241260808	0.011962436995383392
task_a_germ_evl	./test_env/wikidata/distmult_wikidata5m.pkl	0.8393935889618567	0.015737535940127514
task_a_germ_evl	./test_env/wikidata/transe_wikidata5m.pkl	0.8691931651726579	0.00948670421130305
task_a_germ_evl	./test_env/wikidata/quate_wikidata5m.pkl	0.8568149695240898	0.008263816286449422
