split,accracy,predicts,macro,micro,weighted,time
train,{'accuracy': 1.0},[1 1 0 ... 0 1 0],{'f1': 1.0},{'f1': 1.0},{'f1': 1.0},213.0737121105194
dev,{'accuracy': 0.9292035398230089},"[1 0 0 1 1 1 1 0 1 0 1 1 1 1 0 0 1 0 1 1 0 0 0 1 1 1 0 0 1 0 1 0 0 1 0 0 1
 1 1 1 0 1 1 0 1 0 0 1 1 0 0 1 1 0 0 0 1 0 1 1 0 0 0 1 1 0 1 1 1 0 1 1 0 0
 0 0 1 1 1 1 1 0 0 1 1 1 1 0 1 0 1 0 0 0 1 0 0 1 0 1 1 1 1 1 1 0 1 1 1 1 1
 0 0 1 0 0 0 0 0 1 1 0 1 1 0 0 0 1 1 1 1 0 0 0 1 1 1 1 0 1 1 0 1 0 0 0 1 0
 1 0 1 0 1 1 1 1 1 0 0 0 0 0 0 0 0 1 1 1 0 1 1 1 1 0 0 0 1 1 1 1 1 1 1 1 1
 1 0 1 1 0 0 0 0 1 1 0 0 1 1 1 1 1 1 1 0 0 0 0 0 0 0 1 1 1 1 1 0 0 0 1 0 1
 0 1 1 1]",{'f1': 0.9285262492093611},{'f1': 0.9292035398230089},{'f1': 0.9290803960750728},213.0737121105194
test,{'accuracy': 0.9559471365638766},"[1 0 1 1 1 1 0 1 1 1 1 1 1 1 0 0 1 1 1 0 0 0 1 0 1 0 1 1 1 0 0 1 1 1 0 0 1
 0 1 0 0 0 1 0 1 1 0 1 0 0 1 1 0 1 0 0 1 0 1 1 1 1 1 1 1 1 0 0 0 1 1 1 1 1
 0 1 0 1 0 1 0 0 1 0 1 1 1 0 0 0 1 0 1 0 1 1 1 0 1 1 1 0 0 1 1 1 1 0 1 0 1
 1 0 1 1 1 0 1 0 1 1 1 1 1 0 0 1 1 1 0 0 1 1 1 1 0 0 0 0 1 1 1 0 1 0 1 0 1
 1 1 0 0 1 0 0 0 1 0 0 0 1 0 1 1 0 1 0 0 0 1 1 0 1 0 1 1 0 1 0 1 1 0 0 0 0
 0 0 0 0 1 0 1 0 1 0 1 0 0 0 1 0 0 1 1 0 1 0 1 1 1 1 1 1 1 1 1 1 0 0 1 0 1
 0 1 1 0 1]",{'f1': 0.9554062549112055},{'f1': 0.9559471365638766},{'f1': 0.9558173249672356},213.0737121105194
final_test,{'accuracy': 0.44878048780487806},"[0 0 1 0 0 1 0 0 0 0 1 1 1 1 1 1 0 1 1 0 0 0 0 0 1 1 0 1 0 0 0 1 1 1 1 0 0
 0 0 1 1 0 0 0 0 0 1 0 1 1 1 1 0 1 1 0 0 0 1 1 0 0 0 1 1 1 0 1 1 0 0 1 1 0
 0 0 1 1 1 0 0 1 1 1 1 0 1 0 0 0 1 1 0 1 1 1 0 0 0 1 1 1 1 1 1 1 1 1 1 0 1
 0 0 0 0 1 0 0 1 1 1 1 1 1 1 1 1 0 0 0 1 1 1 0 1 0 1 0 0 1 0 0 0 1 1 0 1 1
 1 1 1 1 1 1 0 0 1 1 0 0 0 1 1 0 0 1 0 1 1 1 1 1 1 0 1 1 1 0 1 1 1 1 0 0 0
 1 0 0 1 0 0 1 0 1 0 1 0 0 0 1 1 0 1 1 1]",{'f1': 0.3097643097643098},{'f1': 0.44878048780487806},{'f1': 0.6195286195286196},213.0737121105194
