split,accracy,predicts,macro,micro,weighted,time
train,{'accuracy': 1.0},[1 1 0 ... 0 1 0],{'f1': 1.0},{'f1': 1.0},{'f1': 1.0},213.7126898765564
dev,{'accuracy': 0.9336283185840708},"[1 0 0 1 1 1 1 0 1 0 1 1 1 1 0 0 1 0 1 1 0 0 0 1 1 1 0 0 1 0 1 0 0 1 0 0 1
 1 1 1 0 1 1 0 1 0 0 1 1 0 0 1 1 0 0 0 1 0 1 1 0 0 0 1 1 0 1 1 1 0 1 1 0 0
 0 0 1 1 1 1 1 0 0 1 1 1 1 0 1 0 1 0 0 0 1 0 0 1 0 1 1 1 1 1 1 0 1 1 1 1 1
 0 0 1 0 0 0 0 0 1 1 0 1 1 0 1 0 1 1 1 1 0 1 0 1 1 1 1 0 1 1 0 1 0 0 0 1 0
 1 0 1 0 1 1 1 1 1 0 0 0 0 0 1 0 0 1 1 1 0 1 1 1 1 0 0 0 1 1 1 1 1 1 1 1 1
 1 0 1 1 0 0 0 0 0 1 0 0 1 1 1 1 1 1 1 0 0 0 0 0 1 0 1 1 1 1 1 0 0 0 1 0 1
 0 1 1 1]",{'f1': 0.9328060890765297},{'f1': 0.9336283185840708},{'f1': 0.9333980943219593},213.7126898765564
test,{'accuracy': 0.9383259911894273},"[1 0 1 1 1 1 0 1 1 1 1 1 1 1 0 0 1 1 1 0 0 0 1 0 1 0 1 1 1 0 0 1 1 1 0 0 1
 0 1 1 0 0 1 0 1 1 0 1 0 0 1 1 0 1 0 0 1 0 1 1 1 1 1 1 1 1 0 0 0 1 1 1 1 1
 0 1 0 1 0 1 0 0 1 0 1 1 1 0 0 0 1 0 1 0 1 1 1 0 1 1 1 0 0 1 1 1 1 0 1 0 1
 1 0 1 1 1 0 1 0 1 1 1 1 1 0 0 1 1 1 0 0 1 1 1 1 0 0 0 0 1 1 1 0 1 0 1 0 1
 1 1 0 0 1 0 1 0 1 0 0 0 1 0 1 1 1 1 0 0 1 1 1 0 1 0 1 1 0 1 0 1 1 0 0 0 0
 0 0 0 0 1 0 1 0 1 0 1 0 0 0 1 0 0 1 1 0 1 0 1 1 1 1 1 1 1 1 1 1 0 0 1 0 1
 0 1 1 0 1]",{'f1': 0.9373027146464648},{'f1': 0.9383259911894273},{'f1': 0.9379731372090955},213.7126898765564
final_test,{'accuracy': 0.43902439024390244},"[1 0 1 0 0 1 0 0 0 0 1 1 1 1 1 1 0 1 1 0 0 0 1 0 1 1 0 1 0 0 0 1 1 1 1 0 0
 0 0 1 1 0 0 0 0 0 1 0 1 1 1 1 0 1 1 0 0 0 1 1 0 1 0 1 1 1 0 0 1 0 0 1 1 1
 0 0 1 1 1 0 0 1 1 1 1 0 1 0 0 1 1 1 0 1 0 1 0 0 0 1 1 1 1 1 1 1 1 1 1 0 1
 0 0 1 0 1 0 0 1 1 1 1 1 1 1 1 1 0 0 0 1 1 1 0 1 0 1 0 0 1 0 0 0 1 1 0 1 1
 1 1 1 1 1 1 0 0 1 1 0 0 0 1 1 0 0 1 0 1 1 1 0 0 1 0 1 1 1 0 1 1 1 1 0 0 0
 1 0 0 1 0 0 1 0 1 0 1 0 0 0 1 1 0 1 1 1]",{'f1': 0.3050847457627119},{'f1': 0.43902439024390244},{'f1': 0.6101694915254238},213.7126898765564
