{
  "type": "service_account",
  "project_id": "dh2022-dcd61",
  "private_key_id": "f41fe548f57efea1cf8f652b189466e6679a2fbc",
  "private_key": "-----BEGIN PRIVATE KEY-----\nMIIEvAIBADANBgkqhkiG9w0BAQEFAASCBKYwggSiAgEAAoIBAQC/fLyfEtf9txE+\n4NzAuPD8XA85hOQlrTLL31fEwJgy2IUY402n3Ns1G/EuuCSPfQ4JXOI+NHurlNIc\nGQhSxPvzsNqrpxgxBaiVAQ4OOqbAs619gjknn4NhOGPEna6TCmKBZy5gh/rmEPTU\nZNehG1grghHfk/WL8t6ojGD3ardURfyoMezy2xp7cvT9WH2kcoMy0COW3d5LgTqY\nxxlAw8oHkmIwvSZptu5NvKduHDXSHUcSdgem0ra5WRiMfSMTgnvf1TpzFcXYQryG\nAANCpFNaBjus74um8qSWc967jIS6ISZPTX7b82b6ssvjbZcZQAjSmc6JndKxWg3z\n6MzuaydzAgMBAAECggEAAjBQ6Z9dN6myUt34HmQ4YPIRouGTFNLESPjhd6Up62VD\nlDOMIJYq+hIhMU/Q6/dZqmxU3uTzriDlclIsIOIRufxBOGmqPAYDO/zG/9oJkoKB\nqHSzsySLUf7c6RNSVDaJeYHH6znyrLmJ5Hmbzo9RwS5bhosAgs9NkaI7iehyD86d\n7M7FStmbDK6j/WaIFZ4PSxKsc31hoA2oQR3MaMd02om9VasuGA/THOUmlZp6LHcO\niB2A8vPY6nLLHlWNMp2qIEyTlw5LCpVSktROyco2aDeWJStDdW4ZC7tEXweCrQCE\nAloEdtD8RnQoYGhfdPOjh+0suo0yAmP2zE/IH1g7wQKBgQDfUCaWa03FE7jZv41L\nM9SiuiF0J0wh2bq5EuiKknv/XyXQ5WXb8KxBrX6HJk6lJ5u01JqMdM6ijFWXFQCD\nLv0uwO/tHkdAo3hFKQLPB2u9KFziF+NjE+1MzyNrKn2rtB+ArmrewuYi021d1kkl\n39yDewve3PZ4le6I6Nl7UWjiswKBgQDbhAcz8CBRTvQ2XJyWn1FkGY1kKYjyvFDO\nj5dLiS3GFJaTwIUQKDaHVcFLUleAJTc+QCtKYAzN2LPSjZLcdfIHlpuF+zUUGOH+\nMo0Jr2EeVZ14WrV7nsHs1kc5MrV65y8hE83xzBMCqXbV60I4YkNEJjRqLjNPLRjj\n2ePNn3wIQQKBgBN9k2CdjPQefIvExDhEFdL+G91fcK2jq0Br/g/aKShozYwl+XXw\n05gH5Hs3RLX1dwmZZMPNjhtx1CaTlq/ccgyamlY/xkhF/EFNCwm2xBiGZVT2cMo8\n+wExMw4vbziFSBqbHojCygNQIMOH6Gp912lCXA7fikOMEn2wlQrGWDkxAoGAHhk6\nS5rPM5bZ0WJdbiGmLU17n5I6Xt4HTmtN2WOTzSchhlzNYevBnkjZ2hQOP1na+0Qd\nK3OEDe16qpIS4vuhFf1GkdZh7sGCqzIPOJa9gEVI9Cmr3Kll+a1f0q3rSFDOm4B1\nqoPKz4Cg9K/vQn/mrT93zF9NVbvfP86ud5E4loECgYA71OMvlD/VgrE0cNe+yeaK\nUCyVTi1YCTWS7WZ74msjQYL/PZBRsDvUxEXLX0BaGXjmcUxhZedtT2dKsKXz3Lvx\nKuJCNRB0BpMEdSM2FJdI2+uo4bTU3LMbbuqyCdT3QggiuoAqNF2OceFa0wadQ4YQ\nFVdXKM6BpzPifY10CPh/CA==\n-----END PRIVATE KEY-----\n",
  "client_email": "firebase-adminsdk-ov2fl@dh2022-dcd61.iam.gserviceaccount.com",
  "client_id": "104070884360200369341",
  "auth_uri": "https://accounts.google.com/o/oauth2/auth",
  "token_uri": "https://oauth2.googleapis.com/token",
  "auth_provider_x509_cert_url": "https://www.googleapis.com/oauth2/v1/certs",
  "client_x509_cert_url": "https://www.googleapis.com/robot/v1/metadata/x509/firebase-adminsdk-ov2fl%40dh2022-dcd61.iam.gserviceaccount.com"
}
