﻿;;Količina [kg];;;
;Odpadek;LETO 2018;LETO 2019;LETO 2020;
; 08 03 18   [kg]:;14,45;14,45;37,88;
;12 01 04   [kg]:;0,00;0,00;309,77;
;15 01 01  [kg]:;14.536,97;14.279,00;18.533,58;
; 15 01 06 [kg]:;103.837,08;143.703,00;134.909,88;
;15 01 07 [kg]:;29.399,27;28.490,00;35.100,07;
;15 01 11* [kg]:;0,00;3,00;17,33;
;16 01 03 [kg]:;12.032,04;13.643,00;13.415,23;
;16 01 07* [kg]:;8,83;0,00;0,00;
;17 01 07  [kg]:;0,00;5.136,00;34.764,30;
;17 06 04  [kg]:;0,00;93,09;0,00;
;17 06 05* [kg]:;4.575,86;5.591,82;15.110,11;
;17 08 02 [kg]:;0,00;921,27;2.969,25;
;17 09 04 [kg]:;0,00;3.126,54;0,00;
;19 08 01 [kg]:;1.669,20;1.804,02;5.058,96;
;19 08 02 [kg]:;600,27;5.267,61;953,37;
;19 08 05 [kg]:;63.089,34;77.020,74;78.198,81;
;20 01 01 [kg]:;9.451,36;14.774,51;19.764,29;
;20 01 02 [kg]:;5.819,73;7.508,00;6.461,73;
;20 01 08 [kg]:;13.561,00;12.667,00;13.894,00;
;20 01 10 [kg]:;160,50;0,00;0,00;
;20 01 11 [kg]:;80,25;0,00;0,00;
;20 01 13* [kg]:;168,20;173,00;638,15;
;20 01 14* [kg]:;8,67;0,00;0,00;
;20 01 21* [kg]:;84,74;18,00;114,92;
;20 01 23* [kg]:;2.448,91;3.046,00;3.070,37;
;20 01 25 [kg] ;0,00;8,00;19,10;
;20 01 26* [kg]:;723,69;534,00;1.006,01;
;20 01 27* [kg]:;2.270,75;4.732,00;4.096,60;
;20 01 29* [kg]:;42,53;111,00;468,34;
;21 01 32 [kg]:;0,00;35,00;0,00;
;20 01 33* [kg]:;99,86;79,00;383,64;
;20 01 35* [kg]:;2.515,84;2.624,00;2.149,10;
;20 01 36 [kg]:;5.352,96;6.147,00;9.807,95;
;20 01 38 [kg]:;28.555,20;47.075,00;53.518,73;
;20 01 40 [kg]:;16.398,29;22.533,00;24.453,94;
;20 02 01 [kg]:;22.131,00;20.673,00;20.143,00;
;20 02 03 [kg]:;0,00;0,00;1.871,00;
;20 03 01 [kg]:;176.680,00;169.980,00;167.860,00;
;20 03 07 [kg]:;38.469,00;65.776,00;56.190,00;
;Skupaj celotna količina [kg]:;554.785,79;677.587,04;725.289,39;
;;;;;
;;;;;
;;;;;
;;;;;