﻿ŠT. SETA;IME ZBIRKE;DATA 1;DATA 2;DATA 3;;;;;;
006;Podatki o zbranih odpadkih  (zadnja 3 leta);leto;vrsta odpadka po klasifikaciji;količina (v kg);;;;;;
;;2018;15 01 01;11800;;;;;;
;;2018;15 01 06;43300;;;;;;
;;2018;15 01 07;8660;;;;;;
;;2018;15 01 10*;12;;;;;;
;;2018;16 01 03;1360;;;;;;
;;2018;20 01 01;6200;;;;;;
;;2018;20 01 13*;9;;;;;;
;;2018;20 01 23*;1800;;;;;;
;;2018;20 01 25;29;;;;;;
;;2018;20 01 26*;29;;;;;;
;;2018;20 01 27*;158;;;;;;
;;2018;20 01 29*;1;;;;;;
;;2018;20 01 33*;4;;;;;;
;;2018;20 01 35*;440;;;;;;
;;2018;20 01 36;680;;;;;;
;;2018;20 01 38;40140;;;;;;
;;2018;20 01 40;1180;;;;;;
;;2018;20 03 01;85640;;;;;;
;;2018;20 03 07;71600;;;;;;
;;2019;08 03 18;3;;;;;;
;;2019;13 07 03*;25;;;;;;
;;2019;15 01 01;11760;;;;;;
;;2019;15 01 06;34090;;;;;;
;;2019;15 01 07;16100;;;;;;
;;2019;15 01 10*;54;;;;;;
;;2019;15 01 11*;13;;;;;;
;;2019;16 01 03;1500;;;;;;
;;2019;16 01 03;1500;;;;;;
;;2019;17 01 07;7800;;;;;;
;;2019;17 06 05*;22560;;;;;;
;;2019;20 01 01;5760;;;;;;
;;2019;20 01 13*;125;;;;;;
;;2019;20 01 21*;7;;;;;;
;;2019;20 01 23*;2000;;;;;;
;;2019;20 01 25;85;;;;;;
;;2019;20 01 26*;125;;;;;;
;;2019;20 01 27*;160;;;;;;
;;2019;20 01 28;20;;;;;;
;;2019;20 01 29*;15;;;;;;
;;2019;20 01 33*;16;;;;;;
;;2019;20 01 35*;780;;;;;;
;;2019;20 01 36;1200;;;;;;
;;2019;20 01 38;29860;;;;;;
;;2019;20 01 40;1200;;;;;;
;;2019;20 03 01;60520;;;;;;
;;2019;20 03 07;18980;;;;;;
;;2020;15 01 01;15200;;;;;;
;;2020;15 01 06;33440;;;;;;
;;2020;15 01 07;16320;;;;;;
;;2020;15 01 11*;1;;;;;;
;;2020;16 01 03;1200;;;;;;
;;2020;20 01 01;6400;;;;;;
;;2020;20 01 13*;63;;;;;;
;;2020;20 01 21*;1;;;;;;
;;2020;20 01 23*;820;;;;;;
;;2020;20 01 25;25;;;;;;
;;2020;20 01 26*;130;;;;;;
;;2020;20 01 27*;295;;;;;;
;;2020;20 01 28;13;;;;;;
;;2020;20 01 29*;14;;;;;;
;;2020;20 01 33*;27;;;;;;
;;2020;20 01 35*;1120;;;;;;
;;2020;20 01 36;3340;;;;;;
;;2020;20 01 38;16300;;;;;;
;;2020;20 01 40;2000;;;;;;
;;2020;20 02 01;1460;;;;;;
;;2020;20 02 03;1220;;;;;;
;;2020;20 03 01;54760;;;;;;
;;2020;20 03 07;14100;;;;;;