link,status,region
https://www.podarimo.si/268173-plinski-stedilnik-32b1-z-pecico,active,"Gorenjska, Goriška
"
https://www.podarimo.si/251137-mikrovalovna-pecica,active,Osrednjeslovenska
https://www.podarimo.si/259313-stedilnik-sa-pecnicom,active,Pomurska