﻿;;;Količina [kg];;;
;Podatki o zbranih odpadkih ;Odpadek;LETO 2018;LETO 2019;LETO 2020;
;; 08 03 18   [kg]:;77,85;61,25;160,60;
;;12 01 04   [kg]:;0,00;0,00;1.313,37;
;;15 01 01  [kg]:;61.634,93;60.541,00;78.580,06;
;; 15 01 06 [kg]:;440.256,28;609.283,00;572.001,08;
;;15 01 07 [kg]:;124.649,23;120.792,00;148.819,91;
;;15 01 11* [kg]:;0,00;12,00;73,49;
;;16 01 03 [kg]:;51.014,36;57.847,00;56.878,91;
;;16 01 07* [kg]:;37,43;0,00;0,00;
;;17 01 07  [kg]:;0,00;21.776,00;147.396,30;
;;17 06 04  [kg]:;0,00;397,30;0,00;
;;17 06 05* [kg]:;19.401,06;23.708,62;64.064,99;
;;17 08 02 [kg]:;0,00;3.906,07;12.589,25;
;;17 09 04 [kg]:;0,00;13.256,14;0,00;
;;19 08 01 [kg]:;7.077,20;7.648,82;21.449,36;
;;19 08 02 [kg]:;2.545,07;22.334,01;4.042,17;
;;19 08 05 [kg]:;267.490,94;326.558,34;331.553,21;
;;20 01 01 [kg]:;40.072,60;62.642,07;83.798,13;
;;20 01 02 [kg]:;24.674,93;31.834,00;27.396,93;
;;20 01 08 [kg]:;89.409,00;83.519,00;91.600,00;
;;20 01 10 [kg]:;680,50;0,00;0,00;
;;20 01 11 [kg]:;340,25;0,00;0,00;
;;20 01 13* [kg]:;713,16;734,00;2.705,67;
;;20 01 14* [kg]:;36,75;0,00;0,00;
;;20 01 21* [kg]:;359,30;76,00;487,24;
;;20 01 23* [kg]:;10.383,07;12.916,00;13.017,97;
;;20 01 25 [kg] ;0,00;33,00;80,98;
;;20 01 26* [kg]:;3.068,37;2.263,00;4.265,37;
;;20 01 27* [kg]:;9.627,71;20.061,00;17.369,08;
;;20 01 29* [kg]:;180,33;469,00;1.985,70;
;;21 01 32 [kg]:;0,00;148,00;0,00;
;;20 01 33* [kg]:;423,41;336,00;1.626,60;
;;20 01 35* [kg]:;10.666,84;11.126,00;9.111,90;
;;20 01 36 [kg]:;22.695,90;26.062,00;41.584,47;
;;20 01 38 [kg]:;121.070,48;199.591,00;226.912,73;
;;20 01 40 [kg]:;69.526,69;95.535,00;103.681,66;
;;20 02 01 [kg]:;145.916,00;136.304,00;132.811,00;
;;20 02 03 [kg]:;0,00;0,00;7.934,63;
;;20 03 01 [kg]:;1.016.460,00;1.033.000,00;1.024.760,00;
;;20 03 07 [kg]:;163.102,00;278.883,00;323.200,00;
;;Skupaj celotna količina [kg]:;2.703.591,63;3.263.653,61;3.553.252,74;
;;;;;;
;;;;;;
;;;;;;
;;;;;;