split,accracy,macro,micro,weighted,time
train,{'accuracy': 0.9998442367601246},{'f1': 0.9998438936104317},{'f1': 0.9998442367601246},{'f1': 0.9998442356200924},1998.5450687408447
dev,{'accuracy': 0.9766355140186916},{'f1': 0.9765489731956956},{'f1': 0.9766355140186916},{'f1': 0.9766155430595386},1998.5450687408447
test,{'accuracy': 0.9813084112149533},{'f1': 0.9812474642453113},{'f1': 0.9813084112149533},{'f1': 0.9812974207778047},1998.5450687408447
