channels,drop,split,micro,macro,weight,train_time,inference_time
4,0.003,train,0.778816199376947,0.7770588019515059,0.7761338559381158,8.58943796157837,0.19007635116577148
4,0.003,dev,0.747196261682243,0.7444710698582733,0.7432379513858887,8.58943796157837,0.15540027618408203
4,0.003,test,0.7649532710280373,0.7627332864422138,0.76166083012056,8.58943796157837,0.15621519088745117
4,0.1,train,0.733177570093458,0.7278408770457698,0.7260600006116138,2.0631909370422363,0.1889338493347168
4,0.1,dev,0.7322429906542057,0.726691295698835,0.724871067844615,2.0631909370422363,0.15869712829589844
4,0.1,test,0.7065420560747664,0.6993938309437,0.6972277021161041,2.0631909370422363,0.1575329303741455
4,0.3,train,0.7302180685358255,0.7233715540982628,0.7213379359484916,3.605656862258911,2.0803301334381104
4,0.3,dev,0.7294392523364485,0.7228896181228124,0.7208988478451114,3.605656862258911,0.15929532051086426
4,0.3,test,0.7158878504672896,0.7075185745666683,0.7052066198979884,3.605656862258911,0.13041210174560547
4,0.6,train,0.7453271028037385,0.74218272715396,0.7408522438042654,2.851083755493164,0.19017672538757324
4,0.6,dev,0.7224299065420562,0.7180072834142601,0.7163570509038886,2.851083755493164,0.1608736515045166
4,0.6,test,0.7233644859813083,0.7202999763325315,0.718931891667899,2.851083755493164,0.15761923789978027
8,0.003,train,0.7048286604361371,0.688426703521025,0.6850861827643828,9.369598865509033,0.19037961959838867
8,0.003,dev,0.6995327102803738,0.6825478853174763,0.679116607547194,9.369598865509033,0.16482830047607422
8,0.003,test,0.6892523364485982,0.6703063248317881,0.6666131451793885,9.369598865509033,0.15646767616271973
8,0.1,train,0.6618380062305296,0.6614440494088202,0.6619837162878742,2.2074825763702393,0.18796801567077637
8,0.1,dev,0.6509345794392524,0.6505499218613204,0.6510916930978442,2.2074825763702393,0.16241216659545898
8,0.1,test,0.647196261682243,0.6471018647445873,0.6473715702807463,2.2074825763702393,0.15486884117126465
8,0.3,train,0.7990654205607477,0.7968126340548876,0.7978123913799734,8.549179553985596,0.1984868049621582
8,0.3,dev,0.777570093457944,0.7743917942611921,0.7756430931575511,8.549179553985596,0.16976642608642578
8,0.3,test,0.7827102803738317,0.7801485957767587,0.7812575501477861,8.549179553985596,0.16271591186523438
8,0.6,train,0.7040498442367601,0.6985133281429576,0.6966041846623362,2.991178274154663,2.697988986968994
8,0.6,dev,0.6981308411214954,0.6922428931180522,0.6902537214952672,2.991178274154663,0.14477896690368652
8,0.6,test,0.6976635514018692,0.6911404479130487,0.6890429869841675,2.991178274154663,0.1360771656036377
16,0.003,train,0.7965732087227414,0.7964560891443733,0.7962279341215782,8.399949312210083,0.17693066596984863
16,0.003,dev,0.7841121495327101,0.7838536952649294,0.7835044327409012,8.399949312210083,0.14302802085876465
16,0.003,test,0.7691588785046729,0.7689522290877683,0.7686293393738547,8.399949312210083,0.1429147720336914
16,0.1,train,0.794392523364486,0.7935339462995301,0.7929117890060838,8.42214584350586,0.1578845977783203
16,0.1,dev,0.791588785046729,0.7906929824561404,0.7900531234628628,8.42214584350586,0.13848257064819336
16,0.1,test,0.7728971962616823,0.7718642188053866,0.7711468733496258,8.42214584350586,0.1320209503173828
16,0.3,train,0.8149532710280374,0.814932508611131,0.8150241075092475,6.169422626495361,0.16460704803466797
16,0.3,dev,0.8018691588785046,0.8018663899574106,0.8018317784437339,6.169422626495361,0.1325390338897705
16,0.3,test,0.7929906542056075,0.7929851845592042,0.7930349086174157,6.169422626495361,0.13127827644348145
16,0.6,train,0.6890965732087228,0.6886244074073173,0.6891910063690038,2.6693694591522217,0.4304666519165039
16,0.6,dev,0.6934579439252336,0.6928903449820789,0.6935073003550731,2.6693694591522217,0.13417339324951172
16,0.6,test,0.6934579439252336,0.6932167832167832,0.6936187177308671,2.6693694591522217,0.13294553756713867
32,0.003,train,0.8168224299065421,0.8166224677601881,0.8169054330616323,8.590717077255249,0.15996670722961426
32,0.003,dev,0.8032710280373832,0.8031987896684061,0.8033749808122526,8.590717077255249,0.1340925693511963
32,0.003,test,0.797196261682243,0.7969912847630238,0.7972927214089344,8.590717077255249,0.13259363174438477
32,0.1,train,0.7742990654205607,0.7731292690625684,0.7738905248269886,2.92844295501709,0.1593632698059082
32,0.1,dev,0.7728971962616823,0.7715882527085517,0.7723962425561631,2.92844295501709,0.13327813148498535
32,0.1,test,0.7630841121495328,0.7619914117898685,0.7627449982448093,2.92844295501709,0.1340317726135254
32,0.3,train,0.7906542056074768,0.7889908660724112,0.7881154242118504,8.346845626831055,0.16301870346069336
32,0.3,dev,0.7859813084112149,0.7843167286350065,0.7834313138604274,8.346845626831055,0.13634395599365234
32,0.3,test,0.7728971962616823,0.7713150374809032,0.7704261842332746,8.346845626831055,0.13187146186828613
32,0.6,train,0.8161993769470405,0.8161993055965318,0.8161939543083726,8.316284894943237,0.16544222831726074
32,0.6,dev,0.8098130841121496,0.8098080589516843,0.809762375674727,8.316284894943237,0.1581263542175293
32,0.6,test,0.7990654205607477,0.7990591022165079,0.7990064493478424,8.316284894943237,0.1544485092163086
64,0.003,train,0.5637071651090343,0.5468286191077661,0.5509154341201797,2.310224771499634,0.16616320610046387
64,0.003,dev,0.5672897196261683,0.5517864396873606,0.5556817361543976,2.310224771499634,0.14255189895629883
64,0.003,test,0.5406542056074767,0.5267351809743772,0.5305278307381646,2.310224771499634,0.1395118236541748
64,0.1,train,0.807632398753894,0.8073425880912511,0.8076917575643148,6.271940231323242,0.16742587089538574
64,0.1,dev,0.7953271028037383,0.7950686340357653,0.7954087245199404,6.271940231323242,0.1410074234008789
64,0.1,test,0.7850467289719625,0.7848164906988437,0.7851454025175851,6.271940231323242,0.13945865631103516
64,0.3,train,0.7753894080996885,0.7668306320601459,0.7689181384112538,9.763219833374023,0.1637105941772461
64,0.3,dev,0.7714953271028038,0.76229562377807,0.7644808264680306,9.763219833374023,0.13882207870483398
64,0.3,test,0.764018691588785,0.7552527134065212,0.7574171524638703,9.763219833374023,0.14139151573181152
64,0.6,train,0.7585669781931464,0.7581580288909653,0.7586227440070801,3.4800286293029785,0.16813445091247559
64,0.6,dev,0.7542056074766355,0.7538263163788036,0.7542778534000321,3.4800286293029785,0.13857293128967285
64,0.6,test,0.7434579439252337,0.7432210474551266,0.7435855035629835,3.4800286293029785,0.13721370697021484
128,0.003,train,0.6989096573208723,0.6796279408376367,0.675955232936068,21.360682010650635,0.20287299156188965
128,0.003,dev,0.6934579439252336,0.6722805523495774,0.6683876494864053,21.360682010650635,0.1602165699005127
128,0.003,test,0.6883177570093458,0.6675389408099688,0.6636550499315806,21.360682010650635,0.15723824501037598
128,0.1,train,0.8294392523364486,0.829291304303166,0.8295261424512336,14.34625792503357,0.17690539360046387
128,0.1,dev,0.8168224299065421,0.816744959874731,0.8169210281288473,14.34625792503357,0.14921116828918457
128,0.1,test,0.8046728971962617,0.8045826047671604,0.8047788926565111,14.34625792503357,0.1478431224822998
128,0.3,train,0.8129283489096574,0.8123545964231284,0.81283945767935,11.051265716552734,0.18080592155456543
128,0.3,dev,0.8037383177570093,0.8031797808612264,0.80366972550665,11.051265716552734,0.1492750644683838
128,0.3,test,0.7897196261682243,0.7890339727597511,0.7895959837503029,11.051265716552734,0.15102863311767578
128,0.6,train,0.7401869158878505,0.7386770193441126,0.7377488042557493,3.006028890609741,0.17934894561767578
128,0.6,dev,0.7322429906542057,0.7306024042387577,0.7296200171636392,3.006028890609741,0.15226340293884277
128,0.6,test,0.7154205607476636,0.7137186633350723,0.7126872103577443,3.006028890609741,0.1497669219970703
256,0.003,train,0.8348909657320872,0.8347639449547255,0.8349780249165712,21.678792476654053,0.23350286483764648
256,0.003,dev,0.822429906542056,0.822379641019906,0.8225192674703228,21.678792476654053,0.18195366859436035
256,0.003,test,0.8210280373831775,0.8209745205080303,0.821119160711131,21.678792476654053,0.20114421844482422
256,0.1,train,0.7797507788161994,0.778523016393417,0.7792935785834478,5.922392129898071,0.2045903205871582
256,0.1,dev,0.7691588785046729,0.7676226182175637,0.768505526428546,5.922392129898071,0.18739056587219238
256,0.1,test,0.7635514018691589,0.7623205507427318,0.7631198047209311,5.922392129898071,0.17035317420959473
256,0.3,train,0.6730529595015576,0.6639789045186346,0.6613986045234906,4.389416456222534,0.24219107627868652
256,0.3,dev,0.6682242990654206,0.6599406809780746,0.6574605558022225,4.389416456222534,0.21715259552001953
256,0.3,test,0.6467289719626168,0.6367901103746416,0.6339825223554396,4.389416456222534,0.1864159107208252
256,0.6,train,0.7672897196261682,0.7669694640561038,0.7665657805644258,5.707841873168945,0.23301196098327637
256,0.6,dev,0.7579439252336448,0.7574558286568481,0.7569473947226848,5.707841873168945,0.19974756240844727
256,0.6,test,0.7429906542056075,0.7423585336019634,0.7417621934098464,5.707841873168945,0.19020509719848633
512,0.003,train,0.8113707165109034,0.8102609036429955,0.8095828102410151,39.267961740493774,0.29415130615234375
512,0.003,dev,0.7901869158878505,0.7886071006242609,0.787753146427726,39.267961740493774,0.24935293197631836
512,0.003,test,0.7934579439252336,0.7918857717176928,0.7910405178426707,39.267961740493774,0.24190783500671387
512,0.1,train,0.5917445482866044,0.530726556121613,0.5228192569209662,39.46230387687683,0.2938954830169678
512,0.1,dev,0.5883177570093457,0.5250600873278402,0.5169605137450609,39.46230387687683,0.24070024490356445
512,0.1,test,0.585981308411215,0.5221764905712492,0.5140173067042458,39.46230387687683,0.22588658332824707
512,0.3,train,0.7512461059190031,0.7511916252855222,0.7510195811797934,12.303529500961304,0.24980545043945312
512,0.3,dev,0.7420560747663552,0.7420119087554512,0.7418541730022228,12.303529500961304,0.2399137020111084
512,0.3,test,0.7275700934579439,0.7272698854687414,0.7268470573149349,12.303529500961304,0.22632908821105957
512,0.6,train,0.7492211838006231,0.7477877194516714,0.7486762304117655,13.280231952667236,0.2639036178588867
512,0.6,dev,0.7453271028037385,0.7437666846599005,0.7447010667819591,13.280231952667236,0.22545480728149414
512,0.6,test,0.7411214953271027,0.7401024718281393,0.7408629371258734,13.280231952667236,0.22853517532348633
