split,accracy,macro,micro,weighted,time
train,{'accuracy': 1.0},{'f1': 1.0},{'f1': 1.0},{'f1': 1.0},270.2584812641144
dev,{'accuracy': 0.9772727272727273},{'f1': 0.976731159339855},{'f1': 0.9772727272727273},{'f1': 0.9773491477048788},270.2584812641144
test,{'accuracy': 0.9829545454545454},{'f1': 0.9868494041170097},{'f1': 0.9829545454545454},{'f1': 0.9829240043993565},270.2584812641144
