split,accracy,macro,micro,weighted,time
train,{'accuracy': 1.0},{'f1': 1.0},{'f1': 1.0},{'f1': 1.0},657.4728047847748
dev,{'accuracy': 0.7140740740740741},{'f1': 0.7140113056363537},{'f1': 0.7140740740740741},{'f1': 0.7140175824801257},657.4728047847748
test,{'accuracy': 0.7588888888888888},{'f1': 0.7588814469582396},{'f1': 0.7588888888888888},{'f1': 0.7588814469582397},657.4728047847748
