split,accracy,macro,micro,weighted,time
train,{'accuracy': 1.0},{'f1': 1.0},{'f1': 1.0},{'f1': 1.0},100.92441940307617
dev,{'accuracy': 0.7333333333333333},{'f1': 0.7333333333333333},{'f1': 0.7333333333333333},{'f1': 0.7333333333333333},100.92441940307617
test,{'accuracy': 0.57},{'f1': 0.567882624861823},{'f1': 0.57},{'f1': 0.567882624861823},100.92441940307617
