split,accracy,macro,micro,weighted,time
train,{'accuracy': 1.0},{'f1': 1.0},{'f1': 1.0},{'f1': 1.0},260.0303089618683
dev,{'accuracy': 0.9659090909090909},{'f1': 0.967292722790105},{'f1': 0.9659090909090909},{'f1': 0.9659899921680027},260.0303089618683
test,{'accuracy': 0.9914772727272727},{'f1': 0.9934703067830003},{'f1': 0.9914772727272727},{'f1': 0.9914809507970216},260.0303089618683
