channels,drop,split,micro,macro,weight,train_time,inference_time
4,0.003,train,0.015372002459520393,0.004284762378305134,0.0013542935820414874,2.3039822578430176,0.16767287254333496
4,0.003,dev,0.01782421634910879,0.0049775847532029125,0.0015580346558284445,2.3039822578430176,0.1353163719177246
4,0.003,test,0.016136468418626097,0.004513468013468014,0.0014099004490890153,2.3039822578430176,0.1291501522064209
4,0.1,train,0.09653617544578807,0.01464624147633316,0.026696062287761783,2.173945426940918,0.16837716102600098
4,0.1,dev,0.0977258758451137,0.013484295509842956,0.026446520757396983,2.173945426940918,0.1301133632659912
4,0.1,test,0.09681881051175657,0.013277332492166439,0.026170372618112947,2.173945426940918,0.1293048858642578
4,0.3,train,0.029924164787866366,0.007154593447844734,0.00292806723994789,2.2371373176574707,0.16058635711669922
4,0.3,dev,0.024585125998770743,0.005865975422427035,0.002353053361241794,2.2371373176574707,0.1337437629699707
4,0.3,test,0.021668971876440755,0.0051706603424433745,0.0020827088452727185,2.2371373176574707,0.13526582717895508
4,0.6,train,0.09100225456036073,0.02910670070533066,0.06774961323719508,2.699493646621704,0.16619491577148438
4,0.6,dev,0.0842040565457898,0.028165013395212667,0.06463971815956666,2.699493646621704,0.1294703483581543
4,0.6,test,0.0958967266021208,0.029140913196165602,0.0716744700837227,2.699493646621704,0.12927913665771484
8,0.003,train,0.13465874154539864,0.042151263168517035,0.09216208078046739,9.508779525756836,0.16164398193359375
8,0.003,dev,0.13829133374308544,0.04399055628662212,0.09932871093749052,9.508779525756836,0.13538169860839844
8,0.003,test,0.14153988012909174,0.0504808380419331,0.10206493061206284,9.508779525756836,0.1383073329925537
8,0.1,train,0.07604017216642754,0.028744220662832352,0.05424252830803365,9.148535013198853,0.1678309440612793
8,0.1,dev,0.06822372464658881,0.02546192522702511,0.05187332004122294,9.148535013198853,0.13213658332824707
8,0.1,test,0.07422775472568004,0.02621095894101573,0.05600673737926122,9.148535013198853,0.1332697868347168
8,0.3,train,0.12031153924984629,0.02376487721663362,0.06760672463329326,2.2947096824645996,0.16642451286315918
8,0.3,dev,0.11247695144437615,0.022387063963955966,0.06711126691044093,2.2947096824645996,0.1309044361114502
8,0.3,test,0.11018902720147533,0.021787147088910438,0.06425989680575526,2.2947096824645996,0.13077139854431152
8,0.6,train,0.06394753023160483,0.022488369559648967,0.053188224430734475,2.1716878414154053,0.16465997695922852
8,0.6,dev,0.06699446834665028,0.023089318211798653,0.05530519258242466,2.1716878414154053,0.1297159194946289
8,0.6,test,0.07284462886122638,0.026313429200654947,0.06162831754209121,2.1716878414154053,0.13891124725341797
16,0.003,train,0.11211313793810207,0.04714553387340122,0.10128549973405358,8.611883640289307,0.13501834869384766
16,0.003,dev,0.11063306699446834,0.04642552999868254,0.10327779084336862,8.611883640289307,0.1102147102355957
16,0.003,test,0.11387736284001844,0.051910527663450425,0.10637257939568158,8.611883640289307,0.11429619789123535
16,0.1,train,0.18179954908792786,0.053159438604703436,0.14111085889241837,8.489314079284668,0.13932180404663086
16,0.1,dev,0.17455439459127228,0.05008884383043265,0.13491540549705605,8.489314079284668,0.11235475540161133
16,0.1,test,0.17289073305670816,0.047162147018572985,0.129442562223075,8.489314079284668,0.11186766624450684
16,0.3,train,0.005533920885427342,0.0012911585455356775,0.00010919259977322854,2.423989772796631,0.6572506427764893
16,0.3,dev,0.0036877688998156115,0.0008015538565911699,6.879363973732327e-05,2.423989772796631,0.11230683326721191
16,0.3,test,0.005532503457814662,0.0014988392098732538,0.001008608341856878,2.423989772796631,0.11127686500549316
16,0.6,train,0.07276081164172986,0.021537057242026047,0.04118006422163371,3.258812665939331,0.13774514198303223
16,0.6,dev,0.06760909649661954,0.02174301887145639,0.038876139639801105,3.258812665939331,0.1101996898651123
16,0.6,test,0.0792992162286768,0.02240202891424018,0.04485488251217911,3.258812665939331,0.10971450805664062
32,0.003,train,0.0893625742980119,0.03294287548224671,0.05689740792294348,7.2573487758636475,0.13849163055419922
32,0.003,dev,0.0977258758451137,0.032411640881444645,0.055246712533120974,7.2573487758636475,0.10981631278991699
32,0.003,test,0.0954356846473029,0.033030900489105175,0.06161795833201527,7.2573487758636475,0.10981416702270508
32,0.1,train,0.14736626357860216,0.03986345514870205,0.09159276203322315,8.107742547988892,0.136704683303833
32,0.1,dev,0.1530424093423479,0.038461270356070436,0.09292787264354002,8.107742547988892,0.11058878898620605
32,0.1,test,0.15306592899953897,0.0455372915184515,0.1024931636391125,8.107742547988892,0.11026191711425781
32,0.3,train,0.19819635171141628,0.040646868656726225,0.10102834145134827,4.777791738510132,0.8346884250640869
32,0.3,dev,0.19053472649047326,0.029200755652861628,0.0914180830437745,4.777791738510132,0.11340999603271484
32,0.3,test,0.198248040571692,0.03637317094749657,0.10189652683393306,4.777791738510132,0.11014723777770996
32,0.6,train,0.15167042426726787,0.043261854431586824,0.10606169582475766,6.588598251342773,0.13560724258422852
32,0.6,dev,0.14935464044253227,0.040382971598769836,0.1012326804873265,6.588598251342773,0.10951447486877441
32,0.6,test,0.14384508990318118,0.04032858885244027,0.10047870938163427,6.588598251342773,0.10950708389282227
64,0.003,train,0.18384914941586394,0.0521337353684519,0.137094490375099,8.549248456954956,0.14031481742858887
64,0.003,dev,0.18623232944068838,0.051699252092121326,0.141172331032435,8.549248456954956,0.11494302749633789
64,0.003,test,0.20378054402950668,0.05795373884327342,0.15348054098860872,8.549248456954956,0.11388516426086426
64,0.1,train,0.15453986472637835,0.0514279255752496,0.11884999916489444,9.040446996688843,0.14125657081604004
64,0.1,dev,0.16164720344191763,0.05658132198223624,0.1259191529419764,9.040446996688843,0.11490511894226074
64,0.1,test,0.15952051636698938,0.05678865095481722,0.12436491389793995,9.040446996688843,0.11257719993591309
64,0.3,train,0.1295347407255585,0.0464104943781685,0.0911276817589735,10.698428630828857,0.14119434356689453
64,0.3,dev,0.107559926244622,0.03595913196184372,0.07860673446248957,10.698428630828857,0.11909604072570801
64,0.3,test,0.1313969571230982,0.045148113450093584,0.09321461760381598,10.698428630828857,0.12203454971313477
64,0.6,train,0.11600737856118057,0.023285954288207292,0.03698366570116391,8.990551471710205,0.1392805576324463
64,0.6,dev,0.11432083589428396,0.022163244567401316,0.03492467580127222,8.990551471710205,0.11424469947814941
64,0.6,test,0.11664361456892577,0.02041156015490434,0.03807602730719636,8.990551471710205,0.11306500434875488
128,0.003,train,0.13199426111908177,0.04035130707932811,0.08848508352041404,8.195580244064331,0.14913678169250488
128,0.003,dev,0.1210817455439459,0.036456617131674564,0.07837357628206695,8.195580244064331,0.11974263191223145
128,0.003,test,0.12863070539419086,0.03800402224580022,0.08564527083949516,8.195580244064331,0.12113189697265625
128,0.1,train,0.0744004919040787,0.018466326088107353,0.03290705785389933,3.126577377319336,0.14522385597229004
128,0.1,dev,0.08113091579594345,0.020022802589594428,0.0354910724547061,3.126577377319336,0.11977338790893555
128,0.1,test,0.07653296449976948,0.020626084071151116,0.03843015926811641,3.126577377319336,0.12113022804260254
128,0.3,train,0.06866161098585775,0.028675047021158962,0.03416140741052379,11.126437664031982,0.14561963081359863
128,0.3,dev,0.07129686539643516,0.028123351889142372,0.046261945989730865,11.126437664031982,0.12204980850219727
128,0.3,test,0.07745504840940526,0.030749504958852984,0.04403633280954773,11.126437664031982,0.12999606132507324
128,0.6,train,0.20577987292477964,0.04935373880673074,0.12656008600955987,11.620197057723999,0.15149927139282227
128,0.6,dev,0.20897357098955133,0.053077261233262694,0.13201947724467886,11.620197057723999,0.12705469131469727
128,0.6,test,0.2000922083909636,0.04846619477226872,0.12462076594293847,11.620197057723999,0.12288451194763184
256,0.003,train,0.14429186308669809,0.03800328355885867,0.09510800003617322,11.137783288955688,0.16881656646728516
256,0.003,dev,0.14689612784265518,0.038425211163408766,0.09780600938828636,11.137783288955688,0.13917040824890137
256,0.003,test,0.16643614568925771,0.04447158241385458,0.11349134560076629,11.137783288955688,0.13538622856140137
256,0.1,train,0.03197376511580242,0.004579125584915147,0.0034580954561273234,3.4365386962890625,0.1986091136932373
256,0.1,dev,0.03196066379840197,0.004411089613063302,0.0031010808321641162,3.4365386962890625,0.16350054740905762
256,0.1,test,0.03227293683725219,0.004698609859295979,0.0036695757257428525,3.4365386962890625,0.16804814338684082
256,0.3,train,0.19266243082598894,0.045132405746734744,0.12563098518324164,18.615360498428345,0.1923205852508545
256,0.3,dev,0.1960663798401967,0.04762839210449415,0.13405343978843873,18.615360498428345,0.1650078296661377
256,0.3,test,0.1987090825265099,0.04700782572693944,0.13203564743706445,18.615360498428345,0.16247177124023438
256,0.6,train,0.027054724328755893,0.004123045195643087,0.0024853080544490432,4.912180423736572,0.19038152694702148
256,0.6,dev,0.026429010448678545,0.004050571545213309,0.002457320730633411,4.912180423736572,0.1708378791809082
256,0.6,test,0.026279391424619644,0.0032342260553790284,0.0013837537018864632,4.912180423736572,0.1687641143798828
512,0.003,train,0.18466898954703834,0.04454651414097405,0.1219011607901938,32.30450654029846,0.25598669052124023
512,0.003,dev,0.19053472649047326,0.04646730073831093,0.12587261325186597,32.30450654029846,0.21449923515319824
512,0.003,test,0.18994928538497002,0.046214082744261066,0.12621715610207201,32.30450654029846,0.2150728702545166
512,0.1,train,0.08095921295347407,0.010476369451016022,0.015947637579607713,5.465823173522949,0.2061779499053955
512,0.1,dev,0.08051628764597418,0.010229143887326878,0.015229087714022989,5.465823173522949,0.18879318237304688
512,0.1,test,0.08160442600276625,0.010787704837601804,0.01695757640409805,5.465823173522949,0.2170870304107666
512,0.3,train,0.1787251485960238,0.03572301892267693,0.09176576010746332,32.27996277809143,0.24569082260131836
512,0.3,dev,0.17885679164105717,0.03587123724767931,0.09315085129932095,32.27996277809143,0.21548819541931152
512,0.3,test,0.194098662978331,0.04089740058135177,0.1063068286613362,32.27996277809143,0.21157455444335938
512,0.6,train,0.14982578397212543,0.05451287140286749,0.12772078242691268,32.64643979072571,0.25020575523376465
512,0.6,dev,0.15488629379225569,0.05442473260153241,0.13500970686536226,32.64643979072571,0.21457481384277344
512,0.6,test,0.1636698939603504,0.0619883922536085,0.13842286480576596,32.64643979072571,0.21294164657592773
