channels,drop,split,micro,macro,weight,train_time,inference_time
4,0.003,train,0.17257634761221563,0.03221910059743041,0.087515588899389,4.740705728530884,0.1668076515197754
4,0.003,dev,0.16103257529194837,0.02911976706581906,0.08239695013501654,4.740705728530884,0.12987971305847168
4,0.003,test,0.1673582295988935,0.031369964945812366,0.08701451083099807,4.740705728530884,0.13039541244506836
4,0.1,train,0.02295552367288379,0.008071612258705296,0.0038629539421230438,2.269990921020508,0.16512823104858398
4,0.1,dev,0.023970497848801474,0.0063978662956907855,0.0024487484576741934,2.269990921020508,0.12904572486877441
4,0.1,test,0.02581834946980175,0.00782649435963832,0.002672138473464732,2.269990921020508,0.12737536430358887
4,0.3,train,0.19491699118671857,0.02590462635605558,0.07323459370174053,2.006906509399414,0.15200304985046387
4,0.3,dev,0.19053472649047326,0.022058680515034818,0.07041015305357483,2.006906509399414,0.1322476863861084
4,0.3,test,0.18856615952051636,0.020474569483380056,0.06917364922739007,2.006906509399414,0.12794709205627441
4,0.6,train,0.10043041606886657,0.022413524746977904,0.040524173563338824,2.4254655838012695,0.1647186279296875
4,0.6,dev,0.09956976029502151,0.02019303160967123,0.0376857428175286,2.4254655838012695,0.13099122047424316
4,0.6,test,0.0958967266021208,0.022301289037421464,0.03747079752713495,2.4254655838012695,0.13579034805297852
8,0.003,train,0.06722689075630252,0.015881691516199344,0.015317657114743094,2.255328416824341,0.16777658462524414
8,0.003,dev,0.0645359557467732,0.013422355625187257,0.014126501482307787,2.255328416824341,0.131880521774292
8,0.003,test,0.06500691562932227,0.013963090682034414,0.01426728758013865,2.255328416824341,0.13886308670043945
8,0.1,train,0.17462594794015168,0.027511567528089385,0.08115626122651486,2.5773110389709473,0.14305901527404785
8,0.1,dev,0.17148125384142593,0.026656245204848855,0.07847812147304403,2.5773110389709473,0.11603474617004395
8,0.1,test,0.18626094974642693,0.03191645410886132,0.09607913741846898,2.5773110389709473,0.1165773868560791
8,0.3,train,0.09530641524902643,0.02005299190310052,0.041752049252903746,2.884058713912964,0.16650986671447754
8,0.3,dev,0.0977258758451137,0.020321087607898716,0.04197800349425015,2.884058713912964,0.1308581829071045
8,0.3,test,0.09266943291839559,0.018929995089631734,0.038350064267034,2.884058713912964,0.1309962272644043
8,0.6,train,0.10104529616724739,0.019443180364718444,0.04414706726612256,2.9143781661987305,0.19112873077392578
8,0.6,dev,0.10079901659496004,0.017453619588934755,0.04426756596302069,2.9143781661987305,0.13523554801940918
8,0.6,test,0.10189027201475334,0.017925762047951134,0.04411794738271448,2.9143781661987305,0.12938690185546875
16,0.003,train,0.16888706702193074,0.07603786210011125,0.160368651010408,8.95066499710083,0.13408422470092773
16,0.003,dev,0.16963736939151813,0.07695477078843849,0.16483751996316443,8.95066499710083,0.1132209300994873
16,0.003,test,0.15306592899953897,0.06315335487961991,0.14617926113601512,8.95066499710083,0.1081535816192627
16,0.1,train,0.09817585570813693,0.040897120813097196,0.08911037462272806,10.688939571380615,0.13590312004089355
16,0.1,dev,0.09342347879532882,0.03857096039734278,0.08758144698586569,10.688939571380615,0.11283206939697266
16,0.1,test,0.09451360073766712,0.041106894476805364,0.08639080572182033,10.688939571380615,0.11299872398376465
16,0.3,train,0.16253330600532895,0.03302438888353834,0.08599445664032444,8.720094442367554,0.13517379760742188
16,0.3,dev,0.14996926859250154,0.030573254598783735,0.08091914759327959,8.720094442367554,0.1086125373840332
16,0.3,test,0.15168280313508528,0.030220186528597745,0.0768477171694986,8.720094442367554,0.10753512382507324
16,0.6,train,0.09387169501947121,0.033508468863069116,0.08778961431292567,2.0565755367279053,0.13473200798034668
16,0.6,dev,0.10633066994468347,0.037143475688066904,0.09849717912144816,2.0565755367279053,0.10894083976745605
16,0.6,test,0.09866297833102812,0.03322490395657355,0.09100551392398538,2.0565755367279053,0.12216782569885254
32,0.003,train,0.22115187538430006,0.04354876900544079,0.12178650807155512,8.1348295211792,0.13427519798278809
32,0.003,dev,0.22372464658881377,0.04498134525127881,0.1246602472171003,8.1348295211792,0.10907363891601562
32,0.003,test,0.206546795758414,0.04175371274427878,0.11546193560337978,8.1348295211792,0.1090097427368164
32,0.1,train,0.11621233859397417,0.04791939567107716,0.09143053161957847,7.965504169464111,0.13451766967773438
32,0.1,dev,0.11186232329440689,0.043316782198703455,0.08948992104807578,7.965504169464111,0.10905075073242188
32,0.1,test,0.10834485938220378,0.04642008513487534,0.08642001113116297,7.965504169464111,0.10973548889160156
32,0.3,train,0.0703012912482066,0.03352739553689338,0.06980152846343478,7.995689153671265,0.1338646411895752
32,0.3,dev,0.08973570989551322,0.04182614809014759,0.08317510538294515,7.995689153671265,0.12144351005554199
32,0.3,test,0.07100046104195482,0.03244776366631675,0.069179435226273,7.995689153671265,0.11021637916564941
32,0.6,train,0.14941586390653822,0.02659877018974776,0.0658746705775461,7.948460340499878,0.13419747352600098
32,0.6,dev,0.1450522433927474,0.02565786165267342,0.0656163632434185,7.948460340499878,0.11354637145996094
32,0.6,test,0.14845550945136007,0.027882814172905883,0.07053851250704382,7.948460340499878,0.1171574592590332
64,0.003,train,0.09858577577372414,0.028709292285824008,0.054416393747019065,6.63622522354126,0.13755488395690918
64,0.003,dev,0.0860479409956976,0.02484724933008101,0.04501870299750363,6.63622522354126,0.11347174644470215
64,0.003,test,0.09727985246657445,0.028994607596778164,0.05626326174093625,6.63622522354126,0.12278461456298828
64,0.1,train,0.13568354170936667,0.04206326130117654,0.10131967304051545,9.44803237915039,0.14297199249267578
64,0.1,dev,0.148740012292563,0.044506884790886894,0.10505837974754172,9.44803237915039,0.11481070518493652
64,0.1,test,0.1313969571230982,0.04118199469448471,0.09609095583434332,9.44803237915039,0.11508440971374512
64,0.3,train,0.19020291043246568,0.05683909970543945,0.148141488693272,9.111388444900513,0.14311003684997559
64,0.3,dev,0.1936078672403196,0.05813316544497921,0.15320638693043007,9.111388444900513,0.11489748954772949
64,0.3,test,0.18672199170124482,0.056295683189282825,0.15008864522952545,9.111388444900513,0.11361360549926758
64,0.6,train,0.171346587415454,0.039312769414399984,0.10768918486248426,9.04783320426941,0.1412827968597412
64,0.6,dev,0.16779348494161034,0.04018034498415428,0.10532719085885255,9.04783320426941,0.11533761024475098
64,0.6,test,0.16643614568925771,0.03563978941532766,0.1011665922077264,9.04783320426941,0.11526203155517578
128,0.003,train,0.18159458905513426,0.04763628447362242,0.11930927866566225,6.765843629837036,0.14717960357666016
128,0.003,dev,0.17885679164105717,0.04477660455206428,0.11841982039790269,6.765843629837036,0.11992406845092773
128,0.003,test,0.19041032733978794,0.0514082219474523,0.12990262722189086,6.765843629837036,0.12229084968566895
128,0.1,train,0.11539249846279975,0.03808340117972506,0.10874031244431723,4.871045112609863,0.14695310592651367
128,0.1,dev,0.11247695144437615,0.03520103507842959,0.10084716766030391,4.871045112609863,0.12246823310852051
128,0.1,test,0.11940986629783311,0.03789440650604055,0.10636198170332949,4.871045112609863,0.12354636192321777
128,0.3,train,0.20086083213773315,0.046682331001710826,0.12796211068961832,11.255709886550903,0.14588403701782227
128,0.3,dev,0.22311001843884454,0.049657786299131784,0.14254934393711619,11.255709886550903,0.12262320518493652
128,0.3,test,0.1991701244813278,0.04620266924604706,0.12739383632884077,11.255709886550903,0.12038540840148926
128,0.6,train,0.20618979299036688,0.04238459601797424,0.11234703639360466,10.977229118347168,0.14890623092651367
128,0.6,dev,0.1997541487400123,0.038296775258609916,0.10505235541840505,10.977229118347168,0.12390971183776855
128,0.6,test,0.194098662978331,0.03986949073385995,0.10862452795499321,10.977229118347168,0.12216806411743164
256,0.003,train,0.1408075425292068,0.05075808132343525,0.10745262672332317,15.3820481300354,0.1567673683166504
256,0.003,dev,0.14013521819299324,0.04528331627278213,0.1012134292222725,15.3820481300354,0.13686037063598633
256,0.003,test,0.13646841862609496,0.045037065062654445,0.09851175120526319,15.3820481300354,0.1405189037322998
256,0.1,train,0.12174625947940151,0.02816007476643887,0.064309375768908,10.140072345733643,0.19539737701416016
256,0.1,dev,0.1389059618930547,0.03267596174043799,0.075973866541122,10.140072345733643,0.1640152931213379
256,0.1,test,0.12955278930382666,0.02899026726288846,0.06706019901685661,10.140072345733643,0.16205048561096191
256,0.3,train,0.1289198606271777,0.0358527927529583,0.08049589638363769,11.128937005996704,9.92493200302124
256,0.3,dev,0.12968653964351567,0.036979667701737634,0.08411588475498467,11.128937005996704,0.1673872470855713
256,0.3,test,0.12632549562010142,0.03561860070419234,0.08119359612877797,11.128937005996704,0.14553093910217285
256,0.6,train,0.1365033818405411,0.02885844025770383,0.06775536933875466,9.483970165252686,0.19564151763916016
256,0.6,dev,0.13767670559311618,0.028637803925870946,0.06754881125956859,9.483970165252686,0.16708588600158691
256,0.6,test,0.13416320885200553,0.028354961502734782,0.06843238597904548,9.483970165252686,0.16256475448608398
512,0.003,train,0.21151875384300062,0.030772374662587892,0.08571806350470539,22.50375747680664,0.21892952919006348
512,0.003,dev,0.2095881991395206,0.029296916134875003,0.08392431471990343,22.50375747680664,0.17945480346679688
512,0.003,test,0.210696173351775,0.028771464763623994,0.08332521838770933,22.50375747680664,0.19416260719299316
512,0.1,train,0.1840541094486575,0.02975664545756683,0.08772400743186407,5.4500226974487305,0.2160787582397461
512,0.1,dev,0.18131530424093423,0.029351500574649657,0.08699537234263234,5.4500226974487305,0.18271851539611816
512,0.1,test,0.18579990779160904,0.030510928204925278,0.08925038353420583,5.4500226974487305,0.18892335891723633
512,0.3,train,0.14818610370977658,0.016298467087466184,0.03917778684193552,5.533711194992065,0.20372724533081055
512,0.3,dev,0.14935464044253227,0.01636584051724138,0.03943091261683234,5.533711194992065,0.17801451683044434
512,0.3,test,0.14983863531581373,0.0181794728650697,0.04019605420715291,5.533711194992065,0.18068718910217285
512,0.6,train,0.14798114367698298,0.034194272573519646,0.08014352865639623,21.960573434829712,19.624609231948853
512,0.6,dev,0.14136447449293177,0.03227813907954785,0.07769145069193993,21.960573434829712,0.20571255683898926
512,0.6,test,0.14615029967727064,0.035614739440801985,0.0793376839760242,21.960573434829712,0.21445059776306152
