channels,drop,split,micro,macro,weight,train_time,inference_time
4,0.003,train,0.8253164556962025,0.6563679682358039,0.8038808291286064,2.500272750854492,0.05261945724487305
4,0.003,dev,0.8143939393939394,0.656483155606646,0.7940129740728246,2.500272750854492,0.023064613342285156
4,0.003,test,0.8210227272727273,0.6387925558943089,0.7984432742054693,2.500272750854492,0.02251911163330078
4,0.1,train,0.8316455696202532,0.6594906811401657,0.8076019695646472,2.2852351665496826,0.043946027755737305
4,0.1,dev,0.7954545454545455,0.6203384307784693,0.7738302613425443,2.2852351665496826,0.019402027130126953
4,0.1,test,0.84375,0.6725057293151874,0.8244899842473274,2.2852351665496826,0.019064664840698242
4,0.3,train,0.7683544303797467,0.5955342366879847,0.7482201016679372,1.118985652923584,0.045665740966796875
4,0.3,dev,0.7689393939393939,0.5960245687994379,0.7467952799223623,1.118985652923584,0.019817590713500977
4,0.3,test,0.7698863636363635,0.5965898125172319,0.7481040241120887,1.118985652923584,0.019350767135620117
4,0.6,train,0.5645569620253165,0.4816385459641285,0.5587197047184786,0.8474886417388916,0.04502582550048828
4,0.6,dev,0.5681818181818182,0.47663471563866544,0.5607895316072418,0.8474886417388916,0.01920604705810547
4,0.6,test,0.5852272727272727,0.47668841715855054,0.573061739815767,0.8474886417388916,0.01865673065185547
8,0.003,train,0.8518987341772153,0.7776320249460058,0.851744685030043,1.7676417827606201,0.044019460678100586
8,0.003,dev,0.8295454545454547,0.7781850765721733,0.8341553363547497,1.7676417827606201,0.01950383186340332
8,0.003,test,0.8892045454545454,0.8335663982629802,0.8913788697638025,1.7676417827606201,0.019150972366333008
8,0.1,train,0.8177215189873418,0.6877235152723221,0.816239169346387,1.29073166847229,0.045484304428100586
8,0.1,dev,0.7954545454545455,0.6700869814605184,0.791938081267474,1.29073166847229,0.019858121871948242
8,0.1,test,0.8409090909090909,0.6738561586756218,0.8289679865480053,1.29073166847229,0.01919102668762207
8,0.3,train,0.810126582278481,0.6444816942067462,0.7943667759321847,1.372459888458252,0.045153141021728516
8,0.3,dev,0.8143939393939394,0.6576593145957307,0.7951475169814634,1.372459888458252,0.019701480865478516
8,0.3,test,0.8125,0.6354538469888205,0.7932912734743386,1.372459888458252,0.019760847091674805
8,0.6,train,0.8000000000000002,0.6645747820693826,0.7864297669929625,1.6818091869354248,0.04585123062133789
8,0.6,dev,0.7765151515151515,0.6267016815519809,0.7642367268006898,1.6818091869354248,0.019689321517944336
8,0.6,test,0.8380681818181818,0.6840925278425279,0.8196094467401285,1.6818091869354248,0.019622325897216797
16,0.003,train,0.8721518987341773,0.8023000813228517,0.8700637818214261,1.9014618396759033,0.04614448547363281
16,0.003,dev,0.8484848484848486,0.7952671052089862,0.8475404770707214,1.9014618396759033,0.01974034309387207
16,0.003,test,0.875,0.775346046877573,0.871853022498973,1.9014618396759033,0.019517898559570312
16,0.1,train,0.7797468354430381,0.6533672468487045,0.7762430333130791,1.0851402282714844,0.04610729217529297
16,0.1,dev,0.7424242424242424,0.5990255567350388,0.7342270356200431,1.0851402282714844,0.02012348175048828
16,0.1,test,0.8011363636363636,0.6562906558849956,0.7974449634485011,1.0851402282714844,0.019636154174804688
16,0.3,train,0.6455696202531646,0.4828708880947687,0.6127931846616903,0.6967699527740479,0.0461728572845459
16,0.3,dev,0.6174242424242424,0.47808935118518747,0.5849666391851355,0.6967699527740479,0.020067691802978516
16,0.3,test,0.6875,0.52608139283397,0.6637250323871692,0.6967699527740479,0.019649744033813477
16,0.6,train,0.8113924050632911,0.7275767208287833,0.8141976826113125,1.2501749992370605,0.045809268951416016
16,0.6,dev,0.7916666666666666,0.7082649619470996,0.795530873547138,1.2501749992370605,0.020127534866333008
16,0.6,test,0.8380681818181818,0.7395965486101934,0.8398114720617035,1.2501749992370605,0.019329309463500977
32,0.003,train,0.8658227848101265,0.8010127182069495,0.8590532769228655,1.908323049545288,0.04458260536193848
32,0.003,dev,0.8560606060606061,0.7971429451108836,0.8513900769755773,1.908323049545288,0.019908428192138672
32,0.003,test,0.8721590909090909,0.7956929737236843,0.8661648848220408,1.908323049545288,0.019526243209838867
32,0.1,train,0.760759493670886,0.600488286670598,0.7387998619409967,0.8284962177276611,0.04590487480163574
32,0.1,dev,0.7613636363636364,0.6110898833791599,0.7408906022393271,0.8284962177276611,0.020229339599609375
32,0.1,test,0.7926136363636364,0.6324100947221534,0.7714117743456094,0.8284962177276611,0.01958942413330078
32,0.3,train,0.8341772151898734,0.7061251618759466,0.8253242526040558,1.6056079864501953,0.04542970657348633
32,0.3,dev,0.8181818181818182,0.6918054103961719,0.8087120207308194,1.6056079864501953,0.02009749412536621
32,0.3,test,0.8664772727272727,0.7480650121454152,0.8552825816898019,1.6056079864501953,0.019433975219726562
32,0.6,train,0.7848101265822784,0.6071584687304457,0.7630418514906435,1.0803885459899902,0.04560971260070801
32,0.6,dev,0.765151515151515,0.594980290711998,0.7422081121637663,1.0803885459899902,0.02025437355041504
32,0.6,test,0.8267045454545454,0.6411083701748783,0.8029556775711527,1.0803885459899902,0.019652605056762695
64,0.003,train,0.9012658227848102,0.8656828671043638,0.9028099599316062,2.0779635906219482,0.04528069496154785
64,0.003,dev,0.8787878787878788,0.8527825557236478,0.8806380177032974,2.0779635906219482,0.02102494239807129
64,0.003,test,0.8835227272727273,0.8308013355848001,0.8855011771464437,2.0779635906219482,0.020678281784057617
64,0.1,train,0.5987341772151898,0.5256910684784897,0.6199488554212829,0.7594006061553955,0.04603719711303711
64,0.1,dev,0.6212121212121212,0.538107512004255,0.6304631659314155,0.7594006061553955,0.020835161209106445
64,0.1,test,0.5880681818181818,0.4985115054966768,0.6081212388190106,0.7594006061553955,0.02035832405090332
64,0.3,train,0.7025316455696202,0.5944675324675325,0.7168117047509454,0.8628990650177002,0.046436309814453125
64,0.3,dev,0.6893939393939394,0.6032307964980048,0.7052280422155861,0.8628990650177002,0.02066206932067871
64,0.3,test,0.7528409090909091,0.6412993542040304,0.7668005168209551,0.8628990650177002,0.020304441452026367
64,0.6,train,0.7443037974683544,0.5875229902639396,0.728779753269137,1.2570929527282715,0.04793095588684082
64,0.6,dev,0.765151515151515,0.6276443777788797,0.7585226990988879,1.2570929527282715,0.0210268497467041
64,0.6,test,0.7784090909090909,0.6184195102302663,0.7613852615421443,1.2570929527282715,0.020318031311035156
128,0.003,train,0.8759493670886076,0.8353416112484742,0.8823222413686228,2.4275968074798584,0.0466771125793457
128,0.003,dev,0.8295454545454547,0.7903341103719485,0.8406192653700556,2.4275968074798584,0.021633148193359375
128,0.003,test,0.8636363636363636,0.808527392650424,0.8739023360540389,2.4275968074798584,0.021042823791503906
128,0.1,train,0.8658227848101265,0.799815795081037,0.8670707982401594,2.170865774154663,0.048532962799072266
128,0.1,dev,0.8409090909090909,0.7988780676523525,0.8435248432245961,2.170865774154663,0.021506309509277344
128,0.1,test,0.875,0.8024953244460061,0.8749825545409368,2.170865774154663,0.021259307861328125
128,0.3,train,0.8405063291139241,0.7288363352195592,0.8303676184007562,1.8388683795928955,0.04633593559265137
128,0.3,dev,0.8181818181818182,0.7082279577997778,0.8080595148418853,1.8388683795928955,0.02222156524658203
128,0.3,test,0.8664772727272727,0.7579561532532745,0.8571568537775228,1.8388683795928955,0.02110433578491211
128,0.6,train,0.8139240506329114,0.6286388267582959,0.7898608951756706,1.6106452941894531,0.04802656173706055
128,0.6,dev,0.7954545454545455,0.6150988173046997,0.768569801658037,1.6106452941894531,0.02175116539001465
128,0.6,test,0.8323863636363636,0.6445221445221445,0.8073744437380802,1.6106452941894531,0.02102351188659668
256,0.003,train,0.8848101265822785,0.8232894397155812,0.8813424631031302,3.0998687744140625,0.04796314239501953
256,0.003,dev,0.8446969696969698,0.7988712590299277,0.8433485395753196,3.0998687744140625,0.023043155670166016
256,0.003,test,0.8892045454545454,0.8091111286638686,0.8833394945504665,3.0998687744140625,0.022782325744628906
256,0.1,train,0.8759493670886076,0.8231130672309678,0.8794986304435518,2.527709722518921,0.05012798309326172
256,0.1,dev,0.8446969696969698,0.801082669162769,0.8517908883208538,2.527709722518921,0.023541688919067383
256,0.1,test,0.8806818181818182,0.8161283374258949,0.8884502966918788,2.527709722518921,0.02325129508972168
256,0.3,train,0.8126582278481013,0.7484824563675465,0.8269814903961797,1.755929946899414,0.05013298988342285
256,0.3,dev,0.7840909090909092,0.7173582700494388,0.7986808614976257,1.755929946899414,0.023988723754882812
256,0.3,test,0.8323863636363636,0.7410574832502368,0.8397581219747636,1.755929946899414,0.023375988006591797
256,0.6,train,0.789873417721519,0.6045146345076997,0.7587796833157531,1.421865701675415,0.04980778694152832
256,0.6,dev,0.7916666666666666,0.6097511219910241,0.7607655502392343,1.421865701675415,0.023688077926635742
256,0.6,test,0.8181818181818182,0.632175039941666,0.7895306148543765,1.421865701675415,0.024129390716552734
512,0.003,train,0.9025316455696203,0.8727536791862875,0.9033231148582263,4.931788921356201,0.05382990837097168
512,0.003,dev,0.8712121212121212,0.8512394468954367,0.8718833634137356,4.931788921356201,0.029589414596557617
512,0.003,test,0.9005681818181818,0.8452068418845828,0.9029629228870395,4.931788921356201,0.02877330780029297
512,0.1,train,0.8240506329113924,0.6570570847688016,0.8027727197078719,4.875634431838989,0.05503702163696289
512,0.1,dev,0.803030303030303,0.6711803869192164,0.7876500250195004,4.875634431838989,0.029299259185791016
512,0.1,test,0.8352272727272727,0.6697986292058458,0.8132206335331336,4.875634431838989,0.028729677200317383
512,0.3,train,0.8772151898734178,0.7881260135612025,0.8702704660920171,4.478874683380127,0.0570526123046875
512,0.3,dev,0.8522727272727273,0.789577699438049,0.8480077486723087,4.478874683380127,0.029774904251098633
512,0.3,test,0.8948863636363636,0.8195941782047804,0.8884529133539978,4.478874683380127,0.028937339782714844
512,0.6,train,0.829113924050633,0.7660633553748801,0.8467171339545008,3.9912912845611572,0.05791950225830078
512,0.6,dev,0.7992424242424242,0.731242349953742,0.824155297856513,3.9912912845611572,0.030238628387451172
512,0.6,test,0.8636363636363636,0.7862177134504025,0.8760725562260917,3.9912912845611572,0.030002593994140625
