channels,drop,split,micro,macro,weight,train_time,inference_time
4,0.003,train,0.4092307692307692,0.3044193133040368,0.41300475663402364,1.8780930042266846,0.05167269706726074
4,0.003,dev,0.41013824884792627,0.2753447106690778,0.4007607228273098,1.8780930042266846,0.020424842834472656
4,0.003,test,0.4186851211072664,0.2977805307887092,0.4182234516952375,1.8780930042266846,0.019782304763793945
4,0.1,train,0.4584615384615385,0.18383292562707657,0.35236021198852996,0.8551502227783203,0.04281020164489746
4,0.1,dev,0.4377880184331797,0.17337406385494677,0.3389837774213529,0.8551502227783203,0.01735377311706543
4,0.1,test,0.4463667820069204,0.1830357142857143,0.33879139891250615,0.8551502227783203,0.017350435256958008
4,0.3,train,0.5307692307692308,0.3875445397558561,0.5094089485572164,1.520646333694458,0.04930472373962402
4,0.3,dev,0.4884792626728111,0.327678394873767,0.4717010649886432,1.520646333694458,0.019474506378173828
4,0.3,test,0.5017301038062284,0.3510907114565651,0.48410778651305286,1.520646333694458,0.019022226333618164
4,0.6,train,0.52,0.2210865902816367,0.4048676764037563,1.1184592247009277,0.5383129119873047
4,0.6,dev,0.5069124423963134,0.20578478964401298,0.3871817815757685,1.1184592247009277,0.01825094223022461
4,0.6,test,0.5224913494809689,0.24233010439906993,0.41442835596277905,1.1184592247009277,0.017704486846923828
8,0.003,train,0.5261538461538462,0.38200057757228945,0.5111219787719864,1.5390381813049316,0.04194378852844238
8,0.003,dev,0.5207373271889401,0.38800460681503657,0.5027193163646527,1.5390381813049316,0.017426729202270508
8,0.003,test,0.5709342560553633,0.4232974181553755,0.5442850712714365,1.5390381813049316,0.016728639602661133
8,0.1,train,0.31076923076923074,0.20319647347690076,0.24127483777740535,0.6464571952819824,0.04146218299865723
8,0.1,dev,0.35483870967741943,0.2514029196307417,0.300946780968204,0.6464571952819824,0.016831636428833008
8,0.1,test,0.28719723183391005,0.18315950789220634,0.22194275608380035,0.6464571952819824,0.01658463478088379
8,0.3,train,0.4738461538461538,0.35208956241098743,0.45963951618976717,1.860720157623291,0.047699689865112305
8,0.3,dev,0.5023041474654378,0.35270210021415427,0.48947413588770927,1.860720157623291,0.017578840255737305
8,0.3,test,0.4740484429065744,0.3502899952837634,0.4572214579416756,1.860720157623291,0.017279863357543945
8,0.6,train,0.4676923076923077,0.30796481073928184,0.4451992250083298,1.2600679397583008,0.046401023864746094
8,0.6,dev,0.4884792626728111,0.3163854845338598,0.4584108531476209,1.2600679397583008,0.0177156925201416
8,0.6,test,0.46366782006920415,0.29931928643533023,0.4403372234643212,1.2600679397583008,0.01775193214416504
16,0.003,train,0.5276923076923077,0.44515625843753404,0.5325252760003107,1.8219432830810547,0.04616999626159668
16,0.003,dev,0.5161290322580645,0.42963700262970334,0.5161653876040502,1.8219432830810547,0.018063068389892578
16,0.003,test,0.5467128027681661,0.40292148509719916,0.5380891277151423,1.8219432830810547,0.017489194869995117
16,0.1,train,0.5461538461538461,0.4271394295829695,0.5349948607046299,1.2307467460632324,0.04521894454956055
16,0.1,dev,0.5253456221198156,0.4544336902036017,0.5221441738392922,1.2307467460632324,0.017680883407592773
16,0.1,test,0.47058823529411764,0.3538498499013116,0.4612612941079301,1.2307467460632324,0.017457008361816406
16,0.3,train,0.5230769230769231,0.3513034439197939,0.4789867121953058,1.1273272037506104,0.045476675033569336
16,0.3,dev,0.5253456221198156,0.34125261755187514,0.4833616252639484,1.1273272037506104,0.017945528030395508
16,0.3,test,0.5501730103806228,0.34525833159878816,0.4998172225493917,1.1273272037506104,0.017303943634033203
16,0.6,train,0.4553846153846154,0.3099667728131375,0.4268930105463152,1.1426186561584473,0.045241594314575195
16,0.6,dev,0.41935483870967744,0.28903166941013786,0.38822246933653803,1.1426186561584473,0.01772284507751465
16,0.6,test,0.44982698961937717,0.29703980013385956,0.4137473835219561,1.1426186561584473,0.01741337776184082
32,0.003,train,0.58,0.49903409429830164,0.5682169795675432,1.7850091457366943,0.044878482818603516
32,0.003,dev,0.5345622119815668,0.4507179454763851,0.5228775929883888,1.7850091457366943,0.017920732498168945
32,0.003,test,0.5501730103806228,0.4182431040885556,0.519206209384119,1.7850091457366943,0.01751708984375
32,0.1,train,0.5123076923076924,0.17966938656948955,0.35675772958193935,0.6988308429718018,0.04482889175415039
32,0.1,dev,0.5253456221198156,0.19463632669646486,0.37860672575121207,0.6988308429718018,0.017590999603271484
32,0.1,test,0.5086505190311419,0.1751206763207723,0.35113046644654294,0.6988308429718018,0.01736903190612793
32,0.3,train,0.4938461538461538,0.22345906093540116,0.40344827019359936,0.6987779140472412,0.04457712173461914
32,0.3,dev,0.4792626728110599,0.21534482758620688,0.39093596059113295,0.6987779140472412,0.017621755599975586
32,0.3,test,0.5259515570934256,0.23452755167891418,0.4214065671552342,0.6987779140472412,0.01746201515197754
32,0.6,train,0.5123076923076924,0.3356248339185056,0.46710280547796024,1.121617317199707,0.04639172554016113
32,0.6,dev,0.4884792626728111,0.31716072771849657,0.4553436539042502,1.121617317199707,0.018120765686035156
32,0.6,test,0.4844290657439446,0.2862520056235856,0.4386557871866977,1.121617317199707,0.01750946044921875
64,0.003,train,0.48615384615384616,0.22519847863815962,0.39351874859751235,0.6760075092315674,0.04675126075744629
64,0.003,dev,0.4930875576036866,0.22663216998788946,0.40543558610276653,0.6760075092315674,0.018782377243041992
64,0.003,test,0.5121107266435986,0.25228003214142225,0.4250541830420633,0.6760075092315674,0.018075227737426758
64,0.1,train,0.52,0.30601283854104144,0.45181684790313625,1.0269134044647217,0.04442000389099121
64,0.1,dev,0.543778801843318,0.33081556997844747,0.48088390400210035,1.0269134044647217,0.018091440200805664
64,0.1,test,0.5155709342560554,0.34689006303299963,0.4563500005773427,1.0269134044647217,0.017824411392211914
64,0.3,train,0.5707692307692308,0.4406162691429636,0.5571350961272502,1.2592813968658447,0.3842003345489502
64,0.3,dev,0.5622119815668203,0.44732355944616564,0.5511665671144986,1.2592813968658447,0.020434856414794922
64,0.3,test,0.5536332179930796,0.38455730359043583,0.5288328427536881,1.2592813968658447,0.019531726837158203
64,0.6,train,0.48615384615384616,0.18045034243464675,0.3474591642666197,0.8992705345153809,0.048337459564208984
64,0.6,dev,0.4930875576036866,0.17038216560509556,0.34861604391088674,0.8992705345153809,0.018933773040771484
64,0.6,test,0.49480968858131485,0.18952062430323297,0.35525569661269973,0.8992705345153809,0.018442392349243164
128,0.003,train,0.5338461538461539,0.3724648974547166,0.48895908819026745,1.3164734840393066,0.0472109317779541
128,0.003,dev,0.5345622119815668,0.39786086309523805,0.4998954218784287,1.3164734840393066,0.019122838973999023
128,0.003,test,0.5259515570934256,0.34914350355526824,0.4696174983168674,1.3164734840393066,0.01851630210876465
128,0.1,train,0.5492307692307692,0.425511109416068,0.5222224530868022,1.774092674255371,0.04650616645812988
128,0.1,dev,0.5207373271889401,0.42817908324237436,0.4954123380303162,1.774092674255371,0.018797636032104492
128,0.1,test,0.5121107266435986,0.3839695846199828,0.48125007143237225,1.774092674255371,0.018640995025634766
128,0.3,train,0.5784615384615385,0.31436818379179116,0.5145581209024164,1.511749267578125,0.04662036895751953
128,0.3,dev,0.5529953917050692,0.3009381534059646,0.4970512896582397,1.511749267578125,0.01927495002746582
128,0.3,test,0.5674740484429066,0.3012383139248811,0.5016791399480033,1.511749267578125,0.01865100860595703
128,0.6,train,0.31384615384615383,0.14593666931572166,0.1969970466901217,0.7674398422241211,0.046068429946899414
128,0.6,dev,0.3456221198156682,0.1690518247956648,0.23943017793694468,0.7674398422241211,0.01884627342224121
128,0.6,test,0.3217993079584775,0.15071245889660212,0.20457829588883847,0.7674398422241211,0.018783092498779297
256,0.003,train,0.6107692307692307,0.4928787184282788,0.5937464512182294,2.793503522872925,0.04934191703796387
256,0.003,dev,0.5345622119815668,0.3956123323397913,0.5115769296805784,2.793503522872925,0.020910978317260742
256,0.003,test,0.5882352941176471,0.4081929738947237,0.5508430712129645,2.793503522872925,0.020691633224487305
256,0.1,train,0.5353846153846153,0.46673408182151044,0.5413353944417477,2.0903942584991455,0.04797816276550293
256,0.1,dev,0.5069124423963134,0.4609643499568873,0.5152803123433841,2.0903942584991455,0.02021479606628418
256,0.1,test,0.4982698961937716,0.3851915745532767,0.5008416500134089,2.0903942584991455,0.020071029663085938
256,0.3,train,0.3153846153846154,0.22350977496992208,0.21329750659054889,1.1099119186401367,0.047989845275878906
256,0.3,dev,0.33640552995391704,0.24235165436149847,0.25139127158444946,1.1099119186401367,0.02070450782775879
256,0.3,test,0.2768166089965398,0.18568591994790334,0.17050942155536242,1.1099119186401367,0.020502090454101562
256,0.6,train,0.16307692307692306,0.1231123589380145,0.10452954176608976,0.8710618019104004,0.045920610427856445
256,0.6,dev,0.16129032258064516,0.12163702690378478,0.10485814730993673,0.8710618019104004,0.019980430603027344
256,0.6,test,0.17993079584775087,0.1379201680672269,0.11815009740920591,0.8710618019104004,0.01969003677368164
512,0.003,train,0.2846153846153846,0.11698153108698718,0.13967074797470966,0.9961707592010498,0.050656795501708984
512,0.003,dev,0.3087557603686636,0.1349206349206349,0.17349470805692005,0.9961707592010498,0.024651765823364258
512,0.003,test,0.2906574394463668,0.12534184942745735,0.15658219377419047,0.9961707592010498,0.0245208740234375
512,0.1,train,0.48923076923076925,0.39030857778584455,0.4736080277083266,2.2583718299865723,0.05005645751953125
512,0.1,dev,0.4930875576036866,0.4107974298641135,0.4908597786510698,2.2583718299865723,0.024357318878173828
512,0.1,test,0.5121107266435986,0.39314765861745726,0.48923681586740964,2.2583718299865723,0.024442434310913086
512,0.3,train,0.52,0.3054135574410161,0.4409971859744933,1.8570890426635742,0.049576759338378906
512,0.3,dev,0.5207373271889401,0.2996852871754524,0.45068423450698014,1.8570890426635742,0.024732589721679688
512,0.3,test,0.5086505190311419,0.26502555186765714,0.4218030815371919,1.8570890426635742,0.023726224899291992
512,0.6,train,0.58,0.3471709601298988,0.528519180710875,2.875302791595459,0.05323958396911621
512,0.6,dev,0.5576036866359447,0.3352472913697834,0.5147372341902783,2.875302791595459,0.026073932647705078
512,0.6,test,0.5882352941176471,0.38703344422175634,0.5394372686115894,2.875302791595459,0.026090621948242188
