split,accracy,macro,micro,weighted,time
train,{'accuracy': 0.8962962962962963},{'f1': 0.8962735305416827},{'f1': 0.8962962962962963},{'f1': 0.8962735305416826},110.46865558624268
dev,{'accuracy': 0.8},{'f1': 0.8000000000000002},{'f1': 0.8000000000000002},{'f1': 0.8000000000000002},110.46865558624268
test,{'accuracy': 0.675},{'f1': 0.67499187479687},{'f1': 0.675},{'f1': 0.67499187479687},110.46865558624268
