split,accracy,macro,micro,weighted,time
train,{'accuracy': 0.4622222222222222},{'f1': 0.21393018745959927},{'f1': 0.4622222222222222},{'f1': 0.3897414350355527},98.67947840690613
dev,{'accuracy': 0.4473684210526316},{'f1': 0.20755786490316486},{'f1': 0.4473684210526316},{'f1': 0.3756681500633966},98.67947840690613
test,{'accuracy': 0.4158415841584158},{'f1': 0.1902426160337553},{'f1': 0.4158415841584158},{'f1': 0.3529420980072691},98.67947840690613
