split,accracy,macro,micro,weighted,time
train,{'accuracy': 1.0},{'f1': 1.0},{'f1': 1.0},{'f1': 1.0},1998.3707790374756
dev,{'accuracy': 0.9775700934579439},{'f1': 0.9774969570943735},{'f1': 0.9775700934579439},{'f1': 0.9775569049333656},1998.3707790374756
test,{'accuracy': 0.9822429906542056},{'f1': 0.982186979759923},{'f1': 0.9822429906542056},{'f1': 0.9822336555051585},1998.3707790374756
