channels,drop,split,micro,macro,weight,train_time,inference_time
4,0.003,train,0.6111660079051383,0.6111545226299325,0.6111545226299325,3.9099791049957275,0.08761477470397949
4,0.003,dev,0.605925925925926,0.6059181415929203,0.6059207363705889,3.9099791049957275,0.05392646789550781
4,0.003,test,0.6333333333333333,0.6333315226248031,0.6333315226248031,3.9099791049957275,0.054083824157714844
4,0.1,train,0.4841897233201581,0.35985691227151767,0.3598569122715177,3.900376319885254,0.07257771492004395
4,0.1,dev,0.4711111111111111,0.34092307692307694,0.341357037037037,3.900376319885254,0.04742312431335449
4,0.1,test,0.47888888888888886,0.3498141555978983,0.34981415559789836,3.900376319885254,0.04712510108947754
4,0.3,train,0.475296442687747,0.4646062797961532,0.46460627979615315,1.4792168140411377,0.08292627334594727
4,0.3,dev,0.4874074074074074,0.47791855931900284,0.4780228323749194,1.4792168140411377,0.05255436897277832
4,0.3,test,0.5077777777777778,0.4993162219283672,0.4993162219283672,1.4792168140411377,0.05253267288208008
4,0.6,train,0.5533596837944664,0.5533579393442303,0.5533579393442303,3.071063756942749,0.07522964477539062
4,0.6,dev,0.5703703703703704,0.5703241610620402,0.5703175597322787,3.071063756942749,0.05196046829223633
4,0.6,test,0.5733333333333334,0.5731984429646901,0.5731984429646901,3.071063756942749,0.05161237716674805
8,0.003,train,0.5701581027667985,0.5617713111620795,0.5617713111620795,3.427123546600342,0.0709981918334961
8,0.003,dev,0.5333333333333333,0.5236991189693756,0.5237994753690002,3.427123546600342,0.04447317123413086
8,0.003,test,0.5588888888888889,0.5541279663967476,0.5541279663967476,3.427123546600342,0.04859471321105957
8,0.1,train,0.5647233201581028,0.5640250708126988,0.5640250708126988,1.84098219871521,1.09600830078125
8,0.1,dev,0.5748148148148148,0.573162267742767,0.5731229213839087,1.84098219871521,0.04591178894042969
8,0.1,test,0.5777777777777777,0.576363564293642,0.576363564293642,1.84098219871521,0.046805620193481445
8,0.3,train,0.5938735177865613,0.5923434284034108,0.5923434284034108,2.0268049240112305,0.08240127563476562
8,0.3,dev,0.5777777777777777,0.5765733642360491,0.5765399083043344,2.0268049240112305,0.048154354095458984
8,0.3,test,0.5744444444444444,0.5734707993926877,0.5734707993926877,2.0268049240112305,0.043695688247680664
8,0.6,train,0.6032608695652174,0.6023094004441154,0.6023094004441153,3.3352737426757812,0.06837725639343262
8,0.6,dev,0.5940740740740741,0.5931015365119594,0.5930720656767439,3.3352737426757812,0.04493141174316406
8,0.6,test,0.5577777777777778,0.5565163130682831,0.5565163130682832,3.3352737426757812,0.0445866584777832
16,0.003,train,0.5879446640316206,0.5856689958655656,0.5856689958655656,3.476219654083252,0.06988787651062012
16,0.003,dev,0.5718518518518518,0.5710044532409699,0.5710326998613326,3.476219654083252,0.04461050033569336
16,0.003,test,0.5588888888888889,0.5576826184000565,0.5576826184000564,3.476219654083252,0.044554948806762695
16,0.1,train,0.47579051383399207,0.44357669455437065,0.44357669455437065,2.345322370529175,0.06882667541503906
16,0.1,dev,0.4696296296296296,0.44010658016682114,0.4402970514536779,2.345322370529175,0.04440927505493164
16,0.1,test,0.4622222222222222,0.42670934321632376,0.42670934321632376,2.345322370529175,0.044568538665771484
16,0.3,train,0.5503952569169961,0.5499452654625068,0.5499452654625069,1.9070765972137451,0.06956648826599121
16,0.3,dev,0.554074074074074,0.5529398044751127,0.552906443604555,1.9070765972137451,0.044466495513916016
16,0.3,test,0.5666666666666667,0.5665617853208924,0.5665617853208924,1.9070765972137451,0.04349684715270996
16,0.6,train,0.5380434782608695,0.5332553468929111,0.5332553468929111,1.7206220626831055,0.06864070892333984
16,0.6,dev,0.5437037037037037,0.5388853401469179,0.5389551715028135,1.7206220626831055,0.04336071014404297
16,0.6,test,0.53,0.526350560304768,0.526350560304768,1.7206220626831055,0.04386162757873535
32,0.003,train,0.5400197628458498,0.4781319315259057,0.4781319315259057,2.246138095855713,1.1273691654205322
32,0.003,dev,0.5422222222222223,0.4921240573583877,0.4918877452599734,2.246138095855713,0.04595017433166504
32,0.003,test,0.56,0.5024875621890548,0.5024875621890548,2.246138095855713,0.04558849334716797
32,0.1,train,0.5039525691699605,0.49813042657886347,0.4981304265788635,2.437717914581299,0.07326769828796387
32,0.1,dev,0.5288888888888889,0.5220057720057719,0.5219207952541286,2.437717914581299,0.04634904861450195
32,0.1,test,0.5277777777777778,0.522900168263444,0.522900168263444,2.437717914581299,0.0448915958404541
32,0.3,train,0.5909090909090909,0.5891080806743456,0.5891080806743457,1.2399990558624268,0.07205510139465332
32,0.3,dev,0.5955555555555555,0.5936684828746508,0.5937095061938009,1.2399990558624268,0.047087669372558594
32,0.3,test,0.6144444444444445,0.6114506960419728,0.6114506960419728,1.2399990558624268,0.04443788528442383
32,0.6,train,0.5518774703557312,0.5345055842300178,0.5345055842300177,1.6459569931030273,0.07098507881164551
32,0.6,dev,0.5688888888888889,0.551201935709406,0.5510699435214994,1.6459569931030273,0.04632735252380371
32,0.6,test,0.5533333333333333,0.5355727166300397,0.5355727166300397,1.6459569931030273,0.04532194137573242
64,0.003,train,0.6101778656126482,0.608732883215193,0.6087328832151931,2.066199541091919,0.07286977767944336
64,0.003,dev,0.6207407407407407,0.6195977598534748,0.6196286512288063,2.066199541091919,0.04662036895751953
64,0.003,test,0.6122222222222222,0.6110693549645307,0.6110693549645306,2.066199541091919,0.04578208923339844
64,0.1,train,0.5163043478260869,0.5152363848181956,0.5152363848181956,2.1897871494293213,0.07219886779785156
64,0.1,dev,0.5392592592592592,0.5387693044573001,0.5387915751301163,2.1897871494293213,0.046772003173828125
64,0.1,test,0.5144444444444445,0.5137907631371066,0.5137907631371067,2.1897871494293213,0.0468754768371582
64,0.3,train,0.5988142292490118,0.5985492462881106,0.5985492462881106,2.074519395828247,0.07217526435852051
64,0.3,dev,0.6162962962962963,0.6160805851957423,0.6160940671395269,2.074519395828247,0.04668140411376953
64,0.3,test,0.6011111111111112,0.6008938199686495,0.6008938199686495,2.074519395828247,0.046041011810302734
64,0.6,train,0.583498023715415,0.5774066650204444,0.5774066650204445,3.7709696292877197,0.07169318199157715
64,0.6,dev,0.5837037037037037,0.5768346090949046,0.5767547359017791,3.7709696292877197,0.04602622985839844
64,0.6,test,0.6066666666666667,0.6011337516462936,0.6011337516462936,3.7709696292877197,0.045276641845703125
128,0.003,train,0.6403162055335968,0.6402989956986412,0.6402989956986412,3.6023733615875244,0.07393836975097656
128,0.003,dev,0.6222222222222222,0.6221923707552202,0.6221973459997205,3.6023733615875244,0.04892611503601074
128,0.003,test,0.6177777777777778,0.6177758902513097,0.6177758902513097,3.6023733615875244,0.04850506782531738
128,0.1,train,0.5592885375494071,0.556446992530339,0.556446992530339,2.7805392742156982,0.07455253601074219
128,0.1,dev,0.5792592592592593,0.5760200290173042,0.576074931224795,2.7805392742156982,0.04982423782348633
128,0.1,test,0.5855555555555556,0.5802695427226091,0.5802695427226091,2.7805392742156982,0.04962491989135742
128,0.3,train,0.5978260869565217,0.5957224815103821,0.5957224815103822,4.123499155044556,1.3724379539489746
128,0.3,dev,0.6133333333333333,0.6113681033969307,0.6113271611065889,4.123499155044556,0.049617767333984375
128,0.3,test,0.62,0.618627057406664,0.618627057406664,4.123499155044556,0.049300193786621094
128,0.6,train,0.5938735177865613,0.5870593421256418,0.5870593421256419,3.0109195709228516,0.07487726211547852
128,0.6,dev,0.597037037037037,0.5908507452043072,0.5907762115677684,3.0109195709228516,0.04954385757446289
128,0.6,test,0.6,0.593934076951999,0.5939340769519988,3.0109195709228516,0.0493159294128418
256,0.003,train,0.5973320158102767,0.5854259201035857,0.5854259201035856,3.157520055770874,0.07960772514343262
256,0.003,dev,0.605925925925926,0.5949732012343674,0.5950718744297868,3.157520055770874,0.055275917053222656
256,0.003,test,0.5866666666666667,0.5717443359734757,0.5717443359734757,3.157520055770874,0.05588674545288086
256,0.1,train,0.5543478260869565,0.5360454915562296,0.5360454915562297,4.5921149253845215,0.07999753952026367
256,0.1,dev,0.5792592592592593,0.5648087610330172,0.5646912773076007,4.5921149253845215,0.05457305908203125
256,0.1,test,0.5888888888888889,0.5705464506244486,0.5705464506244485,4.5921149253845215,0.05508708953857422
256,0.3,train,0.5825098814229249,0.5743046558717051,0.5743046558717051,4.355518579483032,0.08497452735900879
256,0.3,dev,0.6029629629629629,0.5962558251647117,0.5961787316268007,4.355518579483032,0.061940908432006836
256,0.3,test,0.5822222222222222,0.5733198839994957,0.5733198839994957,4.355518579483032,0.05895400047302246
256,0.6,train,0.5706521739130435,0.5694033459046515,0.5694033459046515,1.9207818508148193,1.0689117908477783
256,0.6,dev,0.5718518518518518,0.5704906193786178,0.5705264412858081,1.9207818508148193,0.059203147888183594
256,0.6,test,0.5788888888888889,0.5776369212938599,0.57763692129386,1.9207818508148193,0.05846095085144043
512,0.003,train,0.5948616600790514,0.5921841520709245,0.5921841520709245,8.337513446807861,0.12255525588989258
512,0.003,dev,0.6192592592592593,0.6181731740654899,0.6181430050323297,8.337513446807861,0.08491849899291992
512,0.003,test,0.6055555555555555,0.6029433147211718,0.6029433147211718,8.337513446807861,0.08548784255981445
512,0.1,train,0.5563241106719368,0.5087267101227242,0.5087267101227242,2.9533865451812744,0.12170124053955078
512,0.1,dev,0.554074074074074,0.5052729490772644,0.5050427550914303,2.9533865451812744,0.08925843238830566
512,0.1,test,0.5588888888888889,0.5081757352931056,0.5081757352931056,2.9533865451812744,0.08494710922241211
512,0.3,train,0.5899209486166008,0.5805832766594463,0.5805832766594463,3.8978075981140137,0.11991548538208008
512,0.3,dev,0.5940740740740741,0.584396965502364,0.584490918012769,3.8978075981140137,0.09174919128417969
512,0.3,test,0.6011111111111112,0.5907800762711972,0.5907800762711972,3.8978075981140137,0.0880594253540039
512,0.6,train,0.5187747035573123,0.43433383490404165,0.4343338349040416,2.879784345626831,0.11040043830871582
512,0.6,dev,0.522962962962963,0.4464169281551816,0.44611196387307883,2.879784345626831,0.0810244083404541
512,0.6,test,0.5033333333333333,0.4055631487569724,0.4055631487569724,2.879784345626831,0.08204364776611328
