split,accracy,macro,micro,weighted,time
train,{'accuracy': 0.9985228951255539},{'f1': 0.9983362976225589},{'f1': 0.9985228951255539},{'f1': 0.9985231195812511},973.7043812274933
dev,{'accuracy': 0.7736608940797423},{'f1': 0.7461810178616901},{'f1': 0.7736608940797423},{'f1': 0.7741990556703038},973.7043812274933
test,{'accuracy': 0.7694864048338369},{'f1': 0.7395010258411294},{'f1': 0.769486404833837},{'f1': 0.7691392900280442},973.7043812274933
