split,accracy,macro,micro,weighted,time
train,{'accuracy': 0.38470998155359704},{'f1': 0.11313098487389825},{'f1': 0.38470998155359704},{'f1': 0.3003885739551198},1589.684742450714
dev,{'accuracy': 0.33189920098340503},{'f1': 0.09647828205265474},{'f1': 0.33189920098340503},{'f1': 0.258638344521079},1589.684742450714
test,{'accuracy': 0.330567081604426},{'f1': 0.09764672314025247},{'f1': 0.330567081604426},{'f1': 0.2596755179435861},1589.684742450714
