split,accracy,macro,micro,weighted,time
train,{'accuracy': 0.9666666666666667},{'f1': 0.966662550932214},{'f1': 0.9666666666666667},{'f1': 0.9666625509322141},110.96925020217896
dev,{'accuracy': 0.8333333333333334},{'f1': 0.8316498316498316},{'f1': 0.8333333333333334},{'f1': 0.8316498316498316},110.96925020217896
test,{'accuracy': 0.705},{'f1': 0.7049926248156204},{'f1': 0.705},{'f1': 0.7049926248156204},110.96925020217896
