channels,drop,split,micro,macro,weight,train_time,inference_time
4,0.003,train,0.6452262656103129,0.4237162108331537,0.5435149127561701,2.5153751373291016,0.23765301704406738
4,0.003,dev,0.6455900120821587,0.4197809387852215,0.5412134488280548,2.5153751373291016,0.20930719375610352
4,0.003,test,0.6453172205438067,0.43012583766636003,0.5475606631304533,2.5153751373291016,0.21507978439331055
4,0.1,train,0.5293406740969518,0.5022942803894881,0.5411968409237835,2.660233974456787,0.5809082984924316
4,0.1,dev,0.5380587998389046,0.5104162852539259,0.5494437677103449,2.660233974456787,0.19940996170043945
4,0.1,test,0.5410876132930513,0.5120851334968356,0.5519770202053851,2.660233974456787,0.1688675880432129
4,0.3,train,0.6428091849066738,0.5231045489361793,0.6032177829266175,6.9599761962890625,3.9492149353027344
4,0.3,dev,0.626258558195731,0.49691717057391277,0.5824941172688887,6.9599761962890625,0.18738198280334473
4,0.3,test,0.6465256797583081,0.5258228034087571,0.6060504637369019,6.9599761962890625,0.16521477699279785
4,0.6,train,0.497381495904391,0.4733114280663855,0.5110645432620513,6.224229097366333,0.2269129753112793
4,0.6,dev,0.50463149416029,0.4799431530250273,0.5179568095235001,6.224229097366333,0.1987595558166504
4,0.6,test,0.5012084592145015,0.47621818489920464,0.5145849960886645,6.224229097366333,0.17533516883850098
8,0.003,train,0.646703370484759,0.49769986791747145,0.5894310675995517,11.109884262084961,0.22850465774536133
8,0.003,dev,0.6415626258558196,0.4976481275039508,0.5878518725205848,11.109884262084961,0.19585657119750977
8,0.003,test,0.6392749244712991,0.49111701009901243,0.5831972368365479,11.109884262084961,0.200300931930542
8,0.1,train,0.5513629649523298,0.5180457672388903,0.5605345530869282,3.2309563159942627,0.22969579696655273
8,0.1,dev,0.5469190495368506,0.5131434493295336,0.556163441642523,3.2309563159942627,0.1950979232788086
8,0.1,test,0.5459214501510574,0.5116379540100782,0.555029836240964,3.2309563159942627,0.18833303451538086
8,0.3,train,0.6123271115885591,0.4577577578865144,0.5548301110540208,2.602160692214966,0.2271878719329834
8,0.3,dev,0.6020942408376964,0.44165774485812503,0.5420661604486456,2.602160692214966,0.1951889991760254
8,0.3,test,0.6160120845921451,0.4648944501406064,0.5602557771680128,2.602160692214966,0.19899225234985352
8,0.6,train,0.5968846515375319,0.5571375674003527,0.6016236584315209,11.139010429382324,0.23023581504821777
8,0.6,dev,0.6028997180829642,0.565441240161254,0.6082435887329749,11.139010429382324,0.18604183197021484
8,0.6,test,0.5845921450151057,0.5489050372873783,0.591453576039019,11.139010429382324,0.1709141731262207
16,0.003,train,0.6718141533503424,0.5419720024247681,0.623741447786977,10.85621190071106,0.1901538372039795
16,0.003,dev,0.6721707611759967,0.5337229045742707,0.6189609419351265,10.85621190071106,0.17422938346862793
16,0.003,test,0.6691842900302115,0.5446521550518176,0.624508116823058,10.85621190071106,0.17149090766906738
16,0.1,train,0.5870820464616624,0.5108424239315887,0.5755942393933554,6.2416675090789795,0.19072365760803223
16,0.1,dev,0.5920257752718485,0.5174721877072457,0.5811024525036742,6.2416675090789795,0.16611671447753906
16,0.1,test,0.5788519637462236,0.5087996082439107,0.5710060999299644,6.2416675090789795,0.17250704765319824
16,0.3,train,0.598361756411978,0.5332192470873587,0.5916882786414832,7.30668044090271,0.19081664085388184
16,0.3,dev,0.5871929118002417,0.5237913028704715,0.5820843936414413,7.30668044090271,0.1820366382598877
16,0.3,test,0.5978851963746223,0.5376180393206393,0.5935984111448411,7.30668044090271,0.1804661750793457
16,0.6,train,0.6651000402846784,0.44819415437190907,0.5641962955422206,12.010477066040039,0.20851469039916992
16,0.6,dev,0.6616995569875151,0.4424758890575883,0.5597612553938948,12.010477066040039,0.18593049049377441
16,0.6,test,0.6652567975830815,0.45430381434414324,0.5680831201727251,12.010477066040039,0.18872499465942383
32,0.003,train,0.6518060964146636,0.5258721949127084,0.607804699355226,12.528910160064697,0.20881104469299316
32,0.003,dev,0.639951671365284,0.5132013157894737,0.5965344224940119,12.528910160064697,0.18210339546203613
32,0.003,test,0.638368580060423,0.5094196085802257,0.5937645457299128,12.528910160064697,0.1839914321899414
32,0.1,train,0.5501544246005102,0.5290346318581076,0.5624754197324129,6.762925386428833,0.20597052574157715
32,0.1,dev,0.5291985501409585,0.509958341950542,0.5425337350859422,6.762925386428833,0.18173789978027344
32,0.1,test,0.5274924471299094,0.5062860116213775,0.5405996317590894,6.762925386428833,0.18489789962768555
32,0.3,train,0.6344836847052504,0.5642921945482913,0.6229299165027667,12.56223440170288,0.20807719230651855
32,0.3,dev,0.6322996375352397,0.5555174093895121,0.6174937621466741,12.56223440170288,0.18280529975891113
32,0.3,test,0.6507552870090635,0.5922282999757875,0.644034484670314,12.56223440170288,0.18225836753845215
32,0.6,train,0.5814421914865047,0.48296827626244865,0.5586265428207464,3.8424055576324463,0.1979537010192871
32,0.6,dev,0.5759162303664922,0.4831362920658643,0.5566017755301447,3.8424055576324463,0.16742968559265137
32,0.6,test,0.5776435045317221,0.4887833224698124,0.5602578167370007,3.8424055576324463,0.16683602333068848
64,0.003,train,0.6550288706861823,0.5184497445710027,0.6044401827731216,10.34036636352539,0.1999056339263916
64,0.003,dev,0.6496173983084977,0.5147567010976214,0.60057714477727,10.34036636352539,0.17449402809143066
64,0.003,test,0.654380664652568,0.5146530522471124,0.6019828100005221,10.34036636352539,0.1735377311706543
64,0.1,train,0.6107157244527998,0.5433656761405661,0.6021674490900932,7.178758144378662,0.19676423072814941
64,0.1,dev,0.6178010471204188,0.5455581271965206,0.606344341637538,7.178758144378662,0.1734449863433838
64,0.1,test,0.6172205438066465,0.5527146769999438,0.609676898285099,7.178758144378662,0.17362761497497559
64,0.3,train,0.6551631529474956,0.5245697636260578,0.6081187498252969,8.126495599746704,0.19735383987426758
64,0.3,dev,0.6616995569875151,0.5451230469942685,0.6223770110550277,8.126495599746704,0.17279410362243652
64,0.3,test,0.6425981873111782,0.5126912485833035,0.5970661473474586,8.126495599746704,0.17485809326171875
64,0.6,train,0.4804619309789177,0.4774647630102826,0.49073413963737794,3.79634952545166,0.20610308647155762
64,0.6,dev,0.4607329842931937,0.45762368177854773,0.4714005381333354,3.79634952545166,0.1729438304901123
64,0.6,test,0.4797583081570997,0.4771899005308616,0.48947840253570746,3.79634952545166,0.17439770698547363
128,0.003,train,0.6436148784745536,0.6047573806957238,0.6463107733953973,10.924014568328857,10.197009086608887
128,0.003,dev,0.6347160692710431,0.5960729732856364,0.6379866438010582,10.924014568328857,0.21915960311889648
128,0.003,test,0.638368580060423,0.601805651827707,0.6422691117861464,10.924014568328857,0.19867610931396484
128,0.1,train,0.6091043373170404,0.5700666449527176,0.6135056457698808,10.173901081085205,0.22051024436950684
128,0.1,dev,0.6133709222714459,0.5757948507679429,0.6181505578889416,10.173901081085205,0.20145750045776367
128,0.1,test,0.6132930513595166,0.574451843593375,0.6175655842137924,10.173901081085205,0.2019033432006836
128,0.3,train,0.6602658788774003,0.5409202107181669,0.6194048389492982,14.71651554107666,0.21726107597351074
128,0.3,dev,0.6616995569875151,0.5446233009505246,0.6220851923554596,14.71651554107666,0.1945631504058838
128,0.3,test,0.6631419939577039,0.5410924130569912,0.6204568154001611,14.71651554107666,0.20217204093933105
128,0.6,train,0.6089700550557271,0.551141144970037,0.6051623901941179,8.25499701499939,2.6402337551116943
128,0.6,dev,0.603705195328232,0.5454350611947829,0.6000346356977786,8.25499701499939,0.19340777397155762
128,0.6,test,0.6120845921450151,0.5531586862610521,0.6075744562537301,8.25499701499939,0.1983017921447754
256,0.003,train,0.6383778702833356,0.5906009269243808,0.6374951987668768,19.52314043045044,0.27550387382507324
256,0.003,dev,0.6165928312525171,0.5718096977074457,0.6182659246601786,19.52314043045044,0.22090840339660645
256,0.003,test,0.6190332326283988,0.5706639700408742,0.618989695938401,19.52314043045044,0.2299787998199463
256,0.1,train,0.5662682959581039,0.5386199306102218,0.5764904562677432,8.24081540107727,0.2472078800201416
256,0.1,dev,0.5654450261780105,0.5423315126176027,0.5768360946889641,8.24081540107727,0.21810221672058105
256,0.1,test,0.5625377643504532,0.5353980670990006,0.573054397035391,8.24081540107727,0.21687746047973633
256,0.3,train,0.5293406740969518,0.5152879801173575,0.5429611479935775,8.958531856536865,0.2639312744140625
256,0.3,dev,0.5219492549335482,0.50868361720837,0.535767627563942,8.958531856536865,0.2210254669189453
256,0.3,test,0.5274924471299094,0.5172558621142404,0.5408297404698266,8.958531856536865,0.24031901359558105
256,0.6,train,0.4922787699744864,0.4920940995960416,0.4953414371662985,7.3425397872924805,0.2632589340209961
256,0.6,dev,0.4881192106322996,0.4880444761029844,0.4901196048669705,7.3425397872924805,0.23908519744873047
256,0.6,test,0.49486404833836856,0.4944903178662769,0.49909966035540704,7.3425397872924805,0.24089860916137695
512,0.003,train,0.6249496441520075,0.5416956410158724,0.6071919377489945,22.99790596961975,0.331942081451416
512,0.003,dev,0.616995569875151,0.539608283542586,0.6029320649915316,22.99790596961975,0.290546178817749
512,0.003,test,0.6308157099697885,0.5466781969070982,0.612170931479038,22.99790596961975,0.28746986389160156
512,0.1,train,0.6508661205854707,0.5859345635382217,0.6409139117738883,33.86442828178406,0.3174152374267578
512,0.1,dev,0.6556584776480064,0.5924276297538495,0.6462837609356826,33.86442828178406,0.2843742370605469
512,0.1,test,0.6507552870090635,0.5893450100346652,0.6425992345984013,33.86442828178406,0.289409875869751
512,0.3,train,0.6123271115885591,0.58067526656473,0.6193041311905859,36.37261748313904,0.3318898677825928
512,0.3,dev,0.6020942408376964,0.5713477955165275,0.6098617638662021,36.37261748313904,0.28885412216186523
512,0.3,test,0.6072507552870091,0.5746781372108295,0.6141493228708287,36.37261748313904,0.30135011672973633
512,0.6,train,0.6382435880220223,0.5698757931762657,0.6273747435736567,24.345253229141235,17.38089346885681
512,0.6,dev,0.6560612162706404,0.593665302305617,0.647083386923155,24.345253229141235,0.30864620208740234
512,0.6,test,0.6444108761329305,0.5826854083162133,0.636507300913665,24.345253229141235,0.2955324649810791
