split,accracy,macro,micro,weighted,time
train,{'accuracy': 1.0},{'f1': 1.0},{'f1': 1.0},{'f1': 1.0},270.94662284851074
dev,{'accuracy': 0.9734848484848485},{'f1': 0.9736422220753859},{'f1': 0.9734848484848485},{'f1': 0.9734830464016402},270.94662284851074
test,{'accuracy': 0.9829545454545454},{'f1': 0.9868494041170097},{'f1': 0.9829545454545454},{'f1': 0.9829240043993565},270.94662284851074
