split,accracy,macro,micro,weighted,time
train,{'accuracy': 0.8018036482885837},{'f1': 0.5971485013066946},{'f1': 0.8018036482885837},{'f1': 0.7912376386273269},1604.3724811077118
dev,{'accuracy': 0.49354640442532266},{'f1': 0.3660473330504715},{'f1': 0.49354640442532266},{'f1': 0.4861449199301623},1604.3724811077118
test,{'accuracy': 0.4707238358690641},{'f1': 0.350021691766381},{'f1': 0.4707238358690641},{'f1': 0.46386891518629436},1604.3724811077118
