split,accracy,macro,micro,weighted,time
train,{'accuracy': 0.9998442367601246},{'f1': 0.9998438936104317},{'f1': 0.9998442367601246},{'f1': 0.9998442356200924},1998.6215081214905
dev,{'accuracy': 0.9827102803738318},{'f1': 0.9826548277870623},{'f1': 0.9827102803738318},{'f1': 0.9827006563711692},1998.6215081214905
test,{'accuracy': 0.9841121495327103},{'f1': 0.9840730729863032},{'f1': 0.9841121495327103},{'f1': 0.984109937652725},1998.6215081214905
