split,accracy,macro,micro,weighted,time
train,{'accuracy': 0.9960474308300395},{'f1': 0.9960474308300395},{'f1': 0.9960474308300395},{'f1': 0.9960474308300395},675.4155204296112
dev,{'accuracy': 0.7214814814814815},{'f1': 0.7214515251022882},{'f1': 0.7214814814814815},{'f1': 0.7214472456195462},675.4155204296112
test,{'accuracy': 0.7444444444444445},{'f1': 0.7443181818181819},{'f1': 0.7444444444444445},{'f1': 0.7443181818181818},675.4155204296112
