split,accracy,macro,micro,weighted,time
train,{'accuracy': 1.0},{'f1': 1.0},{'f1': 1.0},{'f1': 1.0},270.37006068229675
dev,{'accuracy': 0.9772727272727273},{'f1': 0.9820793106438886},{'f1': 0.9772727272727273},{'f1': 0.9773136167869951},270.37006068229675
test,{'accuracy': 0.9829545454545454},{'f1': 0.9868413971494541},{'f1': 0.9829545454545454},{'f1': 0.982927528632505},270.37006068229675
