split,accracy,macro,micro,weighted,time
train,{'accuracy': 0.9926144756277696},{'f1': 0.9917098476428337},{'f1': 0.9926144756277696},{'f1': 0.9926280818210389},1205.8590173721313
dev,{'accuracy': 0.7813129279097866},{'f1': 0.7551248695727981},{'f1': 0.7813129279097866},{'f1': 0.7819902052805707},1205.8590173721313
test,{'accuracy': 0.777643504531722},{'f1': 0.7528697084013505},{'f1': 0.7776435045317222},{'f1': 0.7791091298753127},1205.8590173721313
