split,accracy,macro,micro,weighted,time
train,{'accuracy': 1.0},{'f1': 1.0},{'f1': 1.0},{'f1': 1.0},260.757372379303
dev,{'accuracy': 0.9734848484848485},{'f1': 0.978811493517376},{'f1': 0.9734848484848485},{'f1': 0.9736127904577102},260.757372379303
test,{'accuracy': 0.9801136363636364},{'f1': 0.9847232058642579},{'f1': 0.9801136363636364},{'f1': 0.9801471601148287},260.757372379303
