split,accracy,macro,micro,weighted,time
train,{'accuracy': 0.88},{'f1': 0.570673809307628},{'f1': 0.88},{'f1': 0.8502006104648883},87.89487409591675
dev,{'accuracy': 0.4342105263157895},{'f1': 0.2668449197860962},{'f1': 0.4342105263157895},{'f1': 0.41165916127216434},87.89487409591675
test,{'accuracy': 0.36633663366336633},{'f1': 0.22767402376910012},{'f1': 0.36633663366336633},{'f1': 0.3614281631898334},87.89487409591675
