split,accracy,macro,micro,weighted,time
train,{'accuracy': 0.897724943635991},{'f1': 0.7502553180416967},{'f1': 0.897724943635991},{'f1': 0.893783166555924},1593.3884060382843
dev,{'accuracy': 0.5119852489244008},{'f1': 0.43445847747573674},{'f1': 0.5119852489244008},{'f1': 0.5078446620647062},1593.3884060382843
test,{'accuracy': 0.49608114338404796},{'f1': 0.4013942041485552},{'f1': 0.49608114338404796},{'f1': 0.4922560179688286},1593.3884060382843
