channels,drop,split,micro,macro,weight,train_time,inference_time
4,0.003,train,0.5676923076923077,0.40231323683472775,0.5319950536235782,2.2869749069213867,0.05106401443481445
4,0.003,dev,0.5069124423963134,0.33700197757538375,0.47370613997317534,2.2869749069213867,0.020938634872436523
4,0.003,test,0.5224913494809689,0.3527121581013797,0.4871827507386839,2.2869749069213867,0.020563602447509766
4,0.1,train,0.48615384615384616,0.3450556909616048,0.45239794740166467,2.4819998741149902,0.053403377532958984
4,0.1,dev,0.5253456221198156,0.3903187476466516,0.49971388624705687,2.4819998741149902,0.019808292388916016
4,0.1,test,0.5397923875432526,0.36666690861468865,0.49937944684310587,2.4819998741149902,0.016718387603759766
4,0.3,train,0.40307692307692305,0.25860077422577427,0.40506349419810966,1.5194435119628906,0.04674983024597168
4,0.3,dev,0.4470046082949309,0.29719658995974785,0.44714215366652915,1.5194435119628906,0.017361879348754883
4,0.3,test,0.4117647058823529,0.2567029880232128,0.4106398072981799,1.5194435119628906,0.016933679580688477
4,0.6,train,0.4230769230769231,0.23821941180821907,0.34392133531748464,0.7347917556762695,0.04595541954040527
4,0.6,dev,0.391705069124424,0.22391065607384392,0.3263355450240609,0.7347917556762695,0.017673254013061523
4,0.6,test,0.4463667820069204,0.2186593559223489,0.35583654506333917,0.7347917556762695,0.016753673553466797
8,0.003,train,0.5723076923076923,0.3914585843470763,0.5395969929471768,1.6655831336975098,0.04273676872253418
8,0.003,dev,0.5207373271889401,0.3455997650525387,0.48721477432329385,1.6655831336975098,0.017098426818847656
8,0.003,test,0.5743944636678201,0.36616583696744226,0.5277044734770958,1.6655831336975098,0.016619205474853516
8,0.1,train,0.5246153846153846,0.3647483932000206,0.4995065439218587,1.4305369853973389,0.04236912727355957
8,0.1,dev,0.5069124423963134,0.3487918331668332,0.4864648600247679,1.4305369853973389,0.016637086868286133
8,0.1,test,0.5259515570934256,0.33891769729511717,0.49743045309963524,1.4305369853973389,0.016237258911132812
8,0.3,train,0.33076923076923076,0.19330131391930067,0.2769462589874061,0.6045794486999512,0.04180407524108887
8,0.3,dev,0.37788018433179726,0.2475852754071806,0.33504329682766215,0.6045794486999512,0.016406774520874023
8,0.3,test,0.3494809688581315,0.22008386581469652,0.3024654255613165,0.6045794486999512,0.016164779663085938
8,0.6,train,0.3523076923076923,0.1923114119922631,0.29040767742895407,0.6265847682952881,0.04202556610107422
8,0.6,dev,0.359447004608295,0.19752143281555049,0.3024834567257988,0.6265847682952881,0.016862869262695312
8,0.6,test,0.34256055363321797,0.18667572403737823,0.2801655964690243,0.6265847682952881,0.016281604766845703
16,0.003,train,0.4907692307692308,0.3773426477259675,0.4791833440845507,1.0375099182128906,0.04216718673706055
16,0.003,dev,0.4930875576036866,0.40096877831433075,0.4848641354318145,1.0375099182128906,0.016915321350097656
16,0.003,test,0.4809688581314879,0.3626906672449938,0.4796778277310388,1.0375099182128906,0.016570329666137695
16,0.1,train,0.5676923076923077,0.3794954991029612,0.5259630113808116,1.1169962882995605,0.042382001876831055
16,0.1,dev,0.5668202764976958,0.4257370808003719,0.544322158368708,1.1169962882995605,0.0176546573638916
16,0.1,test,0.5536332179930796,0.3736374296435272,0.5223361270344138,1.1169962882995605,0.016956806182861328
16,0.3,train,0.4646153846153846,0.2893565159428639,0.43932471309589094,0.8269944190979004,0.04159808158874512
16,0.3,dev,0.4838709677419355,0.288404889167322,0.4569609405803725,0.8269944190979004,0.016867876052856445
16,0.3,test,0.4429065743944636,0.24953072779159735,0.41346320539941717,0.8269944190979004,0.01658463478088379
16,0.6,train,0.32153846153846155,0.24190880504887333,0.2933645854181378,0.9146859645843506,0.04176950454711914
16,0.6,dev,0.31797235023041476,0.23725251158553012,0.2985083374095602,0.9146859645843506,0.017031431198120117
16,0.6,test,0.2768166089965398,0.18158992023205223,0.23822249712067567,0.9146859645843506,0.016539335250854492
32,0.003,train,0.48307692307692307,0.3753862623392933,0.476320883781218,0.9776654243469238,0.0414578914642334
32,0.003,dev,0.47465437788018433,0.3701513151022267,0.46586694286747926,0.9776654243469238,0.017250776290893555
32,0.003,test,0.46366782006920415,0.3365202258986142,0.45383698313950777,0.9776654243469238,0.01704573631286621
32,0.1,train,0.4876923076923077,0.41474412974954644,0.5081223049449559,1.3559730052947998,0.041893720626831055
32,0.1,dev,0.4377880184331797,0.3587160180245287,0.4555685514603055,1.3559730052947998,0.016948938369750977
32,0.1,test,0.4359861591695502,0.3515782657148881,0.4527225333709775,1.3559730052947998,0.016509294509887695
32,0.3,train,0.5046153846153846,0.3352070951789001,0.4482241672881831,1.0096955299377441,0.040999650955200195
32,0.3,dev,0.4700460829493088,0.2914752858175018,0.422070218671223,1.0096955299377441,0.016686439514160156
32,0.3,test,0.532871972318339,0.36985147254603484,0.4874517028170733,1.0096955299377441,0.016518115997314453
32,0.6,train,0.48923076923076925,0.31837399984143616,0.46819102202009694,1.5813205242156982,0.0451507568359375
32,0.6,dev,0.4884792626728111,0.32888888888888884,0.47231950844854065,1.5813205242156982,0.01743340492248535
32,0.6,test,0.5501730103806228,0.39019879384904854,0.5281648988242181,1.5813205242156982,0.0171658992767334
64,0.003,train,0.5384615384615384,0.46456275915525946,0.5496652899603971,1.4887728691101074,0.046834707260131836
64,0.003,dev,0.5161290322580645,0.47389694395139037,0.5242634511078145,1.4887728691101074,0.018146038055419922
64,0.003,test,0.5190311418685121,0.3897643517043371,0.5233272349683016,1.4887728691101074,0.0175020694732666
64,0.1,train,0.5123076923076924,0.2851751010825616,0.4733034182460294,1.0995044708251953,0.0454251766204834
64,0.1,dev,0.5161290322580645,0.2883771929824561,0.4741692942032501,1.0995044708251953,0.018326997756958008
64,0.1,test,0.48788927335640137,0.2955138156336114,0.45335484685995836,1.0995044708251953,0.018395423889160156
64,0.3,train,0.39692307692307693,0.18574349121899555,0.3343283559466224,0.7387254238128662,0.045058250427246094
64,0.3,dev,0.4055299539170507,0.19047619047619047,0.3434108134568964,0.7387254238128662,0.01793694496154785
64,0.3,test,0.3391003460207612,0.15989526286966046,0.2900958189473844,0.7387254238128662,0.017447233200073242
64,0.6,train,0.4815384615384615,0.2972083001035851,0.4355398679412788,0.8984124660491943,0.04470634460449219
64,0.6,dev,0.4792626728110599,0.27808631741821394,0.4285996107464405,0.8984124660491943,0.017786502838134766
64,0.6,test,0.4809688581314879,0.27937091503267975,0.43273967026256865,0.8984124660491943,0.017340898513793945
128,0.003,train,0.5353846153846153,0.4301674676334812,0.5300533618266992,1.4784104824066162,0.04523968696594238
128,0.003,dev,0.511520737327189,0.42797574219895623,0.4966729087247337,1.4784104824066162,0.01851630210876465
128,0.003,test,0.4740484429065744,0.34187583668005356,0.4615559122302358,1.4784104824066162,0.018418073654174805
128,0.1,train,0.5276923076923077,0.40856242697950157,0.4908825460722956,1.139570951461792,0.0440363883972168
128,0.1,dev,0.5161290322580645,0.38854833076349243,0.4722250003425601,1.139570951461792,0.01865863800048828
128,0.1,test,0.47750865051903113,0.30523408043569333,0.424331514562009,1.139570951461792,0.018428325653076172
128,0.3,train,0.5015384615384615,0.3652494051166052,0.4754245456481602,1.222020149230957,0.04452633857727051
128,0.3,dev,0.5023041474654378,0.3303468720662146,0.47157451085279706,1.222020149230957,0.01868414878845215
128,0.3,test,0.47750865051903113,0.32257830404889226,0.4486468182743371,1.222020149230957,0.018047809600830078
128,0.6,train,0.41230769230769226,0.3034514226237284,0.40756404852591527,0.8585498332977295,0.04314875602722168
128,0.6,dev,0.3456221198156682,0.25495671346112214,0.3452778823832329,0.8585498332977295,0.018512248992919922
128,0.6,test,0.4083044982698962,0.2889528083243107,0.40655712931004245,0.8585498332977295,0.017821073532104492
256,0.003,train,0.2953846153846154,0.12459114620047934,0.15352742140138165,0.7467327117919922,0.0449063777923584
256,0.003,dev,0.2995391705069124,0.1288156288156288,0.16265761887881702,0.7467327117919922,0.020378828048706055
256,0.003,test,0.2664359861591695,0.1051912568306011,0.11938661674891751,0.7467327117919922,0.019597768783569336
256,0.1,train,0.3230769230769231,0.21991171747944052,0.22411655923631757,1.1438424587249756,0.04455757141113281
256,0.1,dev,0.35023041474654376,0.22157936067997044,0.2682628805760199,1.1438424587249756,0.019758939743041992
256,0.1,test,0.3079584775086505,0.18667521994134897,0.20537879633481823,1.1438424587249756,0.019573450088500977
256,0.3,train,0.52,0.3427048114437271,0.42477477753216986,1.3926386833190918,0.045004844665527344
256,0.3,dev,0.4930875576036866,0.29906633221850615,0.3932154801720019,1.3926386833190918,0.020122528076171875
256,0.3,test,0.48788927335640137,0.2632094133804569,0.3910468186647629,1.3926386833190918,0.019736289978027344
256,0.6,train,0.5046153846153846,0.28583918579422174,0.43708896618968557,0.8705289363861084,0.08678269386291504
256,0.6,dev,0.4884792626728111,0.2772488727823287,0.42464148372465993,0.8705289363861084,0.019837617874145508
256,0.6,test,0.49480968858131485,0.27906311532116435,0.4176674617293598,0.8705289363861084,0.019306182861328125
512,0.003,train,0.32769230769230767,0.22684597440718918,0.2494996869541671,1.6896631717681885,0.04892253875732422
512,0.003,dev,0.3686635944700461,0.26060083806434176,0.2998178608491771,1.6896631717681885,0.024523496627807617
512,0.003,test,0.33217993079584773,0.2318402708261289,0.24915560492481448,1.6896631717681885,0.02432537078857422
512,0.1,train,0.6015384615384616,0.4709412542403725,0.5741307514911097,4.408740282058716,0.05353546142578125
512,0.1,dev,0.5576036866359447,0.4440519323671498,0.5345655513257196,4.408740282058716,0.025282859802246094
512,0.1,test,0.5640138408304498,0.37805198608262675,0.5152943332943911,4.408740282058716,0.02494192123413086
512,0.3,train,0.5615384615384615,0.4659055506366991,0.5397523381467285,4.229930400848389,0.0531008243560791
512,0.3,dev,0.4930875576036866,0.396349584039918,0.4777885061397221,4.229930400848389,0.025272846221923828
512,0.3,test,0.5155709342560554,0.3877683337738981,0.48260679791170247,4.229930400848389,0.024851322174072266
512,0.6,train,0.5384615384615384,0.3144233917909317,0.49228940278528494,2.3755760192871094,0.052286624908447266
512,0.6,dev,0.5345622119815668,0.3302853356809449,0.4950734682998693,2.3755760192871094,0.025006532669067383
512,0.6,test,0.5224913494809689,0.34039489921842864,0.49013677143129614,2.3755760192871094,0.024603605270385742
