channels,drop,split,micro,macro,weight,train_time,inference_time
4,0.003,train,0.5555555555555556,0.49717549196101557,0.49717549196101557,0.820711612701416,0.03539276123046875
4,0.003,dev,0.6,0.5238095238095238,0.5238095238095238,0.820711612701416,0.010185718536376953
4,0.003,test,0.51,0.43704044117647056,0.43704044117647056,0.820711612701416,0.01002645492553711
4,0.1,train,0.4777777777777778,0.35704514363885087,0.3570451436388509,0.8976616859436035,0.03927135467529297
4,0.1,dev,0.43333333333333335,0.3023255813953488,0.3023255813953488,0.8976616859436035,0.011374473571777344
4,0.1,test,0.49,0.3605015673981191,0.36050156739811906,0.8976616859436035,0.011026382446289062
4,0.3,train,0.5259259259259259,0.4803007518796993,0.4803007518796993,0.5577127933502197,0.038080453872680664
4,0.3,dev,0.6333333333333333,0.6122209165687428,0.6122209165687428,0.5577127933502197,0.011168956756591797
4,0.3,test,0.57,0.5209447415329769,0.5209447415329769,0.5577127933502197,0.010752439498901367
4,0.6,train,0.5851851851851851,0.5727848101265822,0.5727848101265823,0.6799039840698242,0.03644537925720215
4,0.6,dev,0.7,0.6914285714285715,0.6914285714285714,0.6799039840698242,0.010510683059692383
4,0.6,test,0.53,0.5083167695365624,0.5083167695365625,0.6799039840698242,0.010132312774658203
8,0.003,train,0.6074074074074074,0.5976720647773279,0.5976720647773279,0.8896670341491699,0.035642147064208984
8,0.003,dev,0.6333333333333333,0.6228571428571429,0.6228571428571429,0.8896670341491699,0.01064300537109375
8,0.003,test,0.55,0.5381773399014778,0.5381773399014778,0.8896670341491699,0.010234594345092773
8,0.1,train,0.5592592592592592,0.524500155392106,0.524500155392106,0.5711817741394043,0.03593134880065918
8,0.1,dev,0.5333333333333333,0.5138888888888888,0.5138888888888888,0.5711817741394043,0.01043248176574707
8,0.1,test,0.57,0.5459824728117411,0.5459824728117411,0.5711817741394043,0.010167360305786133
8,0.3,train,0.6148148148148148,0.6142857142857143,0.6142857142857144,0.6464121341705322,0.03531622886657715
8,0.3,dev,0.5666666666666667,0.5661846496106784,0.5661846496106785,0.6464121341705322,0.010289430618286133
8,0.3,test,0.5,0.49919871794871795,0.49919871794871795,0.6464121341705322,0.010018587112426758
8,0.6,train,0.6592592592592592,0.6592592592592592,0.6592592592592592,0.5464410781860352,0.03559517860412598
8,0.6,dev,0.7,0.6969696969696968,0.6969696969696969,0.5464410781860352,0.010555744171142578
8,0.6,test,0.56,0.5596036432789511,0.559603643278951,0.5464410781860352,0.010215044021606445
16,0.003,train,0.5962962962962963,0.5470844426660921,0.5470844426660921,0.8070454597473145,0.035297393798828125
16,0.003,dev,0.6,0.55,0.55,0.8070454597473145,0.010512590408325195
16,0.003,test,0.565,0.5022740925083669,0.5022740925083669,0.8070454597473145,0.010231256484985352
16,0.1,train,0.6296296296296297,0.6293041902355978,0.6293041902355979,0.64634108543396,0.03542757034301758
16,0.1,dev,0.6,0.6,0.6,0.64634108543396,0.010637283325195312
16,0.1,test,0.53,0.529811924769908,0.529811924769908,0.64634108543396,0.010343074798583984
16,0.3,train,0.6444444444444445,0.6338155515370705,0.6338155515370705,0.6960053443908691,0.03499412536621094
16,0.3,dev,0.6666666666666666,0.6527777777777778,0.6527777777777779,0.6960053443908691,0.010578393936157227
16,0.3,test,0.57,0.5520833333333334,0.5520833333333334,0.6960053443908691,0.010326147079467773
16,0.6,train,0.5296296296296297,0.438043887969321,0.43804388796932103,0.7932858467102051,0.03632783889770508
16,0.6,dev,0.5666666666666667,0.466484268125855,0.46648426812585503,0.7932858467102051,0.010557413101196289
16,0.6,test,0.515,0.4018069131386636,0.4018069131386637,0.7932858467102051,0.010312080383300781
32,0.003,train,0.5703703703703704,0.5193075081343237,0.5193075081343237,0.6035456657409668,0.0349574089050293
32,0.003,dev,0.6666666666666666,0.625,0.625,0.6035456657409668,0.010461091995239258
32,0.003,test,0.53,0.45545128026879855,0.4554512802687986,0.6035456657409668,0.01027059555053711
32,0.1,train,0.6,0.5833333333333333,0.5833333333333334,0.6297476291656494,0.03483843803405762
32,0.1,dev,0.6333333333333333,0.6228571428571429,0.6228571428571429,0.6297476291656494,0.010587215423583984
32,0.1,test,0.58,0.5543293718166383,0.5543293718166383,0.6297476291656494,0.010292291641235352
32,0.3,train,0.5222222222222223,0.42504828405883227,0.4250482840588323,1.059096336364746,0.0389096736907959
32,0.3,dev,0.5666666666666667,0.466484268125855,0.46648426812585503,1.059096336364746,0.01122283935546875
32,0.3,test,0.535,0.4324942791762014,0.43249427917620137,1.059096336364746,0.010945796966552734
32,0.6,train,0.6074074074074074,0.5945945945945945,0.5945945945945945,0.7093734741210938,0.038971662521362305
32,0.6,dev,0.7,0.6827262044653348,0.6827262044653349,0.7093734741210938,0.010998249053955078
32,0.6,test,0.55,0.53125,0.5312500000000001,0.7093734741210938,0.010766267776489258
64,0.003,train,0.6481481481481481,0.6467477379460413,0.6467477379460412,0.8203041553497314,0.03731036186218262
64,0.003,dev,0.6666666666666666,0.6606334841628959,0.6606334841628959,0.8203041553497314,0.011055707931518555
64,0.003,test,0.565,0.562539283469516,0.562539283469516,0.8203041553497314,0.01091313362121582
64,0.1,train,0.6037037037037037,0.5952591098222165,0.5952591098222165,0.6813397407531738,0.03655552864074707
64,0.1,dev,0.7,0.6827262044653348,0.6827262044653349,0.6813397407531738,0.011102676391601562
64,0.1,test,0.585,0.5702932877740674,0.5702932877740675,0.6813397407531738,0.01060032844543457
64,0.3,train,0.6074074074074074,0.6031393865439014,0.6031393865439015,0.8633232116699219,0.03673553466796875
64,0.3,dev,0.6333333333333333,0.6228571428571429,0.6228571428571429,0.8633232116699219,0.010873794555664062
64,0.3,test,0.545,0.5389019786678827,0.5389019786678827,0.8633232116699219,0.010722875595092773
64,0.6,train,0.6592592592592592,0.6530920060331824,0.6530920060331825,0.7390060424804688,0.03607439994812012
64,0.6,dev,0.5666666666666667,0.5542857142857143,0.5542857142857142,0.7390060424804688,0.010881423950195312
64,0.6,test,0.57,0.5647332725984411,0.5647332725984411,0.7390060424804688,0.010582447052001953
128,0.003,train,0.6259259259259259,0.6256743215604452,0.6256743215604453,0.8334317207336426,0.03635716438293457
128,0.003,dev,0.7,0.6969696969696968,0.6969696969696969,0.8334317207336426,0.0113983154296875
128,0.003,test,0.55,0.5492788461538463,0.5492788461538463,0.8334317207336426,0.011190176010131836
128,0.1,train,0.5481481481481482,0.472926267281106,0.4729262672811059,0.7483079433441162,0.03639984130859375
128,0.1,dev,0.5333333333333333,0.4444444444444445,0.44444444444444453,0.7483079433441162,0.011199235916137695
128,0.1,test,0.54,0.4574831937728506,0.45748319377285057,0.7483079433441162,0.011084556579589844
128,0.3,train,0.5555555555555556,0.49425574425574426,0.4942557442557443,0.6458375453948975,0.03577113151550293
128,0.3,dev,0.5666666666666667,0.466484268125855,0.46648426812585503,0.6458375453948975,0.011318206787109375
128,0.3,test,0.53,0.4600183823529412,0.4600183823529412,0.6458375453948975,0.010865449905395508
128,0.6,train,0.5666666666666667,0.5649419509440718,0.5649419509440717,0.6901082992553711,0.03602862358093262
128,0.6,dev,0.6,0.5982142857142858,0.5982142857142858,0.6901082992553711,0.011100292205810547
128,0.6,test,0.51,0.5095586027424682,0.5095586027424681,0.6901082992553711,0.01104116439819336
256,0.003,train,0.6259259259259259,0.6258797382392889,0.6258797382392888,0.80914306640625,0.03635048866271973
256,0.003,dev,0.6,0.5982142857142858,0.5982142857142858,0.80914306640625,0.011942386627197266
256,0.003,test,0.52,0.5195676108497649,0.5195676108497649,0.80914306640625,0.01139688491821289
256,0.1,train,0.5074074074074074,0.3836145488250742,0.38361454882507423,0.7836992740631104,0.036505699157714844
256,0.1,dev,0.5666666666666667,0.466484268125855,0.46648426812585503,0.7836992740631104,0.011743545532226562
256,0.1,test,0.505,0.3757684668495223,0.3757684668495223,0.7836992740631104,0.01159048080444336
256,0.3,train,0.5037037037037037,0.36553030303030304,0.36553030303030304,0.6796483993530273,0.03612112998962402
256,0.3,dev,0.5666666666666667,0.466484268125855,0.46648426812585503,0.6796483993530273,0.011858224868774414
256,0.3,test,0.5,0.36580416032470825,0.3658041603247082,0.6796483993530273,0.011587381362915039
256,0.6,train,0.5407407407407407,0.4642857142857143,0.46428571428571436,0.6917545795440674,0.03591561317443848
256,0.6,dev,0.6,0.5238095238095238,0.5238095238095238,0.6917545795440674,0.011736154556274414
256,0.6,test,0.51,0.4050509956289461,0.40505099562894614,0.6917545795440674,0.011502742767333984
512,0.003,train,0.5740740740740741,0.5640208371361575,0.5640208371361575,1.7714498043060303,0.04424428939819336
512,0.003,dev,0.5333333333333333,0.5248868778280543,0.5248868778280543,1.7714498043060303,0.015073537826538086
512,0.003,test,0.495,0.47503833259700096,0.47503833259700096,1.7714498043060303,0.014643430709838867
512,0.1,train,0.6074074074074074,0.6047834732655766,0.6047834732655767,1.6064462661743164,0.0432584285736084
512,0.1,dev,0.6666666666666666,0.6606334841628959,0.6606334841628959,1.6064462661743164,0.014645576477050781
512,0.1,test,0.555,0.5509472993768763,0.5509472993768763,1.6064462661743164,0.014217615127563477
512,0.3,train,0.5962962962962963,0.5605560615788924,0.5605560615788923,1.5954060554504395,1.3016419410705566
512,0.3,dev,0.6333333333333333,0.5970695970695972,0.5970695970695971,1.5954060554504395,0.014452219009399414
512,0.3,test,0.58,0.5469744364146263,0.5469744364146262,1.5954060554504395,0.014010906219482422
512,0.6,train,0.5962962962962963,0.5788193202146691,0.5788193202146691,0.7734375,0.04001569747924805
512,0.6,dev,0.6666666666666666,0.6606334841628959,0.6606334841628959,0.7734375,0.014048576354980469
512,0.6,test,0.56,0.545266639107069,0.545266639107069,0.7734375,0.013776302337646484
