channels,drop,split,micro,macro,weight,train_time,inference_time
4,0.003,train,0.01762656282025005,0.009078270833819539,0.0046613572043226114,2.0868959426879883,0.17055964469909668
4,0.003,dev,0.017209588199139522,0.010703382890025998,0.0030500783769441347,2.0868959426879883,0.13234829902648926
4,0.003,test,0.02351313969571231,0.011151361091740447,0.004348188768476562,2.0868959426879883,0.1365947723388672
4,0.1,train,0.005943840951014552,0.001754281356602406,0.0001448894773466163,2.413200855255127,0.6699602603912354
4,0.1,dev,0.006146281499692686,0.001367732855099771,0.00011538840889527711,2.413200855255127,0.10772347450256348
4,0.1,test,0.004610419548178884,0.0006610259122157589,5.851405032062043e-05,2.413200855255127,0.11167526245117188
4,0.3,train,0.020086083213773313,0.01773896670523822,0.021906128481253197,2.061619520187378,0.9968452453613281
4,0.3,dev,0.019053472649047325,0.011549128437670808,0.02212646792728352,2.061619520187378,0.13286185264587402
4,0.3,test,0.022591055786076533,0.012937797904635373,0.026315558976125995,2.061619520187378,0.1155545711517334
4,0.6,train,0.0235704037712646,0.01049955194070969,0.027911635756972815,2.223864793777466,0.16855120658874512
4,0.6,dev,0.02581438229870928,0.011093040240727796,0.03300404421882439,2.223864793777466,0.1313009262084961
4,0.6,test,0.019363762102351315,0.008956817955745823,0.025089055149878216,2.223864793777466,0.11358308792114258
8,0.003,train,0.13568354170936667,0.034772742113672504,0.07575412928464505,9.410458326339722,0.1664128303527832
8,0.003,dev,0.13275968039336203,0.031362276590747334,0.07574462091002873,9.410458326339722,0.1308434009552002
8,0.003,test,0.1318579990779161,0.03181892473324798,0.07735943386479162,9.410458326339722,0.12947916984558105
8,0.1,train,0.11088337774134044,0.03342094564762714,0.08745499990824697,2.7331719398498535,0.17288970947265625
8,0.1,dev,0.10510141364474494,0.0300724386340752,0.0848070102399315,2.7331719398498535,0.13652515411376953
8,0.1,test,0.11018902720147533,0.031002594089832386,0.08795362350144154,2.7331719398498535,0.1331164836883545
8,0.3,train,0.026234884197581472,0.0032474122183884712,0.0013844266067325314,2.6946280002593994,0.16832494735717773
8,0.3,dev,0.027043638598647817,0.005216634411050395,0.002359584803197708,2.6946280002593994,0.12989139556884766
8,0.3,test,0.025357307514983864,0.003126421100500228,0.0013376296824639056,2.6946280002593994,0.13548588752746582
8,0.6,train,0.026439844230375077,0.013831961447326596,0.008827698779658142,2.2212672233581543,0.17201685905456543
8,0.6,dev,0.027658266748617086,0.011920114560548093,0.007589829642399229,2.2212672233581543,0.1318371295928955
8,0.6,test,0.030428769017980636,0.013504010574323287,0.01313166723538984,2.2212672233581543,0.13230586051940918
16,0.003,train,0.15986882557901208,0.05363882128086681,0.11435713270150782,8.977121829986572,0.13400554656982422
16,0.003,dev,0.1524277811923786,0.04915372896052655,0.10798330073946925,8.977121829986572,0.1095116138458252
16,0.003,test,0.15491009681881052,0.050994317019470534,0.1144623278785606,8.977121829986572,0.11959576606750488
16,0.1,train,0.11190817790530846,0.0311336478215086,0.0736844116093159,7.513381004333496,0.13444232940673828
16,0.1,dev,0.11493546404425323,0.030551078534539648,0.07511959523894172,7.513381004333496,0.10939431190490723
16,0.1,test,0.12540341171046565,0.036742232524251246,0.08476894609579877,7.513381004333496,0.11901330947875977
16,0.3,train,0.07194097151055544,0.020232551953280192,0.03895070039178662,2.2816286087036133,0.1353895664215088
16,0.3,dev,0.07559926244622003,0.02291357621013873,0.04423294581141776,2.2816286087036133,0.10823965072631836
16,0.3,test,0.07976025818349469,0.02768891994491352,0.04367284146935629,2.2816286087036133,0.11818456649780273
16,0.6,train,0.10411969665915147,0.03007495813202068,0.05999416008255945,2.820685386657715,0.1361227035522461
16,0.6,dev,0.10325752919483712,0.027848741649475442,0.05828447337670544,2.820685386657715,0.11018776893615723
16,0.6,test,0.10742277547256801,0.0319382845477927,0.06489529855512283,2.820685386657715,0.11081743240356445
32,0.003,train,0.17011682721869237,0.05725153544066521,0.1422744384158159,8.154820203781128,0.13695812225341797
32,0.003,dev,0.1856177012907191,0.05995295783115799,0.15692811237931045,8.154820203781128,0.11478495597839355
32,0.003,test,0.1839557399723375,0.0602093060378187,0.15568554747853627,8.154820203781128,0.11064958572387695
32,0.1,train,0.14429186308669809,0.04781812943931317,0.11916969822591006,6.225749254226685,0.1370525360107422
32,0.1,dev,0.15427166564228642,0.05884567427145746,0.12517521680229807,6.225749254226685,0.11091852188110352
32,0.1,test,0.15214384508990317,0.0520056601397224,0.12914338060295016,6.225749254226685,0.11148476600646973
32,0.3,train,0.14736626357860216,0.04524799035271271,0.09840636302929316,7.955209493637085,0.13694262504577637
32,0.3,dev,0.14935464044253227,0.04520917505620256,0.09811211014994045,7.955209493637085,0.11114382743835449
32,0.3,test,0.15168280313508528,0.04590864865558014,0.10206473327553858,7.955209493637085,0.11142349243164062
32,0.6,train,0.20496003279360525,0.03941834794643212,0.10988430856584235,7.964667320251465,0.13506221771240234
32,0.6,dev,0.21389059618930548,0.04046823220511581,0.11508230829359593,7.964667320251465,0.11052656173706055
32,0.6,test,0.21761180267404334,0.039693841539768626,0.11524886109260059,7.964667320251465,0.11079692840576172
64,0.003,train,0.12031153924984629,0.04352794994563614,0.08632637521881242,6.366875171661377,0.13957881927490234
64,0.003,dev,0.11677934849416104,0.04333682082259284,0.08414448220186496,6.366875171661377,0.11833786964416504
64,0.003,test,0.12263715998155832,0.042655063901227024,0.08747255118705932,6.366875171661377,0.11438655853271484
64,0.1,train,0.2152080344332855,0.03837806811394756,0.11064895001433254,8.96933627128601,0.13917136192321777
64,0.1,dev,0.2175783650891211,0.038631204174519214,0.11357391362873623,8.96933627128601,0.1139829158782959
64,0.1,test,0.22130013831258644,0.04011308156180765,0.11492989391328924,8.96933627128601,0.11495113372802734
64,0.3,train,0.18446402951424473,0.06107207965236232,0.1477037777224818,9.018890380859375,0.13888812065124512
64,0.3,dev,0.18070067609096496,0.05588369865006032,0.14146820757167297,9.018890380859375,0.11375164985656738
64,0.3,test,0.18211157215306592,0.062773484199672,0.1464859433754425,9.018890380859375,0.1141972541809082
64,0.6,train,0.16601762656282024,0.03153646113272792,0.08052226427918313,2.823521852493286,0.13897418975830078
64,0.6,dev,0.1757836508912108,0.03456824279797847,0.08761789614530799,2.823521852493286,0.11510705947875977
64,0.6,test,0.18579990779160904,0.03616021758217972,0.09180059954743765,2.823521852493286,0.11452078819274902
128,0.003,train,0.093461774953884,0.03188494999249672,0.04873411503577939,6.683122873306274,0.14434814453125
128,0.003,dev,0.08973570989551322,0.022983602275859223,0.0397464311753419,6.683122873306274,0.11939454078674316
128,0.003,test,0.10511756569847858,0.0296290736738449,0.056205759327697016,6.683122873306274,0.11991596221923828
128,0.1,train,0.10268497642959623,0.030012780803769363,0.08565104705736089,7.173739910125732,0.1447126865386963
128,0.1,dev,0.10325752919483712,0.02976435820223722,0.08350006553862845,7.173739910125732,0.12259888648986816
128,0.1,test,0.11433840479483633,0.03289703037971251,0.09325332075357656,7.173739910125732,0.13519573211669922
128,0.3,train,0.16622258659561384,0.022600135484492374,0.061111743031871855,11.287877082824707,0.14575910568237305
128,0.3,dev,0.16717885679164105,0.021580262381644965,0.06075559466223988,11.287877082824707,0.1208944320678711
128,0.3,test,0.16966343937298295,0.022884395329400037,0.06389903515402086,11.287877082824707,0.12038779258728027
128,0.6,train,0.18999795039967207,0.05046428026063136,0.13348257121103016,11.015050888061523,0.15057802200317383
128,0.6,dev,0.19114935464044253,0.048891345256526136,0.13322599376571195,11.015050888061523,0.12072277069091797
128,0.6,test,0.19317657906869526,0.051450570261051806,0.1372375064483621,11.015050888061523,0.12128162384033203
256,0.003,train,0.039762246361959415,0.017120866419003556,0.04024526868865772,17.111685276031494,0.17175960540771484
256,0.003,dev,0.03380454824830977,0.014651423333611246,0.03340121970099679,17.111685276031494,0.15099740028381348
256,0.003,test,0.03503918856615952,0.015263281645498726,0.03537333959615953,17.111685276031494,0.1480715274810791
256,0.1,train,0.08772289403566305,0.020469963985382703,0.029072615443028096,9.838235855102539,0.1686415672302246
256,0.1,dev,0.08481868469575907,0.019992877845961297,0.028562412139116658,9.838235855102539,0.1435554027557373
256,0.1,test,0.08898109727985248,0.02109968105999125,0.03289681192244207,9.838235855102539,0.16367387771606445
256,0.3,train,0.19717155154744828,0.04706154887855474,0.12840125130655183,8.016720056533813,2.776933193206787
256,0.3,dev,0.2071296865396435,0.050755261528851604,0.13397686722383523,8.016720056533813,0.14078640937805176
256,0.3,test,0.18810511756569848,0.045525845531551416,0.12368282024383656,8.016720056533813,0.13644003868103027
256,0.6,train,0.10965361754457881,0.035549057900255594,0.08537750704340626,9.237490177154541,0.1729567050933838
256,0.6,dev,0.10571604179471418,0.03454904568210263,0.08180335497566317,9.237490177154541,0.1452333927154541
256,0.6,test,0.11572153065929,0.03852070006442202,0.0917163181921525,9.237490177154541,0.14282011985778809
512,0.003,train,0.13896290223406435,0.03463004824035626,0.06584541615807342,27.7816801071167,13.816866397857666
512,0.003,dev,0.12784265519360788,0.029583281686801237,0.06143061900567892,27.7816801071167,0.20138144493103027
512,0.003,test,0.13785154449054865,0.03381775600284678,0.07123874533818676,27.7816801071167,0.1923837661743164
512,0.1,train,0.16950194712031155,0.018561154379640423,0.050597344891747185,5.693244457244873,0.22307348251342773
512,0.1,dev,0.17086662569145666,0.018893360829224548,0.05175934299284743,5.693244457244873,0.19180965423583984
512,0.1,test,0.17058552328261872,0.01916311558454121,0.05273282108781053,5.693244457244873,0.18685197830200195
512,0.3,train,0.19020291043246568,0.02955354436949989,0.09174122935932562,6.04676628112793,0.22932696342468262
512,0.3,dev,0.19422249539028888,0.030972950420143974,0.09512637308150444,6.04676628112793,0.21623897552490234
512,0.3,test,0.1839557399723375,0.028883609346704524,0.08945100285522846,6.04676628112793,0.21423602104187012
512,0.6,train,0.20987907358065178,0.02195385519045734,0.07405854552787049,5.915501356124878,0.20087432861328125
512,0.6,dev,0.21143208358942836,0.022359028483340926,0.07535239050255127,5.915501356124878,0.18880748748779297
512,0.6,test,0.20977408944213924,0.021774502297090353,0.07356549231584976,5.915501356124878,0.1891777515411377
