split,accracy,macro,micro,weighted,time
train,{'accuracy': 0.9980237154150198},{'f1': 0.9980237154150198},{'f1': 0.9980237154150198},{'f1': 0.9980237154150198},656.7768404483795
dev,{'accuracy': 0.7407407407407407},{'f1': 0.7407384646449571},{'f1': 0.7407407407407407},{'f1': 0.7407396026928489},656.7768404483795
test,{'accuracy': 0.7511111111111111},{'f1': 0.7511061946902655},{'f1': 0.7511111111111111},{'f1': 0.7511061946902655},656.7768404483795
