channels,drop,split,micro,macro,weight,train_time,inference_time
4,0.003,train,0.24444444444444444,0.13859672027377207,0.21486923514815034,1.5039784908294678,0.03468036651611328
4,0.003,dev,0.2236842105263158,0.11974960876369325,0.172852318589902,1.5039784908294678,0.010311126708984375
4,0.003,test,0.25742574257425743,0.14760683760683763,0.2242870440890243,1.5039784908294678,0.01014852523803711
4,0.1,train,0.26666666666666666,0.1617171102185138,0.26936871517595495,0.8785805702209473,0.0341489315032959
4,0.1,dev,0.34210526315789475,0.2146876141761052,0.3451916235601792,0.8785805702209473,0.009600162506103516
4,0.1,test,0.33663366336633666,0.20385185185185187,0.33437477081041445,0.8785805702209473,0.009320974349975586
4,0.3,train,0.32,0.13652766639935848,0.25114942528735634,1.134416103363037,0.037650108337402344
4,0.3,dev,0.34210526315789475,0.1581081081081081,0.269825746799431,1.134416103363037,0.00990605354309082
4,0.3,test,0.3564356435643564,0.1627936507936508,0.2831620304887632,1.134416103363037,0.009684324264526367
4,0.6,train,0.38666666666666666,0.1713951805887918,0.30409532466408196,0.5557713508605957,0.03651833534240723
4,0.6,dev,0.39473684210526316,0.17767441860465116,0.31738066095471235,0.5557713508605957,0.01044154167175293
4,0.6,test,0.36633663366336633,0.16733477789815815,0.30413095480729,0.5557713508605957,0.009735584259033203
8,0.003,train,0.18222222222222223,0.07154331612162937,0.07436093580671894,0.5570528507232666,0.03496575355529785
8,0.003,dev,0.23684210526315788,0.10842424242424242,0.1419896331738437,0.5570528507232666,0.009785890579223633
8,0.003,test,0.19801980198019803,0.07478260869565218,0.08351269909599655,0.5570528507232666,0.00954127311706543
8,0.1,train,0.39555555555555555,0.11337579617834397,0.23430997876857754,0.5702152252197266,0.03454852104187012
8,0.1,dev,0.42105263157894735,0.1329811320754717,0.26384309831181724,0.5702152252197266,0.009543895721435547
8,0.1,test,0.40594059405940597,0.11549295774647887,0.2401338725421838,0.5702152252197266,0.009280681610107422
8,0.3,train,0.4222222222222222,0.17793465471988415,0.33693546927323736,0.6169068813323975,0.0350344181060791
8,0.3,dev,0.35526315789473684,0.14320416425679583,0.2726705427536452,0.6169068813323975,0.009678363800048828
8,0.3,test,0.36633663366336633,0.16665259603208105,0.3120671712591268,0.6169068813323975,0.009323835372924805
8,0.6,train,0.3377777777777778,0.17330379146631855,0.27882550659746214,0.6146764755249023,0.03458428382873535
8,0.6,dev,0.25,0.12200876455225533,0.2116728482931023,0.6146764755249023,0.009510278701782227
8,0.6,test,0.31683168316831684,0.17174555309744904,0.28746685171990644,0.6146764755249023,0.009266853332519531
16,0.003,train,0.4666666666666667,0.22070033296337405,0.3938012331976816,0.6669981479644775,0.035692691802978516
16,0.003,dev,0.3684210526315789,0.15434782608695652,0.2917620137299771,0.6669981479644775,0.009807348251342773
16,0.003,test,0.37623762376237624,0.1696768463482954,0.31412323441813333,0.6669981479644775,0.009624719619750977
16,0.1,train,0.40444444444444444,0.21337522213401217,0.3455051062962848,0.7681694030761719,0.03429412841796875
16,0.1,dev,0.27631578947368424,0.12372294372294372,0.2161141490088859,0.7681694030761719,0.009554386138916016
16,0.1,test,0.3069306930693069,0.16353213129912159,0.27759391750548146,0.7681694030761719,0.00935220718383789
16,0.3,train,0.3022222222222222,0.19488244774595795,0.3025435763338378,0.8018221855163574,0.03442573547363281
16,0.3,dev,0.4605263157894737,0.3372749691095737,0.46285397080892443,0.8018221855163574,0.009524345397949219
16,0.3,test,0.3564356435643564,0.22124128392785108,0.3471902310383173,0.8018221855163574,0.009282112121582031
16,0.6,train,0.32,0.15197915685720564,0.24795555137018555,0.7898943424224854,0.0339202880859375
16,0.6,dev,0.42105263157894735,0.20988909207495193,0.33882164860699493,0.7898943424224854,0.00956273078918457
16,0.6,test,0.3564356435643564,0.1809569454429268,0.2982239273531954,0.7898943424224854,0.009178400039672852
32,0.003,train,0.4444444444444444,0.2328782328782329,0.3976675176675176,0.9572317600250244,0.03417372703552246
32,0.003,dev,0.3815789473684211,0.18139194139194142,0.33026797763639876,0.9572317600250244,0.009594917297363281
32,0.003,test,0.43564356435643564,0.22857513794222656,0.3966257579993637,0.9572317600250244,0.009413957595825195
32,0.1,train,0.4000000000000001,0.230288950851857,0.34968150632912237,0.8058834075927734,0.03415656089782715
32,0.1,dev,0.3157894736842105,0.15385712735110327,0.2738227855539206,0.8058834075927734,0.009617805480957031
32,0.1,test,0.26732673267326734,0.12970521541950114,0.2494780090253923,0.8058834075927734,0.009482622146606445
32,0.3,train,0.38666666666666666,0.15974591818015044,0.29246223934446286,1.0724163055419922,0.037435293197631836
32,0.3,dev,0.2894736842105263,0.10559006211180125,0.2087692056227525,1.0724163055419922,0.009925603866577148
32,0.3,test,0.37623762376237624,0.21555263703601296,0.3124958338095508,1.0724163055419922,0.009692192077636719
32,0.6,train,0.4000000000000001,0.1301156134246268,0.2538396877065639,0.636530876159668,0.03609633445739746
32,0.6,dev,0.34210526315789475,0.11909278350515462,0.2260444926749864,0.636530876159668,0.009930849075317383
32,0.6,test,0.40594059405940597,0.13319608852290274,0.2619201704009825,0.636530876159668,0.00965428352355957
64,0.003,train,0.4622222222222222,0.19022108843537414,0.35920068027210883,1.0803468227386475,0.03554201126098633
64,0.003,dev,0.42105263157894735,0.178494623655914,0.33333333333333337,1.0803468227386475,0.010011434555053711
64,0.003,test,0.42574257425742573,0.1565811965811966,0.3052551408987053,1.0803468227386475,0.009626388549804688
64,0.1,train,0.3111111111111111,0.17908816658268603,0.2516929842356344,0.6059179306030273,0.035562753677368164
64,0.1,dev,0.32894736842105265,0.18711915535444948,0.25497142176708737,0.6059179306030273,0.009971141815185547
64,0.1,test,0.31683168316831684,0.18289446825882832,0.2630441856188068,0.6059179306030273,0.009700536727905273
64,0.3,train,0.4888888888888889,0.24755053100376845,0.4004086635453542,1.0120816230773926,0.035186052322387695
64,0.3,dev,0.4078947368421052,0.2134954407294833,0.3166213405855063,1.0120816230773926,0.009889602661132812
64,0.3,test,0.40594059405940597,0.18711919191919194,0.3066514651465147,1.0120816230773926,0.00965738296508789
64,0.6,train,0.3511111111111111,0.1735840151038389,0.2316547793860569,0.7762224674224854,0.034906864166259766
64,0.6,dev,0.2631578947368421,0.11285714285714288,0.16466165413533837,0.7762224674224854,0.00983881950378418
64,0.6,test,0.2871287128712871,0.1375139146567718,0.1919212329396205,0.7762224674224854,0.009537220001220703
128,0.003,train,0.4488888888888889,0.2783941211253298,0.44068636590581267,1.3975121974945068,0.03467130661010742
128,0.003,dev,0.2894736842105263,0.1763025210084034,0.26420831490490937,1.3975121974945068,0.010063648223876953
128,0.003,test,0.2079207920792079,0.13230134158926726,0.20946367082528689,1.3975121974945068,0.00975942611694336
128,0.1,train,0.28444444444444444,0.19143658844932318,0.21369441446626855,0.5946588516235352,0.03551220893859863
128,0.1,dev,0.2894736842105263,0.18331002331002333,0.20586431112746906,0.5946588516235352,0.010124921798706055
128,0.1,test,0.19801980198019803,0.11925994449583718,0.12444106575319883,0.5946588516235352,0.009999990463256836
128,0.3,train,0.4711111111111111,0.2779112554112554,0.4143419913419913,0.8142118453979492,0.03499102592468262
128,0.3,dev,0.35526315789473684,0.19384094166702864,0.31066530723281294,0.8142118453979492,0.01008152961730957
128,0.3,test,0.3465346534653465,0.1837464662996578,0.31613282441173746,0.8142118453979492,0.009804248809814453
128,0.6,train,0.39555555555555555,0.2088681490295233,0.36109128016988506,0.5851955413818359,0.036835670471191406
128,0.6,dev,0.3026315789473684,0.1556390977443609,0.2760684606252473,0.5851955413818359,0.010210514068603516
128,0.6,test,0.38613861386138615,0.19523917137476463,0.3515340008577129,0.5851955413818359,0.009948015213012695
256,0.003,train,0.3111111111111111,0.12543898156277436,0.17934103989854647,0.8334765434265137,0.0376129150390625
256,0.003,dev,0.2894736842105263,0.10976663785652549,0.16420643224309692,0.8334765434265137,0.010811328887939453
256,0.003,test,0.2871287128712871,0.1143825665859564,0.16762160477548965,0.8334765434265137,0.010626077651977539
256,0.1,train,0.3333333333333333,0.23412650069058333,0.3175845482483582,0.9218020439147949,0.03570389747619629
256,0.1,dev,0.3157894736842105,0.23149341080375563,0.28815905812276044,0.9218020439147949,0.010797262191772461
256,0.1,test,0.2871287128712871,0.15287508261731658,0.22882215518313234,0.9218020439147949,0.010468721389770508
256,0.3,train,0.3377777777777778,0.229263391400796,0.25692896341242405,0.8892335891723633,0.03547167778015137
256,0.3,dev,0.3026315789473684,0.1939057841383423,0.21348821517120173,0.8892335891723633,0.010565519332885742
256,0.3,test,0.22772277227722773,0.14651067323481118,0.16167959160448064,0.8892335891723633,0.010334253311157227
256,0.6,train,0.4222222222222222,0.22812923932599388,0.38135712256604754,1.3790791034698486,0.04062390327453613
256,0.6,dev,0.42105263157894735,0.21938080495356038,0.38302509369398724,1.3790791034698486,0.011579513549804688
256,0.6,test,0.42574257425742573,0.24234303065922225,0.4023279789042672,1.3790791034698486,0.011365890502929688
512,0.003,train,0.4488888888888889,0.2686309342411381,0.40778885279803245,1.8280136585235596,0.04015803337097168
512,0.003,dev,0.3684210526315789,0.2104895104895105,0.3294074346705925,1.8280136585235596,0.012689590454101562
512,0.003,test,0.38613861386138615,0.19699801755876523,0.33327220572524546,1.8280136585235596,0.01256251335144043
512,0.1,train,0.4488888888888889,0.20722969338353953,0.3785179606718068,1.419318675994873,0.03977823257446289
512,0.1,dev,0.4342105263157895,0.20046750818139322,0.3672522821780961,1.419318675994873,0.012966156005859375
512,0.1,test,0.4158415841584158,0.18803827751196173,0.3518878203609835,1.419318675994873,0.012588977813720703
512,0.3,train,0.38222222222222224,0.22662563759044888,0.35084679454527273,1.1430983543395996,0.038697004318237305
512,0.3,dev,0.34210526315789475,0.19275712414019,0.30730989363352706,1.1430983543395996,0.012910127639770508
512,0.3,test,0.33663366336633666,0.19042854164805384,0.3074717549482099,1.1430983543395996,0.012443304061889648
512,0.6,train,0.27555555555555555,0.18367074885737728,0.2024003216271469,1.0846846103668213,0.03801083564758301
512,0.6,dev,0.27631578947368424,0.19435699435699436,0.19064292748503275,1.0846846103668213,0.012462139129638672
512,0.6,test,0.2079207920792079,0.13183289202706677,0.12902746585338146,1.0846846103668213,0.012140035629272461
