channels,drop,split,micro,macro,weight,train_time,inference_time
4,0.003,train,0.5240506329113924,0.3273712737127371,0.4367671777983602,1.004591941833496,0.05468463897705078
4,0.003,dev,0.5227272727272727,0.32624527962596656,0.4348506645305782,1.004591941833496,0.024714231491088867
4,0.003,test,0.5255681818181818,0.3268657464238295,0.4358270684397398,1.004591941833496,0.021805286407470703
4,0.1,train,0.7632911392405064,0.6007465599570863,0.754511682053321,2.386195421218872,0.05430960655212402
4,0.1,dev,0.7537878787878789,0.5934529114676174,0.7403209906552153,2.386195421218872,0.024557113647460938
4,0.1,test,0.7869318181818182,0.6342612463361795,0.776867434862194,2.386195421218872,0.022783279418945312
4,0.3,train,0.7949367088607595,0.6150160449172677,0.7728220963138359,2.049694061279297,0.04583024978637695
4,0.3,dev,0.7537878787878789,0.5858663469161118,0.7324602106002456,2.049694061279297,0.01973891258239746
4,0.3,test,0.7840909090909092,0.6061813875417519,0.7618654523743321,2.049694061279297,0.019344568252563477
4,0.6,train,0.6620253164556962,0.49676777343210654,0.628334459112212,1.0014209747314453,0.05404376983642578
4,0.6,dev,0.6628787878787878,0.49715213130818225,0.6281902810565231,1.0014209747314453,0.01976799964904785
4,0.6,test,0.7102272727272727,0.5367146452897696,0.677016456424687,1.0014209747314453,0.018980979919433594
8,0.003,train,0.8645569620253165,0.8011451798385079,0.8644994137936868,1.7578983306884766,0.04352855682373047
8,0.003,dev,0.8598484848484849,0.8179540745577238,0.8588178777724922,1.7578983306884766,0.018923521041870117
8,0.003,test,0.8948863636363636,0.8037126198066206,0.891145993267415,1.7578983306884766,0.01858663558959961
8,0.1,train,0.759493670886076,0.5855083221033242,0.7378431818678147,0.8392236232757568,0.04377341270446777
8,0.1,dev,0.7386363636363636,0.5714770133321571,0.7154144858262498,0.8392236232757568,0.019331932067871094
8,0.1,test,0.78125,0.602756712441074,0.7570063723937469,0.8392236232757568,0.019135236740112305
8,0.3,train,0.769620253164557,0.6009636809269161,0.746442975924547,2.048888921737671,0.04619574546813965
8,0.3,dev,0.7992424242424242,0.6262541806020068,0.7742221546569373,2.048888921737671,0.019986391067504883
8,0.3,test,0.8011363636363636,0.6240149412413971,0.7753660815338326,2.048888921737671,0.01939082145690918
8,0.6,train,0.7291139240506329,0.6111258363533999,0.7292687734455685,0.9537913799285889,0.04610276222229004
8,0.6,dev,0.7121212121212122,0.5789326959499861,0.7113124017962622,0.9537913799285889,0.019560813903808594
8,0.6,test,0.7556818181818182,0.616001808263608,0.7594181331939172,0.9537913799285889,0.018990039825439453
16,0.003,train,0.8531645569620253,0.7820316285022167,0.8563032119696304,1.887420892715454,0.04514169692993164
16,0.003,dev,0.8181818181818182,0.7494469482163606,0.8234045622448931,1.887420892715454,0.019855260848999023
16,0.003,test,0.8551136363636364,0.7849185852798283,0.8592181611761791,1.887420892715454,0.01948857307434082
16,0.1,train,0.8607594936708861,0.8007702917810045,0.8689718089191006,1.5150694847106934,0.04506659507751465
16,0.1,dev,0.8219696969696971,0.7639178637644894,0.828811574084859,1.5150694847106934,0.020343542098999023
16,0.1,test,0.8579545454545454,0.7811550484823993,0.8701763766092895,1.5150694847106934,0.01983165740966797
16,0.3,train,0.6025316455696202,0.5035558864848815,0.6247532637732316,0.8185329437255859,0.046184539794921875
16,0.3,dev,0.6098484848484849,0.5134044335369087,0.6223789919385624,0.8185329437255859,0.02016925811767578
16,0.3,test,0.6392045454545454,0.5460249220728263,0.6586455502248915,0.8185329437255859,0.01958775520324707
16,0.6,train,0.8189873417721519,0.6487177145292706,0.7995253946800036,1.5791144371032715,0.04645681381225586
16,0.6,dev,0.803030303030303,0.6456470693552723,0.7854933304181577,1.5791144371032715,0.020220279693603516
16,0.6,test,0.8579545454545454,0.6659622569667547,0.833598027825914,1.5791144371032715,0.019708633422851562
32,0.003,train,0.8683544303797468,0.8277115009184193,0.8701332922360605,1.9091331958770752,0.04502391815185547
32,0.003,dev,0.8409090909090909,0.7976707309226472,0.8416286962421614,1.9091331958770752,0.019975900650024414
32,0.003,test,0.8636363636363636,0.7816344536967483,0.8672850040881813,1.9091331958770752,0.01967453956604004
32,0.1,train,0.8670886075949367,0.8121232232730491,0.8726353070815648,1.8213691711425781,0.04617571830749512
32,0.1,dev,0.8598484848484849,0.8179728013238089,0.8622892130845471,1.8213691711425781,0.02052593231201172
32,0.1,test,0.8693181818181818,0.7918387700532763,0.8764689165376772,1.8213691711425781,0.01970362663269043
32,0.3,train,0.7164556962025317,0.586503514944352,0.7030979829367333,0.9113132953643799,0.04578042030334473
32,0.3,dev,0.6856060606060606,0.5362122030500325,0.6672543402846898,0.9113132953643799,0.02005934715270996
32,0.3,test,0.7556818181818182,0.6167012424160939,0.744553861704578,0.9113132953643799,0.019476890563964844
32,0.6,train,0.6556962025316456,0.5918735120611557,0.7016602562938071,0.8716869354248047,0.04550647735595703
32,0.6,dev,0.7310606060606061,0.6675504727830309,0.767569639662663,0.8716869354248047,0.020751953125
32,0.6,test,0.6761363636363636,0.6126387957854209,0.7196744246596319,0.8716869354248047,0.019877910614013672
64,0.003,train,0.8632911392405064,0.6682046541872273,0.8347001614104698,2.0823299884796143,0.04538321495056152
64,0.003,dev,0.8484848484848486,0.6585048745141954,0.8191255816181712,2.0823299884796143,0.020594120025634766
64,0.003,test,0.875,0.6781339494640946,0.8455616453239615,2.0823299884796143,0.02037644386291504
64,0.1,train,0.7253164556962026,0.6121213093345907,0.712411853543082,0.8372528553009033,0.04680013656616211
64,0.1,dev,0.7272727272727273,0.6211783784040277,0.7175758323472838,0.8372528553009033,0.02149200439453125
64,0.1,test,0.7130681818181818,0.5666026942165532,0.7024495857780874,0.8372528553009033,0.02088022232055664
64,0.3,train,0.6797468354430379,0.5122689800529397,0.6523313405709733,1.1164348125457764,0.04672646522521973
64,0.3,dev,0.6742424242424242,0.5162503031772981,0.6539626191578654,1.1164348125457764,0.021079063415527344
64,0.3,test,0.6988636363636364,0.5317460317460317,0.6742979242979243,1.1164348125457764,0.02064990997314453
64,0.6,train,0.859493670886076,0.797334507960334,0.8640398876886867,1.7460761070251465,0.04673910140991211
64,0.6,dev,0.8484848484848486,0.7956055900621118,0.8552710333145117,1.7460761070251465,0.02097797393798828
64,0.6,test,0.8579545454545454,0.7781943089826354,0.8659453757018629,1.7460761070251465,0.020773887634277344
128,0.003,train,0.8924050632911392,0.8515858260248707,0.8969615040755134,2.3936829566955566,0.046288251876831055
128,0.003,dev,0.8674242424242424,0.8341239826180241,0.8717612854577538,2.3936829566955566,0.021898269653320312
128,0.003,test,0.8835227272727273,0.8195243392128819,0.8910483148664459,2.3936829566955566,0.021278858184814453
128,0.1,train,0.8784810126582279,0.8265653685684577,0.8784131868036379,2.2917656898498535,0.047740936279296875
128,0.1,dev,0.8674242424242424,0.8507886756362366,0.8677161171063611,2.2917656898498535,0.021944046020507812
128,0.1,test,0.8977272727272727,0.8352617501816696,0.8982632517290564,2.2917656898498535,0.021754026412963867
128,0.3,train,0.7924050632911394,0.7178450299030984,0.8114091588032187,1.450037956237793,0.047003984451293945
128,0.3,dev,0.765151515151515,0.6976927327991158,0.7861953327137081,1.450037956237793,0.02171945571899414
128,0.3,test,0.78125,0.6920727518998625,0.8017288254559696,1.450037956237793,0.020906448364257812
128,0.6,train,0.8075949367088607,0.7160992540108105,0.8041027793812334,1.2624545097351074,0.04716897010803223
128,0.6,dev,0.7916666666666666,0.7051975452284888,0.7866727993431138,1.2624545097351074,0.022113323211669922
128,0.6,test,0.8238636363636364,0.7273029913518024,0.8239896608834344,1.2624545097351074,0.021107196807861328
256,0.003,train,0.9075949367088606,0.8780524909526386,0.9067904283504677,3.0911107063293457,0.0494847297668457
256,0.003,dev,0.8825757575757576,0.8746156136401386,0.8827680091388436,3.0911107063293457,0.024872541427612305
256,0.003,test,0.9176136363636364,0.8820542468089988,0.9172632004353111,3.0911107063293457,0.024305343627929688
256,0.1,train,0.8417721518987342,0.6844438734726505,0.820826376873185,3.1201040744781494,0.04798698425292969
256,0.1,dev,0.8181818181818182,0.6337881591119334,0.7904507610798084,3.1201040744781494,0.023358821868896484
256,0.1,test,0.8636363636363636,0.6892031223207908,0.84019906835006,3.1201040744781494,0.022823095321655273
256,0.3,train,0.8329113924050633,0.7371477482020443,0.8355921003698095,1.978788137435913,0.04834175109863281
256,0.3,dev,0.7992424242424242,0.7156041205352845,0.8090685034614947,1.978788137435913,0.02325153350830078
256,0.3,test,0.8494318181818182,0.7632953579288657,0.8551600285060542,1.978788137435913,0.02327132225036621
256,0.6,train,0.8126582278481013,0.7424439404464139,0.8230514378752392,1.4909541606903076,0.048467397689819336
256,0.6,dev,0.7727272727272727,0.7128030224307111,0.7902077347559288,1.4909541606903076,0.02350640296936035
256,0.6,test,0.8323863636363636,0.7503285662116,0.8449197172312662,1.4909541606903076,0.023287296295166016
512,0.003,train,0.9075949367088606,0.8834589669480749,0.9076062149650536,4.923237323760986,0.05338120460510254
512,0.003,dev,0.8787878787878788,0.8692074515532566,0.8793306212792869,4.923237323760986,0.028713226318359375
512,0.003,test,0.90625,0.8599133089128239,0.9078675498872844,4.923237323760986,0.028649330139160156
512,0.1,train,0.8050632911392405,0.7195049475728987,0.8215496228560778,2.822072744369507,0.055945396423339844
512,0.1,dev,0.803030303030303,0.7180320213979706,0.8177454100350383,2.822072744369507,0.02940678596496582
512,0.1,test,0.8238636363636364,0.7307107795003311,0.8406970805800719,2.822072744369507,0.029365062713623047
512,0.3,train,0.4860759493670886,0.35491511997039843,0.4426226028141092,1.1366350650787354,0.05551719665527344
512,0.3,dev,0.48863636363636365,0.3551772974249941,0.44370418572686465,1.1366350650787354,0.029893875122070312
512,0.3,test,0.4715909090909091,0.33972504693698974,0.422504346160589,1.1366350650787354,0.029569625854492188
512,0.6,train,0.7949367088607595,0.6137440720326146,0.7699425368989712,1.6102333068847656,0.05601143836975098
512,0.6,dev,0.7803030303030304,0.6022527910685807,0.7534562128461652,1.6102333068847656,0.03420281410217285
512,0.6,test,0.8295454545454547,0.6420119947283253,0.8022405139048764,1.6102333068847656,0.03379940986633301
