channels,drop,split,micro,macro,weight,train_time,inference_time
4,0.003,train,0.45925925925925926,0.45735366995209514,0.4573536699520951,0.5497198104858398,0.03577113151550293
4,0.003,dev,0.43333333333333335,0.4276094276094276,0.4276094276094276,0.5497198104858398,0.010335206985473633
4,0.003,test,0.48,0.4797919167667067,0.4797919167667067,0.5497198104858398,0.01010441780090332
4,0.1,train,0.5185185185185185,0.481658692185008,0.48165869218500795,0.6594810485839844,0.035228729248046875
4,0.1,dev,0.6333333333333333,0.6228571428571429,0.6228571428571429,0.6594810485839844,0.010322093963623047
4,0.1,test,0.55,0.5173745173745175,0.5173745173745173,0.6594810485839844,0.010047435760498047
4,0.3,train,0.5925925925925926,0.5881635143380111,0.588163514338011,0.9313840866088867,0.0350949764251709
4,0.3,dev,0.6666666666666666,0.6606334841628959,0.6606334841628959,0.9313840866088867,0.010303735733032227
4,0.3,test,0.565,0.5580952380952381,0.5580952380952381,0.9313840866088867,0.009962320327758789
4,0.6,train,0.48518518518518516,0.36616507067943455,0.36616507067943455,0.5090017318725586,0.035147666931152344
4,0.6,dev,0.43333333333333335,0.3023255813953488,0.3023255813953488,0.5090017318725586,0.010271072387695312
4,0.6,test,0.495,0.36315772880607833,0.3631577288060784,0.5090017318725586,0.010101318359375
8,0.003,train,0.6222222222222222,0.616135147190009,0.6161351471900088,0.8469314575195312,0.03520703315734863
8,0.003,dev,0.7,0.6914285714285715,0.6914285714285714,0.8469314575195312,0.01043081283569336
8,0.003,test,0.56,0.5546107905658468,0.5546107905658468,0.8469314575195312,0.010140657424926758
8,0.1,train,0.5925925925925926,0.592032967032967,0.5920329670329669,0.6708786487579346,0.034894466400146484
8,0.1,dev,0.7,0.6969696969696968,0.6969696969696969,0.6708786487579346,0.010396957397460938
8,0.1,test,0.545,0.5440767554297452,0.5440767554297452,0.6708786487579346,0.010089635848999023
8,0.3,train,0.4962962962962963,0.37230769230769234,0.37230769230769234,0.5435957908630371,0.03537106513977051
8,0.3,dev,0.5666666666666667,0.466484268125855,0.46648426812585503,0.5435957908630371,0.010236740112304688
8,0.3,test,0.5,0.37996031746031744,0.37996031746031744,0.5435957908630371,0.010070562362670898
8,0.6,train,0.5925925925925926,0.5852187028657616,0.5852187028657616,0.601254940032959,0.03464365005493164
8,0.6,dev,0.5333333333333333,0.5333333333333333,0.5333333333333333,0.601254940032959,0.010415077209472656
8,0.6,test,0.53,0.5104166666666667,0.5104166666666667,0.601254940032959,0.010018587112426758
16,0.003,train,0.5296296296296297,0.4458181818181819,0.4458181818181819,0.5786256790161133,0.03497052192687988
16,0.003,dev,0.5666666666666667,0.466484268125855,0.46648426812585503,0.5786256790161133,0.010313987731933594
16,0.003,test,0.53,0.4293346284604177,0.42933462846041764,0.5786256790161133,0.010125875473022461
16,0.1,train,0.6037037037037037,0.6036547721940981,0.6036547721940981,1.201885461807251,0.03727126121520996
16,0.1,dev,0.6,0.6,0.6,1.201885461807251,0.011261701583862305
16,0.1,test,0.52,0.5192307692307692,0.5192307692307692,1.201885461807251,0.010846376419067383
16,0.3,train,0.5,0.3333333333333333,0.3333333333333333,0.6966233253479004,0.03770804405212402
16,0.3,dev,0.5,0.3333333333333333,0.3333333333333333,0.6966233253479004,0.011123895645141602
16,0.3,test,0.5,0.3333333333333333,0.33333333333333326,0.6966233253479004,0.01060938835144043
16,0.6,train,0.5407407407407407,0.4773976023976024,0.47739760239760237,0.6493215560913086,0.03665423393249512
16,0.6,dev,0.6333333333333333,0.576379974326059,0.576379974326059,0.6493215560913086,0.011069059371948242
16,0.6,test,0.52,0.42857142857142855,0.42857142857142855,0.6493215560913086,0.010635137557983398
32,0.003,train,0.5333333333333333,0.4520327298498808,0.4520327298498808,0.707099437713623,0.036318302154541016
32,0.003,dev,0.5666666666666667,0.466484268125855,0.46648426812585503,0.707099437713623,0.011202335357666016
32,0.003,test,0.505,0.39588100686498856,0.3958810068649886,0.707099437713623,0.010858535766601562
32,0.1,train,0.6,0.5833333333333333,0.5833333333333334,0.7075092792510986,0.03615283966064453
32,0.1,dev,0.6666666666666666,0.6411483253588517,0.6411483253588517,0.7075092792510986,0.010904788970947266
32,0.1,test,0.56,0.537620849096259,0.537620849096259,0.7075092792510986,0.010375261306762695
32,0.3,train,0.5407407407407407,0.4642857142857143,0.46428571428571436,0.6445598602294922,0.03618502616882324
32,0.3,dev,0.6,0.5238095238095238,0.5238095238095238,0.6445598602294922,0.010563373565673828
32,0.3,test,0.51,0.4050509956289461,0.40505099562894614,0.6445598602294922,0.010403633117675781
32,0.6,train,0.6185185185185185,0.6044040455767508,0.6044040455767508,0.7379474639892578,0.03567838668823242
32,0.6,dev,0.6666666666666666,0.6527777777777778,0.6527777777777779,0.7379474639892578,0.01076364517211914
32,0.6,test,0.54,0.5166036149642708,0.5166036149642708,0.7379474639892578,0.010889768600463867
64,0.003,train,0.6037037037037037,0.603698267465946,0.603698267465946,0.819242000579834,0.03609323501586914
64,0.003,dev,0.7333333333333333,0.7321428571428572,0.7321428571428572,0.819242000579834,0.010959863662719727
64,0.003,test,0.555,0.554899852466805,0.554899852466805,0.819242000579834,0.010630607604980469
64,0.1,train,0.6296296296296297,0.6283244314740378,0.6283244314740378,0.6955890655517578,0.03606534004211426
64,0.1,dev,0.6666666666666666,0.6527777777777778,0.6527777777777779,0.6955890655517578,0.010946273803710938
64,0.1,test,0.58,0.5738636363636364,0.5738636363636364,0.6955890655517578,0.010556936264038086
64,0.3,train,0.4888888888888889,0.35227035672067314,0.35227035672067314,0.6557440757751465,0.035692453384399414
64,0.3,dev,0.5,0.3333333333333333,0.3333333333333333,0.6557440757751465,0.010869741439819336
64,0.3,test,0.495,0.33967506783040763,0.33967506783040763,0.6557440757751465,0.010632991790771484
64,0.6,train,0.5333333333333333,0.4520327298498808,0.4520327298498808,0.5555174350738525,0.034928321838378906
64,0.6,dev,0.5666666666666667,0.466484268125855,0.46648426812585503,0.5555174350738525,0.010574579238891602
64,0.6,test,0.515,0.4080854309687261,0.4080854309687262,0.5555174350738525,0.010494232177734375
128,0.003,train,0.5888888888888889,0.5564665315001998,0.5564665315001998,0.8098235130310059,0.03560066223144531
128,0.003,dev,0.6333333333333333,0.5970695970695972,0.5970695970695971,0.8098235130310059,0.01102304458618164
128,0.003,test,0.58,0.5414346544382574,0.5414346544382574,0.8098235130310059,0.010758399963378906
128,0.1,train,0.6333333333333333,0.6290539696637478,0.6290539696637478,1.0382444858551025,0.04001736640930176
128,0.1,dev,0.6,0.5982142857142858,0.5982142857142858,1.0382444858551025,0.011790990829467773
128,0.1,test,0.545,0.5408562274527612,0.5408562274527611,1.0382444858551025,0.0117034912109375
128,0.3,train,0.562962962962963,0.5161290322580645,0.5161290322580645,0.713961124420166,0.03844261169433594
128,0.3,dev,0.5666666666666667,0.466484268125855,0.46648426812585503,0.713961124420166,0.012015342712402344
128,0.3,test,0.495,0.42677147478645816,0.42677147478645816,0.713961124420166,0.01157999038696289
128,0.6,train,0.5259259259259259,0.48742287612719504,0.4874228761271951,0.8997621536254883,0.0367581844329834
128,0.6,dev,0.5666666666666667,0.5238095238095238,0.5238095238095238,0.8997621536254883,0.011438131332397461
128,0.6,test,0.5,0.46374946374946374,0.46374946374946374,0.8997621536254883,0.011198759078979492
256,0.003,train,0.6074074074074074,0.5808190286484269,0.580819028648427,1.6911118030548096,0.03783130645751953
256,0.003,dev,0.6666666666666666,0.6527777777777778,0.6527777777777779,1.6911118030548096,0.011979818344116211
256,0.003,test,0.57,0.5538956323270049,0.553895632327005,1.6911118030548096,0.011586666107177734
256,0.1,train,0.6148148148148148,0.6070309001343484,0.6070309001343485,0.7006611824035645,0.03773188591003418
256,0.1,dev,0.6666666666666666,0.6527777777777778,0.6527777777777779,0.7006611824035645,0.011884689331054688
256,0.1,test,0.58,0.5689655172413792,0.5689655172413793,0.7006611824035645,0.012130260467529297
256,0.3,train,0.6185185185185185,0.6161967457458701,0.6161967457458702,0.8661983013153076,0.03734421730041504
256,0.3,dev,0.5666666666666667,0.5661846496106784,0.5661846496106785,0.8661983013153076,0.012149333953857422
256,0.3,test,0.525,0.524036173250833,0.524036173250833,0.8661983013153076,0.011580228805541992
256,0.6,train,0.6148148148148148,0.6140524492825334,0.6140524492825334,1.3756909370422363,0.03790402412414551
256,0.6,dev,0.6666666666666666,0.6651785714285714,0.6651785714285715,1.3756909370422363,0.011870145797729492
256,0.6,test,0.555,0.5536497906166152,0.5536497906166152,1.3756909370422363,0.011669397354125977
512,0.003,train,0.5333333333333333,0.45914149443561214,0.4591414944356121,0.8695814609527588,0.039318084716796875
512,0.003,dev,0.5666666666666667,0.4993581514762516,0.49935815147625157,0.8695814609527588,0.014089584350585938
512,0.003,test,0.555,0.4775615626192363,0.47756156261923627,0.8695814609527588,0.01390528678894043
512,0.1,train,0.5185185185185185,0.4140625,0.4140625,0.9861505031585693,0.039479970932006836
512,0.1,dev,0.5666666666666667,0.466484268125855,0.46648426812585503,0.9861505031585693,0.014099836349487305
512,0.1,test,0.515,0.4018069131386636,0.4018069131386637,0.9861505031585693,0.013942718505859375
512,0.3,train,0.6444444444444445,0.6431914542150763,0.6431914542150763,1.1522281169891357,0.038974761962890625
512,0.3,dev,0.6,0.5927601809954751,0.5927601809954751,1.1522281169891357,0.013861894607543945
512,0.3,test,0.57,0.5656565656565656,0.5656565656565656,1.1522281169891357,0.013756275177001953
512,0.6,train,0.6074074074074074,0.5716594827586207,0.5716594827586206,1.4814250469207764,0.039118051528930664
512,0.6,dev,0.6666666666666666,0.6411483253588517,0.6411483253588517,1.4814250469207764,0.013939380645751953
512,0.6,test,0.57,0.5242836596968691,0.5242836596968691,1.4814250469207764,0.013604164123535156
