split,accracy,macro,micro,weighted,time
train,{'accuracy': 1.0},{'f1': 1.0},{'f1': 1.0},{'f1': 1.0},1971.2742342948914
dev,{'accuracy': 0.9752336448598131},{'f1': 0.9751593931638177},{'f1': 0.9752336448598131},{'f1': 0.975222856151848},1971.2742342948914
test,{'accuracy': 0.9850467289719627},{'f1': 0.9850085465295486},{'f1': 0.9850467289719627},{'f1': 0.9850439006428948},1971.2742342948914
