split,accracy,macro,micro,weighted,time
train,{'accuracy': 1.0},{'f1': 1.0},{'f1': 1.0},{'f1': 1.0},260.0481650829315
dev,{'accuracy': 0.9734848484848485},{'f1': 0.9790125461957099},{'f1': 0.9734848484848485},{'f1': 0.9734974259614744},260.0481650829315
test,{'accuracy': 0.9886363636363636},{'f1': 0.9913147648996705},{'f1': 0.9886363636363636},{'f1': 0.9886533801628142},260.0481650829315
