split,accracy,macro,micro,weighted,time
train,{'accuracy': 0.9784615384615385},{'f1': 0.9711696653092805},{'f1': 0.9784615384615385},{'f1': 0.9784318590302377},35.12586712837219
dev,{'accuracy': 0.6359447004608295},{'f1': 0.5651521725655488},{'f1': 0.6359447004608295},{'f1': 0.635022870088244},35.12586712837219
test,{'accuracy': 0.6678200692041523},{'f1': 0.571973119927953},{'f1': 0.6678200692041523},{'f1': 0.6607562374427772},35.12586712837219
