split,accracy,macro,micro,weighted,time
train,{'accuracy': 0.9925925925925926},{'f1': 0.9925921861281826},{'f1': 0.9925925925925926},{'f1': 0.9925921861281826},101.18267011642456
dev,{'accuracy': 0.7},{'f1': 0.6914285714285715},{'f1': 0.7},{'f1': 0.6914285714285714},101.18267011642456
test,{'accuracy': 0.655},{'f1': 0.6545768566493955},{'f1': 0.655},{'f1': 0.6545768566493955},101.18267011642456
