channels,drop,split,micro,macro,weight,train_time,inference_time
4,0.003,train,0.8135514018691588,0.8133720884908999,0.8131017668151327,8.482618808746338,0.18948793411254883
4,0.003,dev,0.8018691588785046,0.801548662308156,0.801175991877518,8.482618808746338,0.15549516677856445
4,0.003,test,0.7878504672897196,0.7875825567402681,0.7872300428594108,8.482618808746338,0.15572857856750488
4,0.1,train,0.6942367601246106,0.6862388438913478,0.6838979903596611,3.1362040042877197,0.1883392333984375
4,0.1,dev,0.6878504672897197,0.6801522181172495,0.6778334683665054,3.1362040042877197,0.16023969650268555
4,0.1,test,0.6677570093457944,0.6585718648621903,0.6559550145819613,3.1362040042877197,0.15761065483093262
4,0.3,train,0.6409657320872274,0.6169664345228372,0.6124861673981843,1.9937970638275146,0.15717244148254395
4,0.3,dev,0.6345794392523364,0.609135524037927,0.6044754663063503,1.9937970638275146,0.1339709758758545
4,0.3,test,0.6257009345794392,0.598080039316473,0.5931565285744113,1.9937970638275146,0.1340165138244629
4,0.6,train,0.6504672897196262,0.6491187733565954,0.6481023037362204,2.812464952468872,0.18710589408874512
4,0.6,dev,0.655607476635514,0.6543902656552436,0.653431831812511,2.812464952468872,0.15800714492797852
4,0.6,test,0.6401869158878505,0.6376231527093595,0.6361988398324201,2.812464952468872,0.14900946617126465
8,0.003,train,0.764330218068536,0.7636317122841374,0.7642321470558266,7.7327282428741455,3.058004856109619
8,0.003,dev,0.7574766355140187,0.7569352118298271,0.7574712748834822,7.7327282428741455,0.16315269470214844
8,0.003,test,0.7401869158878505,0.7395953248667818,0.740175316063908,7.7327282428741455,0.15018463134765625
8,0.1,train,0.7481308411214952,0.7475074510565445,0.7469211908073745,9.330333709716797,0.1869966983795166
8,0.1,dev,0.7485981308411215,0.7481121318011607,0.7475951115458831,9.330333709716797,0.1582014560699463
8,0.1,test,0.7401869158878505,0.73966301299847,0.7391172808220322,9.330333709716797,0.16261649131774902
8,0.3,train,0.7492211838006231,0.7477030831277847,0.7486176016053981,5.435124397277832,0.19545722007751465
8,0.3,dev,0.7532710280373831,0.7509633771228018,0.7520835960133754,5.435124397277832,0.15778255462646484
8,0.3,test,0.7373831775700934,0.735869543255568,0.7368038854250281,5.435124397277832,0.16264653205871582
8,0.6,train,0.5311526479750779,0.5004334839910805,0.49464469680816636,2.5492942333221436,0.6278071403503418
8,0.6,dev,0.5299065420560748,0.5015997221900683,0.49604936535359645,2.5492942333221436,0.1594560146331787
8,0.6,test,0.5336448598130841,0.502181272662346,0.49633302226258064,2.5492942333221436,0.13533377647399902
16,0.003,train,0.8093457943925234,0.8092088497445395,0.8094477066886971,6.494410753250122,0.20070338249206543
16,0.003,dev,0.7990654205607477,0.7989373965954389,0.7991744780126774,6.494410753250122,0.16341042518615723
16,0.003,test,0.794392523364486,0.7943206640454347,0.7945003123430628,6.494410753250122,0.13438844680786133
16,0.1,train,0.7216510903426792,0.7200134061189372,0.7190127843936364,3.4559786319732666,0.1896073818206787
16,0.1,dev,0.7228971962616823,0.7211581794838499,0.720129175473298,3.4559786319732666,0.13460850715637207
16,0.1,test,0.7051401869158879,0.7027724785549312,0.7015328406696135,3.4559786319732666,0.13554859161376953
16,0.3,train,0.7858255451713394,0.7858168097664331,0.7858807273633089,5.215540409088135,0.16718363761901855
16,0.3,dev,0.7827102803738317,0.7826965672346778,0.7827772327591126,5.215540409088135,0.13627052307128906
16,0.3,test,0.764018691588785,0.7640000882242661,0.7640980006691027,5.215540409088135,0.156890869140625
16,0.6,train,0.8197819314641744,0.8197730767481006,0.8198321081885929,7.332770824432373,3.4919512271881104
16,0.6,dev,0.8037383177570093,0.8037355749578123,0.8037012899678496,7.332770824432373,0.14345097541809082
16,0.6,test,0.7929906542056075,0.7929707179855516,0.7930656523667705,7.332770824432373,0.1391458511352539
32,0.003,train,0.8129283489096574,0.8129214451897335,0.8128683396518583,6.66711163520813,0.16585397720336914
32,0.003,dev,0.7953271028037383,0.7952625467546321,0.7950926624148792,6.66711163520813,0.13594388961791992
32,0.003,test,0.7892523364485982,0.7892022100634901,0.789050311926799,6.66711163520813,0.13976669311523438
32,0.1,train,0.764797507788162,0.7647942207827751,0.7647531332154388,3.6993894577026367,0.16065478324890137
32,0.1,dev,0.7495327102803738,0.7495248343908097,0.7494592019777756,3.6993894577026367,0.13430166244506836
32,0.1,test,0.7425233644859813,0.7424621236030666,0.7422765451699916,3.6993894577026367,0.13295507431030273
32,0.3,train,0.7501557632398754,0.7482125420164121,0.7492461703267649,3.325010061264038,0.16567492485046387
32,0.3,dev,0.747196261682243,0.7451662613283958,0.7462290887387871,3.325010061264038,0.1444566249847412
32,0.3,test,0.7299065420560746,0.7281504065040652,0.7291714155459312,3.325010061264038,0.1394510269165039
32,0.6,train,0.7989096573208723,0.7977649866551126,0.7970540110863177,8.901510000228882,0.16959810256958008
32,0.6,dev,0.7957943925233644,0.7943878014304776,0.7935931171972082,8.901510000228882,0.13379216194152832
32,0.6,test,0.7859813084112149,0.7847169506297795,0.7839460007630508,8.901510000228882,0.13228797912597656
64,0.003,train,0.8255451713395638,0.8254198625113434,0.8256384244210302,10.194440126419067,0.17788004875183105
64,0.003,dev,0.8107476635514018,0.8107175327717246,0.8108291282520104,10.194440126419067,0.14873170852661133
64,0.003,test,0.8154205607476636,0.8153389076093783,0.81552035902779,10.194440126419067,0.15162158012390137
64,0.1,train,0.8151090342679128,0.8150198078628925,0.8152096512778292,6.1106343269348145,0.1773209571838379
64,0.1,dev,0.797196261682243,0.7971785464709993,0.7972671225272178,6.1106343269348145,0.14616847038269043
64,0.1,test,0.7901869158878505,0.7901791729147136,0.7902387342465353,6.1106343269348145,0.14032435417175293
64,0.3,train,0.7912772585669782,0.7910450864408013,0.7913705613840398,5.215690851211548,0.16558337211608887
64,0.3,dev,0.7794392523364486,0.7791458475273727,0.7795220075390084,5.215690851211548,0.1490631103515625
64,0.3,test,0.7747663551401869,0.77455191460827,0.7748768245051137,5.215690851211548,0.1522057056427002
64,0.6,train,0.776791277258567,0.773225819372849,0.7718970773036373,10.34640121459961,0.16681241989135742
64,0.6,dev,0.7747663551401869,0.7712855972100514,0.7699671282971213,10.34640121459961,0.1401839256286621
64,0.6,test,0.7556074766355141,0.751443023795263,0.749939611217555,10.34640121459961,0.14114594459533691
128,0.003,train,0.8303738317757008,0.8299326206362518,0.8303374014981315,12.649231910705566,0.17583537101745605
128,0.003,dev,0.8186915887850468,0.818341091336153,0.8187139609626356,12.649231910705566,0.14753437042236328
128,0.003,test,0.8088785046728972,0.8083813824799644,0.8088374578863248,12.649231910705566,0.14891290664672852
128,0.1,train,0.7965732087227414,0.7952710946574149,0.7960340521175672,7.73896050453186,0.171952486038208
128,0.1,dev,0.7803738317757009,0.779170058814799,0.779931940435623,7.73896050453186,0.1468057632446289
128,0.1,test,0.775233644859813,0.7741387137707276,0.7748735668506508,7.73896050453186,0.14567184448242188
128,0.3,train,0.7633956386292834,0.7610282022831802,0.7621396747461395,5.321841478347778,0.17120003700256348
128,0.3,dev,0.766822429906542,0.7643545745810731,0.7654814491589128,5.321841478347778,0.14726018905639648
128,0.3,test,0.7570093457943925,0.7546918923113279,0.7558060526397243,5.321841478347778,0.14599013328552246
128,0.6,train,0.7489096573208722,0.7488905513525936,0.7487881979511011,5.337057590484619,0.17584586143493652
128,0.6,dev,0.7373831775700934,0.7373719374835677,0.7372916511512411,5.337057590484619,0.1506822109222412
128,0.6,test,0.7233644859813083,0.7231749228225111,0.7228364171818014,5.337057590484619,0.15082550048828125
256,0.003,train,0.7602803738317758,0.7538837481714801,0.7520296537771916,21.351882934570312,0.23243236541748047
256,0.003,dev,0.7439252336448599,0.7356783711195398,0.7334966614567567,21.351882934570312,0.18674302101135254
256,0.003,test,0.7462616822429906,0.7385729433052766,0.736477919071567,21.351882934570312,0.2039024829864502
256,0.1,train,0.6154205607476636,0.576201832668038,0.5701774504745472,4.699691534042358,0.1991262435913086
256,0.1,dev,0.6149532710280374,0.573660241525477,0.567460086945513,4.699691534042358,0.17318296432495117
256,0.1,test,0.602803738317757,0.5587761580973671,0.5522632024434634,4.699691534042358,0.18189620971679688
256,0.3,train,0.8169781931464174,0.8164419492889221,0.8169055606930967,20.88595223426819,0.23578143119812012
256,0.3,dev,0.8074766355140187,0.8070031197163798,0.8074498327330203,20.88595223426819,0.202864408493042
256,0.3,test,0.7948598130841121,0.7943834864196494,0.7948459394919434,20.88595223426819,0.1823139190673828
256,0.6,train,0.7556074766355141,0.7549481868745045,0.7543542321348562,3.9901323318481445,0.22575998306274414
256,0.6,dev,0.7490654205607477,0.7482870760073675,0.7476330049541069,3.9901323318481445,0.1748490333557129
256,0.6,test,0.7327102803738318,0.7315281977858665,0.7306957452591303,3.9901323318481445,0.18086791038513184
512,0.003,train,0.835202492211838,0.8351947510466229,0.8352475317185445,38.34589338302612,0.2535276412963867
512,0.003,dev,0.8149532710280374,0.8149474522738072,0.8148989626552223,38.34589338302612,0.22897124290466309
512,0.003,test,0.814018691588785,0.814016092460022,0.8140485815695583,38.34589338302612,0.2279052734375
512,0.1,train,0.8057632398753894,0.8048423819470758,0.8042159479822365,38.73245072364807,0.2657036781311035
512,0.1,dev,0.7901869158878505,0.7889625614233682,0.788211423715097,38.73245072364807,0.2452404499053955
512,0.1,test,0.7873831775700935,0.7861116450204564,0.7853410192327975,38.73245072364807,0.24475407600402832
512,0.3,train,0.7161993769470405,0.7063113960289356,0.7088295575530709,10.386545896530151,0.2705104351043701
512,0.3,dev,0.7158878504672896,0.7051711073486064,0.707797760073774,10.386545896530151,0.22638559341430664
512,0.3,test,0.7172897196261683,0.7097459408260146,0.7119325433767838,10.386545896530151,0.2435290813446045
512,0.6,train,0.6509345794392524,0.5942827539474906,0.6013671839798077,38.338356494903564,0.2515442371368408
512,0.6,dev,0.641588785046729,0.5814812236685528,0.588892760213334,38.338356494903564,0.24869036674499512
512,0.6,test,0.6565420560747663,0.6059189574553323,0.6125191006912428,38.338356494903564,0.23968791961669922
