channels,drop,split,micro,macro,weight,train_time,inference_time
4,0.003,train,0.66107157244528,0.44463153480755346,0.5608825079160507,10.936389684677124,0.24884462356567383
4,0.003,dev,0.6608940797422472,0.4484562898616792,0.5632912535025054,10.936389684677124,0.20020580291748047
4,0.003,test,0.6670694864048339,0.45049544924266527,0.5661822544640355,10.936389684677124,0.17654776573181152
4,0.1,train,0.6636229354102323,0.43647795987321714,0.5564401011413912,8.511004447937012,0.2844860553741455
4,0.1,dev,0.657672170761176,0.43012446510462454,0.5509321380248969,8.511004447937012,0.2125837802886963
4,0.1,test,0.6643504531722054,0.434225379047503,0.5552290892693977,8.511004447937012,0.19441771507263184
4,0.3,train,0.503558479924802,0.49418051162700716,0.5172739897725629,2.6422669887542725,0.27839088439941406
4,0.3,dev,0.5126862666129682,0.5034302045759861,0.5261744514102223,2.6422669887542725,0.17892837524414062
4,0.3,test,0.5117824773413897,0.503870377955467,0.5248809768032524,2.6422669887542725,0.17692947387695312
4,0.6,train,0.5936618772660132,0.5593160909056492,0.6005673792855574,11.071119785308838,0.28233981132507324
4,0.6,dev,0.6041079339508659,0.5688557651051749,0.6102149998213166,11.071119785308838,0.20574235916137695
4,0.6,test,0.5924471299093655,0.5574348329459442,0.5991788175102811,11.071119785308838,0.20586919784545898
8,0.003,train,0.6207868940512958,0.5529457841170385,0.6113391834641051,12.656643390655518,0.6283988952636719
8,0.003,dev,0.6427708417237213,0.5755715055177684,0.6322284357399939,12.656643390655518,0.16587495803833008
8,0.003,test,0.6277945619335348,0.5623469311096085,0.6191022984647321,12.656643390655518,0.1978626251220703
8,0.1,train,0.6250839264133208,0.4621269738975633,0.5613959444835224,11.12898564338684,0.2323763370513916
8,0.1,dev,0.6238421264599275,0.46229093283326006,0.5611683349574438,11.12898564338684,0.202606201171875
8,0.1,test,0.6244712990936556,0.4709625587516849,0.5665288525147738,11.12898564338684,0.178849458694458
8,0.3,train,0.5528400698267759,0.4988153141493099,0.5539890625855605,4.909693956375122,0.23974180221557617
8,0.3,dev,0.5529601288763593,0.5016111882649075,0.5552795289541663,4.909693956375122,0.19558477401733398
8,0.3,test,0.565558912386707,0.5150739505654133,0.5675442760538365,4.909693956375122,0.19098114967346191
8,0.6,train,0.6669799919430643,0.40921872344955645,0.5400644009100747,10.856772422790527,0.22517037391662598
8,0.6,dev,0.666532420459122,0.40792556635049804,0.5391988810808355,10.856772422790527,0.18600678443908691
8,0.6,test,0.6682779456193354,0.41333428894639784,0.5430260666306145,10.856772422790527,0.16037583351135254
16,0.003,train,0.6253524909359474,0.5552265318547176,0.6144434814069093,9.904385089874268,0.19182395935058594
16,0.003,dev,0.643979057591623,0.5778088093864204,0.6338818681401679,9.904385089874268,0.16533565521240234
16,0.003,test,0.6293051359516616,0.5613261669999355,0.6192361098521351,9.904385089874268,0.1645045280456543
16,0.1,train,0.6511346851080972,0.6087533595273876,0.6519300914633451,5.94381856918335,0.18872380256652832
16,0.1,dev,0.6298832057994361,0.5853163169379065,0.6309234648760566,5.94381856918335,0.16988182067871094
16,0.1,test,0.6555891238670695,0.614723929387087,0.65680219086462,5.94381856918335,0.16299748420715332
16,0.3,train,0.6162212971666443,0.5598538112992286,0.612667924699205,10.388271570205688,0.18923616409301758
16,0.3,dev,0.603705195328232,0.5498270997868596,0.6020744264294244,10.388271570205688,0.16454267501831055
16,0.3,test,0.60392749244713,0.5492314025660532,0.6018876556172199,10.388271570205688,0.16312909126281738
16,0.6,train,0.501678528266416,0.4911740595592109,0.5156877589628476,6.484217643737793,0.2038435935974121
16,0.6,dev,0.5122835279903343,0.49861293349267466,0.5263875803623099,6.484217643737793,0.17981600761413574
16,0.6,test,0.5151057401812689,0.5036433867562183,0.5289380434198486,6.484217643737793,0.17846059799194336
32,0.003,train,0.6673828387270042,0.4188503234107126,0.5462806500523513,12.530258893966675,0.2161567211151123
32,0.003,dev,0.6705598066854611,0.42161230282761825,0.5489132670471291,12.530258893966675,0.18165922164916992
32,0.003,test,0.6685800604229607,0.4239552270653012,0.5498400509072122,12.530258893966675,0.1799015998840332
32,0.1,train,0.6092386195783537,0.5195880087043037,0.5891738263457407,7.206684827804565,0.20666742324829102
32,0.1,dev,0.6028997180829642,0.5074602063315791,0.5801968150131014,7.206684827804565,0.18485617637634277
32,0.1,test,0.6114803625377644,0.518585421552448,0.5895024672840169,7.206684827804565,0.18287992477416992
32,0.3,train,0.4852960923861958,0.4851796451870146,0.48777579390447334,2.8250858783721924,0.20978808403015137
32,0.3,dev,0.468385018123238,0.46835388831791713,0.4669890921162156,2.8250858783721924,0.1852891445159912
32,0.3,test,0.48126888217522656,0.48111500832066467,0.4841114991726605,2.8250858783721924,0.182999849319458
32,0.6,train,0.6054787162615819,0.5420766972053712,0.5992094440777488,6.243274688720703,0.21619534492492676
32,0.6,dev,0.5940394683850181,0.5308919647154611,0.5886327666438266,6.243274688720703,0.18161535263061523
32,0.6,test,0.5990936555891239,0.5366637218317751,0.5936984761286123,6.243274688720703,0.19022583961486816
64,0.003,train,0.609372901839667,0.5583130882075146,0.6086670987286381,13.515015840530396,0.21250438690185547
64,0.003,dev,0.5904148207813129,0.5397253127920336,0.5909684683200308,13.515015840530396,0.19266939163208008
64,0.003,test,0.6126888217522659,0.5628123784279205,0.6123319241256158,13.515015840530396,0.19083476066589355
64,0.1,train,0.6091043373170404,0.5723201329515122,0.6143760662393896,7.570478916168213,0.21351027488708496
64,0.1,dev,0.6041079339508659,0.5657457462622172,0.609046155943307,7.570478916168213,0.1880040168762207
64,0.1,test,0.6154078549848943,0.5793579384293259,0.6206535084775002,7.570478916168213,0.18703031539916992
64,0.3,train,0.5943332885725796,0.546081608873622,0.5957045265870888,9.847009420394897,0.21689558029174805
64,0.3,dev,0.5928312525171164,0.5467133138618911,0.5952186710586116,9.847009420394897,0.18725132942199707
64,0.3,test,0.595166163141994,0.5512002464078009,0.5983065857658649,9.847009420394897,0.18873310089111328
64,0.6,train,0.6448234188263731,0.4866193060112068,0.5821770393686015,4.800860404968262,1.3980865478515625
64,0.6,dev,0.6447845348368909,0.493504384991119,0.5863683236952664,4.800860404968262,0.18306589126586914
64,0.6,test,0.6486404833836859,0.4951750546687256,0.5885156715857699,4.800860404968262,0.17809700965881348
128,0.003,train,0.6488518866657714,0.5673617815344069,0.6303199475347216,12.636301517486572,0.26299571990966797
128,0.003,dev,0.6496173983084977,0.5717105012720548,0.6329913749560558,12.636301517486572,0.20716357231140137
128,0.003,test,0.6510574018126888,0.576996805111821,0.6363522291825525,12.636301517486572,0.1914827823638916
128,0.1,train,0.641466362293541,0.5183564575318251,0.600004646692517,7.23012638092041,0.2264881134033203
128,0.1,dev,0.6411598872331856,0.5172407246780026,0.5992953052888671,7.23012638092041,0.19127869606018066
128,0.1,test,0.6447129909365559,0.519837528106187,0.6019535018868205,7.23012638092041,0.19270563125610352
128,0.3,train,0.6354236605344434,0.5309954417823235,0.6052006956878565,6.188269138336182,0.22197723388671875
128,0.3,dev,0.6298832057994361,0.5260943563351952,0.6004972062523317,6.188269138336182,0.19951462745666504
128,0.3,test,0.6386706948640484,0.5309917277042293,0.6063534260317193,6.188269138336182,0.2245030403137207
128,0.6,train,0.6574459513898214,0.4693114898425874,0.5752591106101659,7.8406126499176025,0.22485685348510742
128,0.6,dev,0.6528393072895691,0.4689979676329672,0.5738164727212282,7.8406126499176025,0.19520950317382812
128,0.6,test,0.6537764350453172,0.4650557104949638,0.5716070860040647,7.8406126499176025,0.1960124969482422
256,0.003,train,0.6272324425943333,0.5831793845090248,0.6286153556114681,21.085537910461426,0.2625854015350342
256,0.003,dev,0.6270640354409988,0.5776906845969721,0.6261335600422892,21.085537910461426,0.23853731155395508
256,0.003,test,0.6305135951661631,0.5890848692163497,0.6328392800672469,21.085537910461426,0.2640252113342285
256,0.1,train,0.6373036121928293,0.5896401742560877,0.6365336354570506,23.84879207611084,0.26946258544921875
256,0.1,dev,0.6302859444220701,0.5800216235816434,0.6287645563640362,23.84879207611084,0.23929810523986816
256,0.1,test,0.6501510574018127,0.6043671162021027,0.6495004863012839,23.84879207611084,0.23663568496704102
256,0.3,train,0.4816704713307372,0.48055562623132453,0.47248673285963305,7.42703914642334,0.25711822509765625
256,0.3,dev,0.47563431333064843,0.4745842981793502,0.46670445474663474,7.42703914642334,0.23418283462524414
256,0.3,test,0.4761329305135952,0.47487505782326866,0.4662563005006612,7.42703914642334,0.2681865692138672
256,0.6,train,0.44272861554988585,0.4424277096652443,0.43808457675223833,6.222212314605713,0.30759716033935547
256,0.6,dev,0.44663713250100684,0.44638489698952366,0.4424205162147036,6.222212314605713,0.2434396743774414
256,0.6,test,0.46253776435045313,0.4625377152944674,0.4625921674385719,6.222212314605713,0.23287749290466309
512,0.003,train,0.4971129313817645,0.4907565581560025,0.5098333177049539,9.309175491333008,0.31482529640197754
512,0.003,dev,0.4973821989528796,0.4891606814567073,0.5109020277243628,9.309175491333008,0.3029510974884033
512,0.003,test,0.5163141993957704,0.5058798167489205,0.5299591613185742,9.309175491333008,0.3164553642272949
512,0.1,train,0.5286692627903854,0.5179005382610979,0.542060021773794,10.735265731811523,0.32500267028808594
512,0.1,dev,0.5340314136125655,0.5233322907860668,0.547290272814221,10.735265731811523,0.30245184898376465
512,0.1,test,0.5395770392749245,0.5261094309901158,0.5528998345674235,10.735265731811523,0.3174104690551758
512,0.3,train,0.5810393447025648,0.5602012849930744,0.5923003812883227,25.21336007118225,0.311173677444458
512,0.3,dev,0.5859846959323399,0.5675242116392076,0.5975000077721105,25.21336007118225,0.3079850673675537
512,0.3,test,0.5858006042296072,0.5652888614664485,0.5969551124638145,25.21336007118225,0.3045186996459961
512,0.6,train,0.4913387941452934,0.49052844882390334,0.49734135208151586,10.602793216705322,0.3272240161895752
512,0.6,dev,0.48892468787756743,0.4880607842388607,0.4951159972882994,10.602793216705322,0.3149425983428955
512,0.6,test,0.48700906344410877,0.4860090514819497,0.49361188215315893,10.602793216705322,0.3280045986175537
