split,accracy,macro,micro,weighted,time
train,{'accuracy': 1.0},{'f1': 1.0},{'f1': 1.0},{'f1': 1.0},1972.8055703639984
dev,{'accuracy': 0.9789719626168224},{'f1': 0.9789152359643456},{'f1': 0.9789719626168224},{'f1': 0.9789663410566671},1972.8055703639984
test,{'accuracy': 0.9803738317757009},{'f1': 0.9803218390804598},{'f1': 0.9803738317757009},{'f1': 0.9803691051670427},1972.8055703639984
