split,accracy,macro,micro,weighted,time
train,{'accuracy': 0.6222222222222222},{'f1': 0.3515162104445738},{'f1': 0.6222222222222222},{'f1': 0.5748154187967817},98.87825918197632
dev,{'accuracy': 0.4342105263157895},{'f1': 0.20491803278688528},{'f1': 0.4342105263157895},{'f1': 0.3696074201898188},98.87825918197632
test,{'accuracy': 0.4158415841584158},{'f1': 0.20766666666666667},{'f1': 0.4158415841584158},{'f1': 0.3722772277227723},98.87825918197632
