split,accracy,macro,micro,weighted,time
train,{'accuracy': 0.7466666666666667},{'f1': 0.42480809337120495},{'f1': 0.7466666666666667},{'f1': 0.6929458845183785},87.6025288105011
dev,{'accuracy': 0.4868421052631579},{'f1': 0.27142857142857146},{'f1': 0.4868421052631579},{'f1': 0.4473684210526316},87.6025288105011
test,{'accuracy': 0.36633663366336633},{'f1': 0.19414004139594682},{'f1': 0.36633663366336633},{'f1': 0.33712972278023856},87.6025288105011
