split,accracy,macro,micro,weighted,time
train,{'accuracy': 0.6933333333333334},{'f1': 0.4218003929916489},{'f1': 0.6933333333333334},{'f1': 0.6621795935447483},89.99448609352112
dev,{'accuracy': 0.5},{'f1': 0.2974250832408435},{'f1': 0.5},{'f1': 0.47372071966820495},89.99448609352112
test,{'accuracy': 0.36633663366336633},{'f1': 0.204295796525034},{'f1': 0.36633663366336633},{'f1': 0.3476158177229062},89.99448609352112
