split,accracy,macro,micro,weighted,time
train,{'accuracy': 0.998120048341614},{'f1': 0.9978827750516015},{'f1': 0.998120048341614},{'f1': 0.9981204290448472},1203.816763162613
dev,{'accuracy': 0.7809101892871526},{'f1': 0.7546014766583339},{'f1': 0.7809101892871526},{'f1': 0.7815573900898296},1203.816763162613
test,{'accuracy': 0.775226586102719},{'f1': 0.7498634865534255},{'f1': 0.775226586102719},{'f1': 0.7765741511641616},1203.816763162613
