channels,drop,split,micro,macro,weight,train_time,inference_time
4,0.003,train,0.7708860759493671,0.72281649206752,0.7849393783246071,2.462160110473633,0.05411934852600098
4,0.003,dev,0.7765151515151515,0.7403059457300847,0.7880990563573906,2.462160110473633,0.024286746978759766
4,0.003,test,0.7926136363636364,0.7354817058508437,0.8054266614824289,2.462160110473633,0.023914337158203125
4,0.1,train,0.7886075949367088,0.6893042027615418,0.7823482935848316,2.2014362812042236,0.04905414581298828
4,0.1,dev,0.7689393939393939,0.6796839835845453,0.7701607676133462,2.2014362812042236,0.020949363708496094
4,0.1,test,0.8238636363636364,0.7092722572494357,0.8163675328689709,2.2014362812042236,0.02064371109008789
4,0.3,train,0.6949367088607595,0.5840814692293536,0.692252408021542,1.1357154846191406,0.04481863975524902
4,0.3,dev,0.7272727272727273,0.6053750599816877,0.7225197574723957,1.1357154846191406,0.019568681716918945
4,0.3,test,0.7272727272727273,0.5989342904645042,0.7252965012215737,1.1357154846191406,0.02140951156616211
4,0.6,train,0.33164556962025316,0.32596828800913746,0.35257102128549844,0.8576922416687012,0.04317927360534668
4,0.6,dev,0.36363636363636365,0.3509920689483754,0.38173828332518117,0.8576922416687012,0.018926382064819336
4,0.6,test,0.3579545454545455,0.3506113090303451,0.39217447548008155,0.8576922416687012,0.018733501434326172
8,0.003,train,0.8088607594936709,0.7278197442588125,0.8124854323277967,1.1171917915344238,0.37040066719055176
8,0.003,dev,0.7992424242424242,0.7151246256509414,0.800158635924186,1.1171917915344238,0.02148294448852539
8,0.003,test,0.8210227272727273,0.7030959194247031,0.8255784057984481,1.1171917915344238,0.020633220672607422
8,0.1,train,0.7962025316455696,0.7326208770163913,0.8063520555078666,1.8666493892669678,0.04701972007751465
8,0.1,dev,0.7878787878787878,0.7291652812185404,0.8042367700874049,1.8666493892669678,0.020958423614501953
8,0.1,test,0.8011363636363636,0.7204674017473542,0.8181323830425353,1.8666493892669678,0.020412206649780273
8,0.3,train,0.7012658227848101,0.5339573926814475,0.6760827288849687,1.7864208221435547,0.0452883243560791
8,0.3,dev,0.696969696969697,0.5356806616800818,0.6751445606831065,1.7864208221435547,0.02042102813720703
8,0.3,test,0.7414772727272728,0.5679096638655462,0.7179030987394959,1.7864208221435547,0.020095109939575195
8,0.6,train,0.5911392405063292,0.4337793666051861,0.5541988129819211,0.784416913986206,0.046128034591674805
8,0.6,dev,0.571969696969697,0.41128739391264224,0.5238470609264735,0.784416913986206,0.020661115646362305
8,0.6,test,0.5965909090909091,0.44035983988843497,0.5612057912617382,0.784416913986206,0.019850730895996094
16,0.003,train,0.8582278481012658,0.728801774008809,0.8438710585475186,1.872973918914795,0.04554152488708496
16,0.003,dev,0.8143939393939394,0.7128662501758346,0.8023074919986799,1.872973918914795,0.020754337310791016
16,0.003,test,0.8636363636363636,0.7191438591730839,0.8470236755352243,1.872973918914795,0.020404815673828125
16,0.1,train,0.8278481012658228,0.743500594040237,0.8437847755180241,1.4387767314910889,0.046181678771972656
16,0.1,dev,0.803030303030303,0.7105667062937938,0.8192411879626131,1.4387767314910889,0.020739078521728516
16,0.1,test,0.8323863636363636,0.7428775910270813,0.8457605014902406,1.4387767314910889,0.02038884162902832
16,0.3,train,0.5620253164556962,0.41299971880921355,0.5268208467248046,0.7132322788238525,0.04565095901489258
16,0.3,dev,0.5909090909090909,0.4323859747707248,0.5513138910337899,0.7132322788238525,0.0206148624420166
16,0.3,test,0.6193181818181818,0.46966060187882114,0.5953882067495037,0.7132322788238525,0.020168781280517578
16,0.6,train,0.8341772151898734,0.748758323267986,0.8349042433622612,1.428769588470459,0.04594898223876953
16,0.6,dev,0.803030303030303,0.7031113775065388,0.7995586312118571,1.428769588470459,0.020670652389526367
16,0.6,test,0.8551136363636364,0.758304588767778,0.85836043698537,1.428769588470459,0.02042245864868164
32,0.003,train,0.610126582278481,0.548587254213045,0.6672553345828469,0.7747113704681396,0.04597806930541992
32,0.003,dev,0.6742424242424242,0.6154001602991587,0.7267993422296596,0.7747113704681396,0.0210573673248291
32,0.003,test,0.6619318181818182,0.5853994353144157,0.7119916696662169,0.7747113704681396,0.020578384399414062
32,0.1,train,0.8518987341772153,0.7586573014321507,0.8406714091032544,1.8982462882995605,0.045813560485839844
32,0.1,dev,0.8181818181818182,0.7302548554386789,0.8090270691874969,1.8982462882995605,0.020958423614501953
32,0.1,test,0.8636363636363636,0.7635708478238385,0.8505447375096277,1.8982462882995605,0.020780086517333984
32,0.3,train,0.11518987341772152,0.11943884815138502,0.11680551323085676,0.6441316604614258,0.04488515853881836
32,0.3,dev,0.14393939393939395,0.15959657426188867,0.15356465261130575,0.6441316604614258,0.019739627838134766
32,0.3,test,0.11363636363636363,0.13060558669006386,0.12606529824612642,0.6441316604614258,0.01965641975402832
32,0.6,train,0.8050632911392405,0.7233870873854226,0.8066492336812235,1.2218215465545654,0.04486417770385742
32,0.6,dev,0.7803030303030304,0.7095712585476365,0.7807867833064684,1.2218215465545654,0.020255327224731445
32,0.6,test,0.8210227272727273,0.7194552681118317,0.8244828460441053,1.2218215465545654,0.01954364776611328
64,0.003,train,0.8607594936708861,0.7581539891491149,0.8492225693683167,2.1132805347442627,0.04574918746948242
64,0.003,dev,0.8371212121212122,0.7716007142425129,0.8316116740188835,2.1132805347442627,0.02054309844970703
64,0.003,test,0.8693181818181818,0.7667828565765787,0.8577928446903436,2.1132805347442627,0.020499467849731445
64,0.1,train,0.5468354430379747,0.533631124154235,0.6275890582224822,1.1360063552856445,0.04894232749938965
64,0.1,dev,0.553030303030303,0.5394057966829343,0.6318600542372526,1.1360063552856445,0.021368980407714844
64,0.1,test,0.5397727272727273,0.5232762395849344,0.6194004414909479,1.1360063552856445,0.02100992202758789
64,0.3,train,0.8025316455696202,0.7088174794956901,0.8042363926169656,2.1483893394470215,0.049700260162353516
64,0.3,dev,0.7840909090909092,0.6927511196175492,0.7882659959394805,2.1483893394470215,0.022248506546020508
64,0.3,test,0.8068181818181818,0.7069218685548218,0.8051220090094184,2.1483893394470215,0.02151632308959961
64,0.6,train,0.6088607594936709,0.49140482999832386,0.6076483753721496,0.9311470985412598,0.04863572120666504
64,0.6,dev,0.5568181818181818,0.4449119761963799,0.5696134165858937,0.9311470985412598,0.021956205368041992
64,0.6,test,0.6221590909090909,0.49617387406457397,0.6184614328842081,0.9311470985412598,0.02081775665283203
128,0.003,train,0.8822784810126583,0.8353409354755508,0.8905116441390784,2.4379990100860596,0.048798322677612305
128,0.003,dev,0.8409090909090909,0.7986440214916675,0.8526009742920772,2.4379990100860596,0.021465063095092773
128,0.003,test,0.8465909090909091,0.7867448246696658,0.8660340791960682,2.4379990100860596,0.02113056182861328
128,0.1,train,0.8658227848101265,0.8069618286935946,0.8633430950712367,2.286198854446411,0.04746556282043457
128,0.1,dev,0.8295454545454547,0.7690734941955254,0.8277300509070824,2.286198854446411,0.021557092666625977
128,0.1,test,0.875,0.7777142169999313,0.8706274440446518,2.286198854446411,0.021053552627563477
128,0.3,train,0.8215189873417722,0.718836623227771,0.8220829047427374,1.6052496433258057,0.04738616943359375
128,0.3,dev,0.7803030303030304,0.6913999561058385,0.7816558658804649,1.6052496433258057,0.021779775619506836
128,0.3,test,0.8323863636363636,0.7186586448211238,0.8339612336701134,1.6052496433258057,0.020843029022216797
128,0.6,train,0.8430379746835445,0.6928243481228844,0.8248988674004312,1.8631749153137207,0.047078847885131836
128,0.6,dev,0.8181818181818182,0.6998018533595134,0.8037226643621214,1.8631749153137207,0.021770000457763672
128,0.6,test,0.8693181818181818,0.7103302782746602,0.8479319342762831,1.8631749153137207,0.021353721618652344
256,0.003,train,0.8873417721518987,0.8355441896276742,0.8929067293619859,3.103640556335449,0.049010515213012695
256,0.003,dev,0.8598484848484849,0.81314296652907,0.8657799067442908,3.103640556335449,0.023283720016479492
256,0.003,test,0.8892045454545454,0.8272217476173143,0.8982112807051692,3.103640556335449,0.02303147315979004
256,0.1,train,0.8164556962025317,0.6355847607484161,0.7902014368212797,3.1036434173583984,0.04926657676696777
256,0.1,dev,0.8143939393939394,0.6376854733847109,0.7893660347237068,3.1036434173583984,0.024500131607055664
256,0.1,test,0.8494318181818182,0.6609601376398891,0.8218675868238179,3.1036434173583984,0.023624897003173828
256,0.3,train,0.8341772151898734,0.721017757529243,0.8229484859916562,1.748354196548462,0.04934120178222656
256,0.3,dev,0.8143939393939394,0.7004888789371547,0.8044497821927288,1.748354196548462,0.024465560913085938
256,0.3,test,0.8607954545454546,0.7152389869481504,0.8455184988854636,1.748354196548462,0.023255586624145508
256,0.6,train,0.7683544303797467,0.610909087482975,0.755466577305895,1.200908899307251,0.048941850662231445
256,0.6,dev,0.75,0.603520172119749,0.7397017108943967,1.200908899307251,0.02362680435180664
256,0.6,test,0.7755681818181818,0.6042212272253668,0.7595697779945266,1.200908899307251,0.02373051643371582
512,0.003,train,0.9050632911392406,0.8664684725838158,0.9039786163321117,4.87221884727478,0.05399489402770996
512,0.003,dev,0.8787878787878788,0.865359803027275,0.8789661294383455,4.87221884727478,0.029535293579101562
512,0.003,test,0.9119318181818182,0.8773526839022642,0.9107741200415639,4.87221884727478,0.029256820678710938
512,0.1,train,0.8683544303797468,0.7874528131743751,0.8603552690817093,5.260287761688232,0.05825304985046387
512,0.1,dev,0.8143939393939394,0.7136420967005676,0.8029938690631072,5.260287761688232,0.029229402542114258
512,0.1,test,0.8778409090909091,0.7590290107268036,0.8667277240494559,5.260287761688232,0.02900838851928711
512,0.3,train,0.8860759493670886,0.8219107477201302,0.8826863650669259,4.929615497589111,0.055175065994262695
512,0.3,dev,0.8674242424242424,0.8353324407709415,0.8658779637864155,4.929615497589111,0.02927684783935547
512,0.3,test,0.9034090909090909,0.8570739745770346,0.9008919569729629,4.929615497589111,0.029121875762939453
512,0.6,train,0.7886075949367088,0.6640055560319735,0.7925304186639818,2.208287000656128,0.05602407455444336
512,0.6,dev,0.7462121212121213,0.6403514831566344,0.7557124744338425,2.208287000656128,0.029290199279785156
512,0.6,test,0.8153409090909091,0.7009672292236071,0.8185959422125005,2.208287000656128,0.0289309024810791
