split,accracy,macro,micro,weighted,time
train,{'accuracy': 1.0},{'f1': 1.0},{'f1': 1.0},{'f1': 1.0},270.7825610637665
dev,{'accuracy': 0.9734848484848485},{'f1': 0.9736773040991947},{'f1': 0.9734848484848485},{'f1': 0.9735518582683955},270.7825610637665
test,{'accuracy': 0.9715909090909091},{'f1': 0.9737349604760509},{'f1': 0.9715909090909091},{'f1': 0.9715761898712626},270.7825610637665
