split,accracy,macro,micro,weighted,time
train,{'accuracy': 0.98},{'f1': 0.9754004790587549},{'f1': 0.98},{'f1': 0.9799940739077861},49.060056924819946
dev,{'accuracy': 0.7142857142857143},{'f1': 0.6302525252525252},{'f1': 0.7142857142857143},{'f1': 0.7106493506493505},49.060056924819946
test,{'accuracy': 0.7439446366782007},{'f1': 0.6713583809636352},{'f1': 0.7439446366782005},{'f1': 0.737003221804135},49.060056924819946
