split,accracy,macro,micro,weighted,time
train,{'accuracy': 0.9747899159663865},{'f1': 0.8971233189303938},{'f1': 0.9747899159663865},{'f1': 0.9737752697120147},1565.0004243850708
dev,{'accuracy': 0.5857406269207129},{'f1': 0.5249454005959123},{'f1': 0.5857406269207129},{'f1': 0.5837257959258572},1565.0004243850708
test,{'accuracy': 0.5795297372060858},{'f1': 0.5111655295581059},{'f1': 0.5795297372060858},{'f1': 0.5772143254191832},1565.0004243850708
