split,accracy,macro,micro,weighted,time
train,{'accuracy': 0.7244444444444444},{'f1': 0.43886624203821645},{'f1': 0.7244444444444443},{'f1': 0.6900334041047417},87.9498827457428
dev,{'accuracy': 0.39473684210526316},{'f1': 0.23530621425358267},{'f1': 0.39473684210526316},{'f1': 0.3731105767116847},87.9498827457428
test,{'accuracy': 0.32673267326732675},{'f1': 0.17696078431372547},{'f1': 0.32673267326732675},{'f1': 0.3017666472529606},87.9498827457428
