split,accracy,macro,micro,weighted,time
train,{'accuracy': 1.0},{'f1': 1.0},{'f1': 1.0},{'f1': 1.0},260.69949197769165
dev,{'accuracy': 0.9772727272727273},{'f1': 0.9820793106438886},{'f1': 0.9772727272727273},{'f1': 0.9773136167869951},260.69949197769165
test,{'accuracy': 0.9829545454545454},{'f1': 0.9867552638394428},{'f1': 0.9829545454545454},{'f1': 0.9829415499198965},260.69949197769165
