split,accracy,macro,micro,weighted,time
train,{'accuracy': 0.8844444444444445},{'f1': 0.5588801903446159},{'f1': 0.8844444444444445},{'f1': 0.8483351668500183},87.8978226184845
dev,{'accuracy': 0.4342105263157895},{'f1': 0.20976343223736968},{'f1': 0.4342105263157895},{'f1': 0.3672194846579158},87.8978226184845
test,{'accuracy': 0.4158415841584158},{'f1': 0.2005189073449969},{'f1': 0.4158415841584158},{'f1': 0.36497936241402945},87.8978226184845
