split,accracy,macro,micro,weighted,time
train,{'accuracy': 1.0},{'f1': 1.0},{'f1': 1.0},{'f1': 1.0},1975.301750421524
dev,{'accuracy': 0.9700934579439252},{'f1': 0.969995942792498},{'f1': 0.9700934579439252},{'f1': 0.9700758732444876},1975.301750421524
test,{'accuracy': 0.9803738317757009},{'f1': 0.9803255607477863},{'f1': 0.9803738317757009},{'f1': 0.9803710994533661},1975.301750421524
