channels,drop,split,micro,macro,weight,train_time,inference_time
4,0.003,train,0.5446153846153846,0.43254295847856666,0.5257378980097748,2.1682589054107666,0.053122758865356445
4,0.003,dev,0.543778801843318,0.41282201405152225,0.5224122859085464,2.1682589054107666,0.02071666717529297
4,0.003,test,0.5363321799307958,0.3878542035056171,0.508451404740985,2.1682589054107666,0.022114276885986328
4,0.1,train,0.47692307692307695,0.33251300493317054,0.4406611080620542,2.103416919708252,0.041570425033569336
4,0.1,dev,0.4608294930875576,0.31163594721343657,0.42195436134480385,2.103416919708252,0.016990184783935547
4,0.1,test,0.47058823529411764,0.31730670138041384,0.43293710751492753,2.103416919708252,0.016616106033325195
4,0.3,train,0.28,0.12132808513740068,0.1314305258849322,0.6737630367279053,0.04118943214416504
4,0.3,dev,0.28110599078341014,0.11641221374045801,0.13304252998909485,0.6737630367279053,0.01667475700378418
4,0.3,test,0.28719723183391005,0.12514278035342338,0.13375982025426936,0.6737630367279053,0.01627373695373535
4,0.6,train,0.20000000000000004,0.12956950126719588,0.21581319620931644,1.1841185092926025,0.05324840545654297
4,0.6,dev,0.2073732718894009,0.13240292085914843,0.22431798585240428,1.1841185092926025,0.020468473434448242
4,0.6,test,0.21107266435986158,0.13779407390162832,0.20407992037302342,1.1841185092926025,0.02017807960510254
8,0.003,train,0.5538461538461539,0.4653720391758386,0.5553399404361877,1.7666819095611572,0.044623613357543945
8,0.003,dev,0.4792626728110599,0.42165323915682584,0.48097884436108146,1.7666819095611572,0.017205238342285156
8,0.003,test,0.4532871972318339,0.34762348841141355,0.4602741012953463,1.7666819095611572,0.017043590545654297
8,0.1,train,0.4938461538461538,0.40385514374044107,0.4812797186488393,1.2097890377044678,0.04328727722167969
8,0.1,dev,0.47465437788018433,0.40116064290243425,0.4657854841441139,1.2097890377044678,0.0169217586517334
8,0.1,test,0.44982698961937717,0.34718427652165984,0.4345642350486069,1.2097890377044678,0.01645064353942871
8,0.3,train,0.4015384615384615,0.21336652310917226,0.36798874149015054,0.8853816986083984,0.043051958084106445
8,0.3,dev,0.41935483870967744,0.22437299504228642,0.3879985431928536,0.8853816986083984,0.01683354377746582
8,0.3,test,0.4359861591695502,0.2533723458912409,0.4055313857198268,0.8853816986083984,0.016412973403930664
8,0.6,train,0.49538461538461537,0.2050592493938463,0.3828658265888058,0.6341018676757812,0.042040109634399414
8,0.6,dev,0.4930875576036866,0.2052463867076363,0.38361446187523573,0.6341018676757812,0.01683497428894043
8,0.6,test,0.5190311418685121,0.22932203389830508,0.4132097824174535,0.6341018676757812,0.016510963439941406
16,0.003,train,0.5876923076923077,0.4270308821629609,0.5524949273241914,1.7677531242370605,0.04270172119140625
16,0.003,dev,0.5023041474654378,0.3473118279569893,0.4728593463200588,1.7677531242370605,0.01743030548095703
16,0.003,test,0.532871972318339,0.3488675354469135,0.4950398331321317,1.7677531242370605,0.017053604125976562
16,0.1,train,0.36769230769230765,0.26551191442829325,0.37105948507621395,0.9771504402160645,0.044891357421875
16,0.1,dev,0.3456221198156682,0.24004513918307024,0.34982396840016416,0.9771504402160645,0.017786264419555664
16,0.1,test,0.3944636678200692,0.28989583333333335,0.4138826412918109,0.9771504402160645,0.01689291000366211
16,0.3,train,0.44769230769230767,0.334937463488336,0.44977000885274676,1.0923058986663818,0.04307699203491211
16,0.3,dev,0.46543778801843316,0.3722084945778337,0.4715369016431076,1.0923058986663818,0.017441987991333008
16,0.3,test,0.41522491349480967,0.30492133954666256,0.4263633599327385,1.0923058986663818,0.017024517059326172
16,0.6,train,0.4584615384615385,0.3125413160496237,0.43966306053153587,1.1053242683410645,0.04238557815551758
16,0.6,dev,0.4792626728110599,0.3340890992388069,0.4614124775857622,1.1053242683410645,0.01715683937072754
16,0.6,test,0.44982698961937717,0.3023090815273478,0.4292379126117758,1.1053242683410645,0.0166776180267334
32,0.003,train,0.5861538461538461,0.4880397026495653,0.5681047308734387,1.508826732635498,0.04211568832397461
32,0.003,dev,0.5345622119815668,0.4770383998834159,0.535334738252161,1.508826732635498,0.017267465591430664
32,0.003,test,0.5017301038062284,0.37221489793522194,0.4714766703979729,1.508826732635498,0.01720404624938965
32,0.1,train,0.46153846153846156,0.2681528659063923,0.4038587130987654,0.8497850894927979,0.042333126068115234
32,0.1,dev,0.4884792626728111,0.32312857164828074,0.44302537027106625,0.8497850894927979,0.017077207565307617
32,0.1,test,0.4740484429065744,0.29439589166239466,0.42094010630187867,0.8497850894927979,0.0167386531829834
32,0.3,train,0.37384615384615383,0.2939987540518856,0.39500299413584405,0.7567489147186279,0.0423581600189209
32,0.3,dev,0.35483870967741943,0.2963632799408108,0.387069323224927,0.7567489147186279,0.017150163650512695
32,0.3,test,0.39100346020761245,0.27847686028469265,0.4090972086538104,0.7567489147186279,0.016913890838623047
32,0.6,train,0.5015384615384615,0.30987641248124986,0.4449050274721239,1.1178243160247803,0.04203510284423828
32,0.6,dev,0.4976958525345622,0.3137525429009813,0.449615488736822,1.1178243160247803,0.017449378967285156
32,0.6,test,0.5190311418685121,0.3281493825208188,0.45992633824409296,1.1178243160247803,0.016931533813476562
64,0.003,train,0.5584615384615385,0.4000725456004003,0.5253135765337656,1.2689857482910156,0.04239034652709961
64,0.003,dev,0.5299539170506913,0.358352452747733,0.4939741748191648,1.2689857482910156,0.01757526397705078
64,0.003,test,0.5847750865051903,0.3948719651703123,0.535180071751449,1.2689857482910156,0.017153263092041016
64,0.1,train,0.44153846153846155,0.3170356826458758,0.42971976491422126,1.4227113723754883,0.04656982421875
64,0.1,dev,0.4838709677419355,0.37641166822867855,0.4748092114071496,1.4227113723754883,0.01860523223876953
64,0.1,test,0.4290657439446367,0.3479349579093824,0.4213084826364589,1.4227113723754883,0.018237590789794922
64,0.3,train,0.41230769230769226,0.3010075088599862,0.4027479120657885,1.1637756824493408,0.04740571975708008
64,0.3,dev,0.42857142857142855,0.31585858585858584,0.41635685359187663,1.1637756824493408,0.018349170684814453
64,0.3,test,0.4359861591695502,0.3114952695442514,0.42680122455275615,1.1637756824493408,0.018040895462036133
64,0.6,train,0.32461538461538464,0.1863029205342993,0.2891110917608541,0.8715260028839111,0.046044111251831055
64,0.6,dev,0.3456221198156682,0.20318978026533996,0.3069603021757572,0.8715260028839111,0.01832890510559082
64,0.6,test,0.28027681660899656,0.1590406466864943,0.25644167796716166,0.8715260028839111,0.018087387084960938
128,0.003,train,0.42615384615384616,0.284162617043973,0.4092866622295567,0.8738014698028564,0.04513692855834961
128,0.003,dev,0.42857142857142855,0.28793354460499365,0.41082011580461164,0.8738014698028564,0.01871204376220703
128,0.003,test,0.42560553633217996,0.2851722811350141,0.41140069928137585,0.8738014698028564,0.018428802490234375
128,0.1,train,0.5723076923076923,0.47776102581938196,0.5719676786812475,1.5968353748321533,0.04380393028259277
128,0.1,dev,0.5529953917050692,0.45554882409025904,0.550980974398443,1.5968353748321533,0.0181729793548584
128,0.1,test,0.5605536332179931,0.42911122553269065,0.5488985595959841,1.5968353748321533,0.018067121505737305
128,0.3,train,0.43846153846153846,0.21881228203699216,0.35516527454952085,0.702232837677002,0.04455065727233887
128,0.3,dev,0.4377880184331797,0.22294237171954565,0.36267714318205213,0.702232837677002,0.018744468688964844
128,0.3,test,0.4671280276816609,0.2506446039340776,0.3923674000982324,0.702232837677002,0.017970561981201172
128,0.6,train,0.52,0.42318948246472843,0.48564475431413284,1.7241394519805908,0.04411506652832031
128,0.6,dev,0.511520737327189,0.40026075619295964,0.48917821744502993,1.7241394519805908,0.01845407485961914
128,0.6,test,0.43944636678200694,0.31024373781818315,0.4194171570104696,1.7241394519805908,0.018003225326538086
256,0.003,train,0.5661538461538461,0.4460094191683893,0.5522482287533989,1.7965424060821533,0.04564261436462402
256,0.003,dev,0.5161290322580645,0.38312478160675506,0.5001250407383724,1.7965424060821533,0.020139217376708984
256,0.003,test,0.5501730103806228,0.4066450216450216,0.5313647598076663,1.7965424060821533,0.019710540771484375
256,0.1,train,0.5107692307692308,0.3897861988081653,0.47391523051564893,1.5970313549041748,0.04562258720397949
256,0.1,dev,0.4700460829493088,0.3264021644673684,0.4249487997010221,1.5970313549041748,0.020292043685913086
256,0.1,test,0.47750865051903113,0.3133892790412989,0.4361828833755539,1.5970313549041748,0.020087480545043945
256,0.3,train,0.3892307692307692,0.25853537089701906,0.3866386818167082,1.1736512184143066,0.045716285705566406
256,0.3,dev,0.45161290322580644,0.3096253187191629,0.43571253847176245,1.1736512184143066,0.020149707794189453
256,0.3,test,0.3633217993079585,0.2755939946178423,0.3750502794466366,1.1736512184143066,0.019831180572509766
256,0.6,train,0.5046153846153846,0.19261174555292201,0.3699754068622847,0.8504362106323242,0.046828508377075195
256,0.6,dev,0.5023041474654378,0.1933333333333333,0.37149001536098303,0.8504362106323242,0.020187854766845703
256,0.6,test,0.5259515570934256,0.21231802911534153,0.39410253528985534,0.8504362106323242,0.01972031593322754
512,0.003,train,0.6046153846153847,0.5146879739802074,0.6045486340513735,3.769775867462158,0.05208444595336914
512,0.003,dev,0.543778801843318,0.47031188546390684,0.5452475420853249,3.769775867462158,0.024516820907592773
512,0.003,test,0.4982698961937716,0.3765928492154665,0.49273411454713295,3.769775867462158,0.023960351943969727
512,0.1,train,0.5984615384615385,0.5033884042305479,0.5750599920741994,3.963257074356079,1.482429027557373
512,0.1,dev,0.5253456221198156,0.44836253707203805,0.5133901597436803,3.963257074356079,0.02497553825378418
512,0.1,test,0.5397923875432526,0.3823500921044274,0.5006269716842351,3.963257074356079,0.02407073974609375
512,0.3,train,0.5092307692307693,0.16870540265035677,0.3436399278601113,1.262636423110962,0.050127506256103516
512,0.3,dev,0.511520737327189,0.16920731707317072,0.3462122063616949,1.262636423110962,0.025889158248901367
512,0.3,test,0.5086505190311419,0.16857798165137616,0.3429891114567792,1.262636423110962,0.025974512100219727
512,0.6,train,0.536923076923077,0.30539415688037597,0.4367795111394851,2.2439584732055664,0.05588960647583008
512,0.6,dev,0.5253456221198156,0.2848208967533241,0.42993050121832005,2.2439584732055664,0.03285336494445801
512,0.6,test,0.5467128027681661,0.3147724514072084,0.4534779177333106,2.2439584732055664,0.029737234115600586
