channels,drop,split,micro,macro,weight,train_time,inference_time
4,0.003,train,0.5333333333333333,0.4276966556759303,0.4276966556759303,1.2348968982696533,0.035421133041381836
4,0.003,dev,0.5666666666666667,0.466484268125855,0.46648426812585503,1.2348968982696533,0.010452032089233398
4,0.003,test,0.53,0.42338363390994965,0.42338363390994965,1.2348968982696533,0.010140180587768555
4,0.1,train,0.6222222222222222,0.6137447405329594,0.6137447405329595,0.648890495300293,0.036774635314941406
4,0.1,dev,0.5666666666666667,0.5417156286721504,0.5417156286721504,0.648890495300293,0.010569572448730469
4,0.1,test,0.61,0.6010230179028133,0.6010230179028134,0.648890495300293,0.010263681411743164
4,0.3,train,0.4444444444444444,0.3714693649512695,0.3714693649512694,0.5359365940093994,0.03606843948364258
4,0.3,dev,0.4666666666666667,0.3650793650793651,0.36507936507936506,0.5359365940093994,0.010417699813842773
4,0.3,test,0.46,0.37434827945776855,0.37434827945776855,0.5359365940093994,0.010425090789794922
4,0.6,train,0.4666666666666667,0.41247582205029015,0.4124758220502902,0.7259395122528076,0.03627586364746094
4,0.6,dev,0.36666666666666664,0.30402930402930406,0.30402930402930406,0.7259395122528076,0.01047205924987793
4,0.6,test,0.42999999999999994,0.3649732620320856,0.3649732620320856,0.7259395122528076,0.010159969329833984
8,0.003,train,0.5962962962962963,0.5698060253468009,0.5698060253468009,0.8716080188751221,0.03629493713378906
8,0.003,dev,0.6333333333333333,0.6122209165687428,0.6122209165687428,0.8716080188751221,0.010622262954711914
8,0.003,test,0.58,0.5442708333333334,0.5442708333333334,0.8716080188751221,0.01027536392211914
8,0.1,train,0.6037037037037037,0.5760137366266015,0.5760137366266015,1.1582527160644531,0.03573489189147949
8,0.1,dev,0.6,0.569377990430622,0.569377990430622,1.1582527160644531,0.010416269302368164
8,0.1,test,0.59,0.5670995670995671,0.5670995670995671,1.1582527160644531,0.010221004486083984
8,0.3,train,0.5296296296296297,0.41142141128409343,0.41142141128409343,0.5307393074035645,0.03602099418640137
8,0.3,dev,0.5333333333333333,0.40340909090909094,0.40340909090909094,0.5307393074035645,0.010535240173339844
8,0.3,test,0.52,0.3981191222570533,0.39811912225705337,0.5307393074035645,0.010217905044555664
8,0.6,train,0.4296296296296296,0.35470854801663665,0.35470854801663665,0.5151979923248291,0.03540492057800293
8,0.6,dev,0.43333333333333335,0.3772893772893773,0.3772893772893772,0.5151979923248291,0.010431051254272461
8,0.6,test,0.47500000000000003,0.4249568717653823,0.4249568717653824,0.5151979923248291,0.010222434997558594
16,0.003,train,0.5888888888888889,0.5652173913043479,0.5652173913043479,1.286543607711792,0.035574913024902344
16,0.003,dev,0.6666666666666666,0.6527777777777778,0.6527777777777779,1.286543607711792,0.010547637939453125
16,0.003,test,0.575,0.554402243715761,0.554402243715761,1.286543607711792,0.010267972946166992
16,0.1,train,0.6111111111111112,0.58044131358127,0.58044131358127,1.4753398895263672,0.0393366813659668
16,0.1,dev,0.6666666666666666,0.6411483253588517,0.6411483253588517,1.4753398895263672,0.011130571365356445
16,0.1,test,0.58,0.5442708333333334,0.5442708333333334,1.4753398895263672,0.010907888412475586
16,0.3,train,0.5222222222222223,0.5158398087268381,0.5158398087268381,0.7382581233978271,0.03811502456665039
16,0.3,dev,0.6,0.5833333333333333,0.5833333333333334,0.7382581233978271,0.011090993881225586
16,0.3,test,0.575,0.5682539682539682,0.5682539682539683,0.7382581233978271,0.010823965072631836
16,0.6,train,0.4370370370370371,0.4230769230769231,0.4230769230769231,0.6916813850402832,0.0382537841796875
16,0.6,dev,0.4000000000000001,0.375,0.375,0.6916813850402832,0.01100611686706543
16,0.6,test,0.45,0.44054521411860437,0.44054521411860437,0.6916813850402832,0.01067972183227539
32,0.003,train,0.5,0.3333333333333333,0.3333333333333333,0.5908141136169434,0.037178993225097656
32,0.003,dev,0.5,0.3333333333333333,0.3333333333333333,0.5908141136169434,0.010995864868164062
32,0.003,test,0.5,0.3333333333333333,0.33333333333333326,0.5908141136169434,0.010533571243286133
32,0.1,train,0.5074074074074074,0.3886514921942832,0.3886514921942832,0.5611059665679932,0.037874460220336914
32,0.1,dev,0.6,0.5238095238095238,0.5238095238095238,0.5611059665679932,0.010832786560058594
32,0.1,test,0.545,0.4608845048727746,0.46088450487277455,0.5611059665679932,0.010563373565673828
32,0.3,train,0.4666666666666667,0.43054660495635366,0.43054660495635366,0.6127121448516846,0.03749561309814453
32,0.3,dev,0.6,0.5833333333333333,0.5833333333333334,0.6127121448516846,0.010787487030029297
32,0.3,test,0.49,0.45599999999999996,0.45599999999999996,0.6127121448516846,0.01044607162475586
32,0.6,train,0.5444444444444444,0.48007827788649704,0.48007827788649704,0.7269952297210693,0.036312103271484375
32,0.6,dev,0.6,0.5238095238095238,0.5238095238095238,0.7269952297210693,0.011023759841918945
32,0.6,test,0.545,0.47939014273863667,0.4793901427386368,0.7269952297210693,0.010638236999511719
64,0.003,train,0.6,0.5571350464734828,0.5571350464734828,0.7450466156005859,0.03632855415344238
64,0.003,dev,0.6333333333333333,0.576379974326059,0.576379974326059,0.7450466156005859,0.011028289794921875
64,0.003,test,0.545,0.4835267743125514,0.48352677431255137,0.7450466156005859,0.011153697967529297
64,0.1,train,0.6296296296296297,0.6275862068965518,0.6275862068965518,1.0561153888702393,0.03642463684082031
64,0.1,dev,0.6333333333333333,0.6296296296296295,0.6296296296296297,1.0561153888702393,0.01098322868347168
64,0.1,test,0.57,0.5664885573142453,0.5664885573142453,1.0561153888702393,0.010738611221313477
64,0.3,train,0.5,0.3333333333333333,0.3333333333333333,0.6679584980010986,0.03541374206542969
64,0.3,dev,0.5,0.3333333333333333,0.3333333333333333,0.6679584980010986,0.010731697082519531
64,0.3,test,0.5,0.3333333333333333,0.33333333333333326,0.6679584980010986,0.010451793670654297
64,0.6,train,0.6222222222222222,0.6076699527038578,0.6076699527038577,1.04732084274292,0.035466909408569336
64,0.6,dev,0.6666666666666666,0.6606334841628959,0.6606334841628959,1.04732084274292,0.010793209075927734
64,0.6,test,0.565,0.5294117647058825,0.5294117647058824,1.04732084274292,0.010509014129638672
128,0.003,train,0.5222222222222223,0.4291941854176568,0.42919418541765675,0.7631855010986328,0.036513328552246094
128,0.003,dev,0.5666666666666667,0.466484268125855,0.46648426812585503,0.7631855010986328,0.011696338653564453
128,0.003,test,0.515,0.4018069131386636,0.4018069131386637,0.7631855010986328,0.010952472686767578
128,0.1,train,0.6296296296296297,0.6291208791208791,0.6291208791208791,1.339940071105957,0.0359654426574707
128,0.1,dev,0.6333333333333333,0.6296296296296295,0.6296296296296297,1.339940071105957,0.01118016242980957
128,0.1,test,0.555,0.5536497906166152,0.5536497906166152,1.339940071105957,0.011093616485595703
128,0.3,train,0.4925925925925926,0.3752849977200182,0.3752849977200182,1.2483720779418945,0.03958249092102051
128,0.3,dev,0.43333333333333335,0.3023255813953488,0.3023255813953488,1.2483720779418945,0.012124776840209961
128,0.3,test,0.49,0.3453985367731998,0.3453985367731998,1.2483720779418945,0.011536598205566406
128,0.6,train,0.5333333333333333,0.5167613636363636,0.5167613636363636,0.7096681594848633,0.03935742378234863
128,0.6,dev,0.43333333333333335,0.3772893772893773,0.3772893772893772,0.7096681594848633,0.011858463287353516
128,0.6,test,0.535,0.5146011117200345,0.5146011117200345,0.7096681594848633,0.01137399673461914
256,0.003,train,0.5074074074074074,0.3836145488250742,0.38361454882507423,0.800774097442627,0.03861546516418457
256,0.003,dev,0.5666666666666667,0.466484268125855,0.46648426812585503,0.800774097442627,0.012148141860961914
256,0.003,test,0.505,0.3757684668495223,0.3757684668495223,0.800774097442627,0.011901378631591797
256,0.1,train,0.6148148148148148,0.6144763578450216,0.6144763578450217,0.7496750354766846,0.0383453369140625
256,0.1,dev,0.6333333333333333,0.6329254727474972,0.6329254727474972,0.7496750354766846,0.012109041213989258
256,0.1,test,0.535,0.5340564643402891,0.5340564643402891,0.7496750354766846,0.011588096618652344
256,0.3,train,0.5074074074074074,0.3836145488250742,0.38361454882507423,0.6541674137115479,0.037877559661865234
256,0.3,dev,0.5666666666666667,0.466484268125855,0.46648426812585503,0.6541674137115479,0.012136697769165039
256,0.3,test,0.51,0.38557993730407525,0.38557993730407525,0.6541674137115479,0.01166677474975586
256,0.6,train,0.6037037037037037,0.603698267465946,0.603698267465946,1.315976858139038,0.03763580322265625
256,0.6,dev,0.6666666666666666,0.6651785714285714,0.6651785714285715,1.315976858139038,0.011849164962768555
256,0.6,test,0.535,0.5348953514540772,0.5348953514540772,1.315976858139038,0.011541366577148438
512,0.003,train,0.6037037037037037,0.5933906630448551,0.593390663044855,0.9964077472686768,0.03973817825317383
512,0.003,dev,0.5666666666666667,0.5542857142857143,0.5542857142857142,0.9964077472686768,0.014286279678344727
512,0.003,test,0.525,0.5081670161269447,0.5081670161269447,0.9964077472686768,0.013899803161621094
512,0.1,train,0.6,0.5968143354902937,0.5968143354902937,1.467341661453247,0.03952646255493164
512,0.1,dev,0.6666666666666666,0.6606334841628959,0.6606334841628959,1.467341661453247,0.014266490936279297
512,0.1,test,0.53,0.5276856597326902,0.5276856597326902,1.467341661453247,0.013746261596679688
512,0.3,train,0.5555555555555556,0.5531034482758621,0.553103448275862,1.0924122333526611,0.04054760932922363
512,0.3,dev,0.5333333333333333,0.53125,0.53125,1.0924122333526611,0.013869047164916992
512,0.3,test,0.515,0.5084999113273037,0.5084999113273037,1.0924122333526611,0.013617992401123047
512,0.6,train,0.6074074074074074,0.6070624416497337,0.6070624416497337,1.4133968353271484,0.04192996025085449
512,0.6,dev,0.7,0.6996662958843158,0.6996662958843157,1.4133968353271484,0.014728307723999023
512,0.6,test,0.535,0.5348953514540772,0.5348953514540772,1.4133968353271484,0.014673948287963867
