channels,drop,split,micro,macro,weight,train_time,inference_time
4,0.003,train,0.6269638780717067,0.5670146578749221,0.6210360230251823,8.192961692810059,0.23178458213806152
4,0.003,dev,0.621425694724124,0.5610308577240605,0.6156550696904589,8.192961692810059,0.19646286964416504
4,0.003,test,0.6148036253776435,0.5561785280744095,0.6102715106235281,8.192961692810059,0.19409704208374023
4,0.1,train,0.6100443131462334,0.5024532594171369,0.5800319083231588,10.309155702590942,0.22677135467529297
4,0.1,dev,0.6226339105920258,0.5163449223379462,0.5924091209768193,10.309155702590942,0.20339488983154297
4,0.1,test,0.6090634441087613,0.5028391679821711,0.5799038388975406,10.309155702590942,0.20255780220031738
4,0.3,train,0.660131596616087,0.41158110575514784,0.5398105635402233,10.259859561920166,0.22140121459960938
4,0.3,dev,0.662102295610149,0.4116627208590837,0.5404381318267611,10.259859561920166,0.19025945663452148
4,0.3,test,0.6610271903323263,0.4136320575975748,0.5413569865908651,10.259859561920166,0.1972362995147705
4,0.6,train,0.6031959178192561,0.5508640544354142,0.6022695079639167,10.364327192306519,0.22681140899658203
4,0.6,dev,0.5916230366492147,0.5417691929133859,0.5924752391062373,10.364327192306519,0.19400310516357422
4,0.6,test,0.6045317220543807,0.5535019335962438,0.6041212948013661,10.364327192306519,0.19167709350585938
8,0.003,train,0.6262924667651403,0.5184625850558257,0.5948675835314666,11.254196643829346,0.22747588157653809
8,0.003,dev,0.6343133306484092,0.5259856359538466,0.6020066719105194,11.254196643829346,0.19520115852355957
8,0.003,test,0.6277945619335348,0.5186775198871053,0.5955302588918875,11.254196643829346,0.19987034797668457
8,0.1,train,0.6626829595810394,0.4759950368327159,0.580867869926656,9.277772426605225,0.2249135971069336
8,0.1,dev,0.6580749093838099,0.4758650748521939,0.5795404793363715,9.277772426605225,0.1639559268951416
8,0.1,test,0.6607250755287009,0.47781522835337453,0.5814548048539423,9.277772426605225,0.1730494499206543
8,0.3,train,0.6410635155096012,0.49592465577117617,0.5866182825897066,11.049633741378784,0.18908071517944336
8,0.3,dev,0.6504228755537657,0.5100658142398082,0.5980398037616491,11.049633741378784,0.17269110679626465
8,0.3,test,0.640785498489426,0.4948711113313009,0.5859138149544143,11.049633741378784,0.16415810585021973
8,0.6,train,0.6540888948569894,0.45831252251916466,0.567504749842718,9.78606629371643,0.24155950546264648
8,0.6,dev,0.657672170761176,0.4554993137467364,0.5668079653614279,9.78606629371643,0.18671369552612305
8,0.6,test,0.6574018126888218,0.46469033232628393,0.5723991657615392,9.78606629371643,0.16593003273010254
16,0.003,train,0.5477373438968712,0.5002768635771858,0.5519146933629175,11.090680837631226,0.19346022605895996
16,0.003,dev,0.5473217881594845,0.5017410281349575,0.5522986487746792,11.090680837631226,0.1648571491241455
16,0.003,test,0.5516616314199396,0.5064316099844696,0.5565367235507087,11.090680837631226,0.1674203872680664
16,0.1,train,0.6519403786759769,0.6051732051732052,0.6507360737789099,6.809077024459839,4.0574750900268555
16,0.1,dev,0.6480064438179621,0.6001513061114994,0.6465579763204441,6.809077024459839,0.19784164428710938
16,0.1,test,0.6410876132930513,0.5965278419059932,0.6414927021238429,6.809077024459839,0.17568087577819824
16,0.3,train,0.6489861689270847,0.4645035201201755,0.5698920294019995,11.040475130081177,0.1916666030883789
16,0.3,dev,0.6516310914216673,0.4758209079072447,0.5776636637261001,11.040475130081177,0.16671347618103027
16,0.3,test,0.6465256797583081,0.4755281690140845,0.5759552784987872,11.040475130081177,0.16533637046813965
16,0.6,train,0.5747280784208406,0.5174343625771644,0.5731874445965174,5.884350776672363,0.2016756534576416
16,0.6,dev,0.5722915827627869,0.5156668542570026,0.5712244500700985,5.884350776672363,0.1668095588684082
16,0.6,test,0.5622356495468278,0.5110448413043494,0.5640997406032765,5.884350776672363,0.1658182144165039
32,0.003,train,0.5673425540486102,0.4834596319695458,0.553254919017671,2.908628225326538,0.20171260833740234
32,0.003,dev,0.5771244462343939,0.49545099866699893,0.5635530825745464,2.908628225326538,0.17110800743103027
32,0.003,test,0.5827794561933535,0.49908339178680905,0.5677475687943954,2.908628225326538,0.17507529258728027
32,0.1,train,0.5881563045521686,0.5433798781017476,0.5913244479330947,6.417887449264526,0.20612621307373047
32,0.1,dev,0.5718888441401531,0.523942142850057,0.5746269171833691,6.417887449264526,0.17337465286254883
32,0.1,test,0.5761329305135952,0.5358611160389687,0.5817090279023897,6.417887449264526,0.1738581657409668
32,0.3,train,0.583993554451457,0.5388934484944188,0.5872468038292081,7.890920639038086,0.20771479606628418
32,0.3,dev,0.5839710028191704,0.5381621296543876,0.5869585380255693,7.890920639038086,0.17243313789367676
32,0.3,test,0.5909365558912387,0.5489392109500805,0.5950947088557097,7.890920639038086,0.16708111763000488
32,0.6,train,0.6254867731972606,0.508092778859935,0.5886680410535309,7.892228364944458,0.20608067512512207
32,0.6,dev,0.6194120016109544,0.5064236123892893,0.5856486361448845,7.892228364944458,0.17212748527526855
32,0.6,test,0.6129909365558912,0.49633133221301634,0.5776195687607822,7.892228364944458,0.16818475723266602
64,0.003,train,0.5077212300255136,0.49407617349071786,0.5219352954591437,3.2300970554351807,0.2146904468536377
64,0.003,dev,0.49214659685863876,0.4813652193718037,0.5064514971554173,3.2300970554351807,0.17352294921875
64,0.003,test,0.48610271903323266,0.47529722589167767,0.5005479572329955,3.2300970554351807,0.17499732971191406
64,0.1,train,0.4816704713307372,0.4769292503513048,0.4936271752957938,4.954359531402588,0.21456074714660645
64,0.1,dev,0.46153846153846156,0.4575088164983603,0.47319430396753964,4.954359531402588,0.17714309692382812
64,0.1,test,0.4818731117824773,0.47761045005479585,0.4934350471040482,4.954359531402588,0.1765117645263672
64,0.3,train,0.5219551497247213,0.5199857759185722,0.5302950555704684,6.66808295249939,0.2133195400238037
64,0.3,dev,0.5098670962545309,0.5083039509483801,0.517604665519976,6.66808295249939,0.17341089248657227
64,0.3,test,0.513595166163142,0.512184449951375,0.5209816128449782,6.66808295249939,0.17340350151062012
64,0.6,train,0.6250839264133208,0.5434499370334047,0.608181620577911,10.836875915527344,0.20669341087341309
64,0.6,dev,0.6270640354409988,0.5441424415838192,0.6093678312750662,10.836875915527344,0.17749381065368652
64,0.6,test,0.6335347432024169,0.5589710602597009,0.6197834688316441,10.836875915527344,0.1739668846130371
128,0.003,train,0.6355579427957567,0.5847458971300497,0.6334513397508827,15.331390380859375,0.22526264190673828
128,0.003,dev,0.6302859444220701,0.5818595467032966,0.629598232265117,15.331390380859375,0.18974709510803223
128,0.003,test,0.6280966767371601,0.5777453505831454,0.6266429639085666,15.331390380859375,0.19542694091796875
128,0.1,train,0.5958103934470257,0.5100934586138954,0.5788045938557338,4.508745431900024,0.21878767013549805
128,0.1,dev,0.6000805477245268,0.5105417528131821,0.5807732181249996,4.508745431900024,0.19577789306640625
128,0.1,test,0.6042296072507553,0.5194924645390071,0.5871602547620578,4.508745431900024,0.1952838897705078
128,0.3,train,0.5709681751040687,0.5417641973392001,0.5805526720620071,8.517917394638062,0.22217941284179688
128,0.3,dev,0.5646395489327426,0.5387744230863409,0.5754166847020767,8.517917394638062,0.2075657844543457
128,0.3,test,0.5604229607250756,0.5347877312356755,0.5714094876491042,8.517917394638062,0.2099614143371582
128,0.6,train,0.5878877400295421,0.5674168403556924,0.5989698258406324,9.842651844024658,1.057865858078003
128,0.6,dev,0.5722915827627869,0.5567460696338112,0.5845942684218471,9.842651844024658,0.2306654453277588
128,0.6,test,0.5749244712990936,0.5580380566873082,0.5870085670722878,9.842651844024658,0.20701074600219727
256,0.003,train,0.5552571505304149,0.5034712072669962,0.5572381512706371,9.312323570251465,1.6085247993469238
256,0.003,dev,0.5654450261780105,0.5156696717249917,0.5677587047141432,9.312323570251465,0.2645134925842285
256,0.003,test,0.5649546827794562,0.5150309475048269,0.5672111227918688,9.312323570251465,0.24126672744750977
256,0.1,train,0.6331408620921176,0.590185317771288,0.6346730797659424,15.218090057373047,0.3076636791229248
256,0.1,dev,0.6266612968183649,0.5853191879196481,0.6292451786245347,15.218090057373047,0.26799798011779785
256,0.1,test,0.6317220543806646,0.5914688679146899,0.6344727533595715,15.218090057373047,0.23840737342834473
256,0.3,train,0.5394118436954478,0.5270282531219248,0.5526895192315404,13.318384647369385,0.30249571800231934
256,0.3,dev,0.5344341522351993,0.5252691579461299,0.5473979702440858,13.318384647369385,0.23835468292236328
256,0.3,test,0.5211480362537765,0.5117593832311239,0.5344639689721791,13.318384647369385,0.24039316177368164
256,0.6,train,0.6444205720424332,0.5319110269823344,0.6088588040338455,23.574716091156006,0.2674102783203125
256,0.6,dev,0.6343133306484092,0.5278645213819261,0.6030739006177025,23.574716091156006,0.2379627227783203
256,0.6,test,0.6329305135951662,0.5282864505204843,0.6027924864492187,23.574716091156006,0.2446432113647461
512,0.003,train,0.46367664831475763,0.4636406607209914,0.4651137922231926,9.545398950576782,0.35259270668029785
512,0.003,dev,0.47402335884011276,0.47402259102587396,0.4738093946055559,9.545398950576782,0.30946850776672363
512,0.003,test,0.4743202416918429,0.4739974223188609,0.478367294318983,9.545398950576782,0.29798054695129395
512,0.1,train,0.634752249227877,0.5382103833084715,0.6090077516493689,20.26926064491272,0.35139989852905273
512,0.1,dev,0.6302859444220701,0.5381549002635649,0.6073570281121086,20.26926064491272,0.3477632999420166
512,0.1,test,0.6341389728096677,0.5348933003754006,0.606942153483338,20.26926064491272,0.3386085033416748
512,0.3,train,0.5917819256076272,0.537125515198246,0.5904576983917688,22.347639560699463,0.3092315196990967
512,0.3,dev,0.598872331856625,0.5460494724553404,0.5979992267425542,22.347639560699463,0.2948474884033203
512,0.3,test,0.6021148036253776,0.5451920575983434,0.5991495709117576,22.347639560699463,0.28122782707214355
512,0.6,train,0.6561031287766886,0.4934378119985894,0.5896878821395641,21.392276763916016,20.36923122406006
512,0.6,dev,0.6544502617801047,0.4889524842157784,0.5865176991563897,21.392276763916016,0.33330202102661133
512,0.6,test,0.6670694864048339,0.5039745999834642,0.5993567516840544,21.392276763916016,0.2972910404205322
