channels,drop,split,micro,macro,weight,train_time,inference_time
4,0.003,train,0.17384615384615384,0.11145679889460504,0.16936464076768862,0.7632477283477783,0.22784924507141113
4,0.003,dev,0.2073732718894009,0.1480757305635222,0.19583063792789968,0.7632477283477783,0.01978015899658203
4,0.003,test,0.21107266435986158,0.15625784770444948,0.20654350182758247,0.7632477283477783,0.01944732666015625
4,0.1,train,0.5246153846153846,0.4243178688860737,0.5219911969884485,2.017608880996704,0.05259084701538086
4,0.1,dev,0.46543778801843316,0.35648937835678973,0.4635277789043543,2.017608880996704,0.02204418182373047
4,0.1,test,0.5190311418685121,0.381797818781501,0.5055621806686498,2.017608880996704,0.021683216094970703
4,0.3,train,0.4338461538461538,0.35928435860441227,0.4578161540550119,1.2710542678833008,0.052431344985961914
4,0.3,dev,0.4792626728110599,0.3907373789210341,0.4920815368747844,1.2710542678833008,0.020496368408203125
4,0.3,test,0.4083044982698962,0.3373592559484064,0.43434699623967177,1.2710542678833008,0.020708799362182617
4,0.6,train,0.4738461538461538,0.1882965554003868,0.3580831262502504,1.6670091152191162,0.04431509971618652
4,0.6,dev,0.5253456221198156,0.2416998164014688,0.42627080642341036,1.6670091152191162,0.017304658889770508
4,0.6,test,0.5155709342560554,0.22542335846170655,0.4068968254778341,1.6670091152191162,0.017023324966430664
8,0.003,train,0.5061538461538462,0.3811893733302167,0.4921820600224619,1.6500604152679443,0.041473388671875
8,0.003,dev,0.5207373271889401,0.4002704348449029,0.5122006415760704,1.6500604152679443,0.016869306564331055
8,0.003,test,0.5121107266435986,0.3696192948301968,0.49948467381761263,1.6500604152679443,0.01645493507385254
8,0.1,train,0.4938461538461538,0.3950989986209037,0.4992734972702575,1.6315066814422607,0.04205799102783203
8,0.1,dev,0.4608294930875576,0.36836612667437274,0.46938527971413335,1.6315066814422607,0.016812801361083984
8,0.1,test,0.46020761245674746,0.3571865697497648,0.4634239578883254,1.6315066814422607,0.01650238037109375
8,0.3,train,0.38,0.2601640748550343,0.3815550869794412,0.7879641056060791,0.04253196716308594
8,0.3,dev,0.3640552995391705,0.25341129040882016,0.3642804586030351,0.7879641056060791,0.016918182373046875
8,0.3,test,0.39100346020761245,0.2733091787439614,0.38881533858215067,0.7879641056060791,0.01642608642578125
8,0.6,train,0.4153846153846154,0.3204216344992644,0.43821228120846056,1.0837647914886475,0.04241514205932617
8,0.6,dev,0.391705069124424,0.2910858123569794,0.41135481761908277,1.0837647914886475,0.016714811325073242
8,0.6,test,0.39100346020761245,0.3069947601499215,0.4127200453440557,1.0837647914886475,0.0166015625
16,0.003,train,0.1123076923076923,0.11214938050619301,0.08464061027426548,0.6102774143218994,0.04212045669555664
16,0.003,dev,0.12903225806451613,0.13020989505247377,0.08615231554729548,0.6102774143218994,0.01680612564086914
16,0.003,test,0.1245674740484429,0.1256362275449102,0.09608067601820582,0.6102774143218994,0.016646862030029297
16,0.1,train,0.56,0.39333023927605776,0.519815085250199,1.2318148612976074,0.04202389717102051
16,0.1,dev,0.5023041474654378,0.33506324404761906,0.4675728960939214,1.2318148612976074,0.01718902587890625
16,0.1,test,0.5536332179930796,0.3580026477193534,0.5036691297816192,1.2318148612976074,0.017056703567504883
16,0.3,train,0.5461538461538461,0.37798790827822193,0.5113981277309854,1.3760700225830078,0.04194450378417969
16,0.3,dev,0.4792626728110599,0.3096338560924816,0.44082378584482373,1.3760700225830078,0.016995668411254883
16,0.3,test,0.5155709342560554,0.33402548235235197,0.4730914855342058,1.3760700225830078,0.01670050621032715
16,0.6,train,0.48,0.4214857277243731,0.49341562341001444,1.5962920188903809,0.04160261154174805
16,0.6,dev,0.511520737327189,0.47109142888833766,0.5172830824600122,1.5962920188903809,0.01711559295654297
16,0.6,test,0.5051903114186851,0.4124671592775041,0.516621439650911,1.5962920188903809,0.01675248146057129
32,0.003,train,0.5,0.18724602203182375,0.3626007343941249,0.59763503074646,0.04283952713012695
32,0.003,dev,0.5069124423963134,0.18303571428571427,0.36160302830809743,0.59763503074646,0.017264842987060547
32,0.003,test,0.5017301038062284,0.1879432624113475,0.36324817786939556,0.59763503074646,0.016808509826660156
32,0.1,train,0.5707692307692308,0.42328970397991017,0.5358194259891239,1.9275646209716797,0.04629993438720703
32,0.1,dev,0.5668202764976958,0.4129384323704036,0.5289007435856228,1.9275646209716797,0.01888561248779297
32,0.1,test,0.5570934256055363,0.38446640513616837,0.5089745601951725,1.9275646209716797,0.018201828002929688
32,0.3,train,0.5169230769230769,0.25460584952733445,0.43996382008172696,0.8351514339447021,0.04414701461791992
32,0.3,dev,0.5023041474654378,0.24364460105713565,0.4284391996204797,0.8351514339447021,0.01832270622253418
32,0.3,test,0.5397923875432526,0.2733308806783343,0.46558835926049114,0.8351514339447021,0.018161296844482422
32,0.6,train,0.3123076923076923,0.2256383643747107,0.2751025343697956,0.9135441780090332,0.044120073318481445
32,0.6,dev,0.3317972350230415,0.24174347158218126,0.3140223831468071,0.9135441780090332,0.017546892166137695
32,0.6,test,0.3356401384083045,0.24533910285863003,0.29597697235852977,0.9135441780090332,0.01714634895324707
64,0.003,train,0.5938461538461538,0.47419794826424,0.5746610957714345,1.5919218063354492,0.04426312446594238
64,0.003,dev,0.5253456221198156,0.40026617526617525,0.5104179168695298,1.5919218063354492,0.018410444259643555
64,0.003,test,0.5501730103806228,0.3596038876550688,0.505522790819633,1.5919218063354492,0.017650604248046875
64,0.1,train,0.38769230769230767,0.2814294081552965,0.4044948301730808,1.1605350971221924,0.04408574104309082
64,0.1,dev,0.37327188940092165,0.2791933712485035,0.39829345340915645,1.1605350971221924,0.0181429386138916
64,0.1,test,0.35294117647058826,0.25204107383534374,0.3544648702201159,1.1605350971221924,0.017642974853515625
64,0.3,train,0.46,0.37690666061827616,0.45636064797613535,1.426647424697876,0.043792724609375
64,0.3,dev,0.4470046082949309,0.37756235030719576,0.43825982519863466,1.426647424697876,0.017814159393310547
64,0.3,test,0.4013840830449827,0.30748612898591793,0.3879666042954446,1.426647424697876,0.017358064651489258
64,0.6,train,0.5338461538461539,0.3708020595749679,0.4781403148848567,1.0460877418518066,0.04401540756225586
64,0.6,dev,0.5207373271889401,0.33666469544648137,0.47570357572074445,1.0460877418518066,0.01780390739440918
64,0.6,test,0.532871972318339,0.3803923063824054,0.47092488277523736,1.0460877418518066,0.017429828643798828
128,0.003,train,0.5507692307692308,0.48280594896478696,0.5570639712331517,1.9485499858856201,0.04460453987121582
128,0.003,dev,0.5069124423963134,0.4181162153031482,0.5084390548189088,1.9485499858856201,0.01864910125732422
128,0.003,test,0.4982698961937716,0.3599340152371499,0.4932612716708964,1.9485499858856201,0.018340349197387695
128,0.1,train,0.5046153846153846,0.37111916204614565,0.4874353994419542,1.2295842170715332,0.045111656188964844
128,0.1,dev,0.4884792626728111,0.3326803024920063,0.4679280869296145,1.2295842170715332,0.018526077270507812
128,0.1,test,0.47750865051903113,0.32098431892442014,0.4585352946180788,1.2295842170715332,0.01806473731994629
128,0.3,train,0.4646153846153846,0.3058565723761675,0.4416702645589341,1.0408365726470947,0.04442429542541504
128,0.3,dev,0.47465437788018433,0.32642777155655095,0.44948937202305694,1.0408365726470947,0.01850295066833496
128,0.3,test,0.45674740484429066,0.27985162727053203,0.4285488898806172,1.0408365726470947,0.018326520919799805
128,0.6,train,0.5061538461538462,0.2713739386988263,0.4206906538211683,1.1372132301330566,0.04650139808654785
128,0.6,dev,0.4884792626728111,0.24623230373230373,0.40263111696291415,1.1372132301330566,0.019011735916137695
128,0.6,test,0.5294117647058824,0.2716614780496307,0.4446651349694985,1.1372132301330566,0.019049406051635742
256,0.003,train,0.5061538461538462,0.34249108116365234,0.4405819513956377,1.3492927551269531,0.048342227935791016
256,0.003,dev,0.4884792626728111,0.32083333333333336,0.41912442396313365,1.3492927551269531,0.021052837371826172
256,0.003,test,0.5155709342560554,0.3386131865714443,0.4414746637612896,1.3492927551269531,0.020278453826904297
256,0.1,train,0.5384615384615384,0.4276907807300653,0.5223796941382037,1.8490731716156006,0.047911643981933594
256,0.1,dev,0.4700460829493088,0.3554390054390054,0.4642411352088771,1.8490731716156006,0.020914793014526367
256,0.1,test,0.5294117647058824,0.37598249550822666,0.5059839969969238,1.8490731716156006,0.021135330200195312
256,0.3,train,0.37846153846153846,0.26737255704129315,0.3555881015130218,2.2414705753326416,0.049349308013916016
256,0.3,dev,0.4009216589861751,0.2771279445192489,0.374339665543833,2.2414705753326416,0.020439624786376953
256,0.3,test,0.36678200692041524,0.234691366704162,0.33884807975992626,2.2414705753326416,0.01999974250793457
256,0.6,train,0.5092307692307693,0.1798656361795809,0.3503631124104499,0.912539005279541,0.04712677001953125
256,0.6,dev,0.5069124423963134,0.1909371492704826,0.35255007835652996,0.912539005279541,0.020366430282592773
256,0.6,test,0.5017301038062284,0.17248062015503876,0.34569888146777183,0.912539005279541,0.02013850212097168
512,0.003,train,0.5323076923076923,0.3848354227696695,0.5081054045036699,2.0550785064697266,0.8539714813232422
512,0.003,dev,0.5483870967741935,0.38379277339076334,0.5216159357242655,2.0550785064697266,0.02616429328918457
512,0.003,test,0.5467128027681661,0.36481481481481487,0.5166474432910418,2.0550785064697266,0.024663686752319336
512,0.1,train,0.5030769230769231,0.16995529603011636,0.34384612093929345,1.0250751972198486,0.05226612091064453
512,0.1,dev,0.511520737327189,0.16920731707317072,0.3462122063616949,1.0250751972198486,0.02447819709777832
512,0.1,test,0.5017301038062284,0.17790262172284646,0.3518525718284671,1.0250751972198486,0.023949384689331055
512,0.3,train,0.5138461538461538,0.3389686667069245,0.4907770705104296,2.229544162750244,0.05104565620422363
512,0.3,dev,0.5345622119815668,0.36885440399819414,0.5079854290729835,2.229544162750244,0.025061368942260742
512,0.3,test,0.5501730103806228,0.36993224751845444,0.5290360450961811,2.229544162750244,0.02467060089111328
512,0.6,train,0.5523076923076923,0.38380115592063524,0.5222663841098703,2.30098557472229,0.05002140998840332
512,0.6,dev,0.5299539170506913,0.3325958702064896,0.4977230401152753,2.30098557472229,0.025068283081054688
512,0.6,test,0.532871972318339,0.32362299758613117,0.4963526207446925,2.30098557472229,0.024478912353515625
