%YAML 1.1
%TAG !u! tag:unity3d.com,2011:
--- !u!114 &11400000
MonoBehaviour:
  m_ObjectHideFlags: 0
  m_CorrespondingSourceObject: {fileID: 0}
  m_PrefabInstance: {fileID: 0}
  m_PrefabAsset: {fileID: 0}
  m_GameObject: {fileID: 0}
  m_Enabled: 1
  m_EditorHideFlags: 0
  m_Script: {fileID: 11500000, guid: c47af038c40abfc40b27b9a79b9e1ce4, type: 3}
  m_Name: Wave 4
  m_EditorClassIdentifier: 
  enemyPrefab: {fileID: 5527662243490990525, guid: 4352032219c5f634fb8456666a50cb86,
    type: 3}
  pathPrefab: {fileID: 3064353042576910971, guid: d208fa48eedb46a48a37ae2116224069,
    type: 3}
  timeBetweenSpawns: 0.5
  spawnRandomFactor: 0.3
  numberOfEnemies: 5
  moveSpeed: 7
