@startuml MessageBus-based task distribution

title MessageBus-based task distribution

actor User
box NodeA
  participant TransformAPI
end box

box NodeB
  database FileStorage
  participant MessageBus
end box

box NodeC
  participant TransformationService
  participant TaskThreadPool
end box

box NodeD
  participant ContentStore
end box

User -> TransformAPI: file + commands
TransformAPI -> FileStorage: store file
TransformAPI -> MessageBus: send metadata message to Queue
TransformAPI -> User: 202 + ticketId
MessageBus -> TransformationService: new Task is received
TransformationService -> FileStorage: access file
TransformationService -> TaskThreadPool: process task
TaskThreadPool -> TransformationService: result
TransformationService -> ContentStore: store results
TransformationService -> MessageBus: task done. ACK message
MessageBus -> TransformAPI: task done
TransformAPI -> User: task done

@enduml