Hospitalized,Positive
142,2
197,6
178,-2
217,6
164,4
142,3
97,2
130,1
143,2
134,8
218,5
104,3
91,3
148,0
110,8
160,7
201,5
175,6
253,8
211,5
201,3
154,6
265,5
265,11
301,10
273,7
417,9
219,4
