<?xml version="1.0" standalone="no"?>
<!DOCTYPE svg PUBLIC "-//W3C//DTD SVG 20010904//EN"
 "http://www.w3.org/TR/2001/REC-SVG-20010904/DTD/svg10.dtd">
<svg version="1.0" xmlns="http://www.w3.org/2000/svg"
 width="260.000000pt" height="260.000000pt" viewBox="0 0 260.000000 260.000000"
 preserveAspectRatio="xMidYMid meet">
<metadata>
Created by potrace 1.11, written by Peter Selinger 2001-2013
</metadata>
<g transform="translate(0.000000,260.000000) scale(0.100000,-0.100000)"
fill="#000000" stroke="none">
<path d="M1115 2513 c-269 -165 -352 -201 -785 -335 -56 -17 -78 -29 -88 -48
-17 -32 -9 -398 12 -580 63 -530 231 -928 513 -1220 118 -122 236 -211 372
-278 81 -41 103 -47 155 -47 52 0 75 7 156 47 135 66 254 155 373 278 263 271
432 653 501 1130 34 230 47 623 23 670 -14 28 -37 37 -242 96 -241 69 -362
124 -638 291 -110 66 -146 83 -175 82 -28 0 -71 -21 -177 -86z"/>
</g>
</svg>
