<svg xmlns="http://www.w3.org/2000/svg" viewBox="0 0 284.44 426.52"><defs><style>
@keyframes dash {
  0% {
    stroke: #cf8604;
    stroke-dashoffset: 1000;
  }
  50% {
    opacity: 0.1;
  }
  90% {
    opacity: 0;
    stroke: #112d4e;
    stroke-dashoffset: 400;
  }
  100%{
    opacity: 0;
    stroke: none;
  }
}
.cls-1 {
  fill: none;
  stroke: none;
  stroke-miterlimit: 10;
  stroke-dasharray: 1000;
  stroke-dashoffset: 1000;
  animation: dash 4s linear forwards;
}
</style>
</defs><title>Mobile Background</title><g id="Layer_2" data-name="Layer 2"><g id="Layer_1-2" data-name="Layer 1"><path class="cls-1" d="M192.74.5h91.2V426H.5V370.1c.83,0,1.67.08,2.5.17,2.37.24,4.75.76,7.05-.5.24-.13.89.15,1.15.42.77.81,1.42,1.73,2.15,2.58a4.37,4.37,0,0,1,1.07,3.67c-.38,2.73-.77,5.45-1.1,8.18a43.91,43.91,0,0,0,1.44,18.26c1.61,5.31,3,10.7,4.29,16.09a62.73,62.73,0,0,1,.91,6.72h1.86a40.63,40.63,0,0,0-.58-5.33c-1.53-6.29-3.29-12.51-4.79-18.8A48.06,48.06,0,0,1,15,392.37a90.12,90.12,0,0,1,.56-10.88c.16-1.88.59-3.74.94-5.8,1.45,1.06,2.67,2,4,2.88,3.17,2.14,6.14,4.85,9.62,6.22,6,2.36,11.11,6.1,16.87,8.74-.15.48-.31.93-.45,1.39a4,4,0,0,0,1.72,4.9A14,14,0,0,1,52,403.4a4.29,4.29,0,0,0,4.45,1.73A8.15,8.15,0,0,0,63,400.36a35.86,35.86,0,0,0,1.64-4.88,28.73,28.73,0,0,1,4-9.25c1.54,1.73,3,3.39,4.49,5.1a1.25,1.25,0,0,1,.13,1.13,9.27,9.27,0,0,0-.41,7.44,84.89,84.89,0,0,1,3.3,17.39c.28,2.84.94,5.64,1.42,8.4h1.81c-.65-4.7-1.14-9.35-2-13.94s-1.93-8.81-2.94-13.2a6.61,6.61,0,0,1,.58-5.12c1.11,2,2.15,3.68,3,5.45,1,2,1.72,4,2.63,6a7.46,7.46,0,0,0,4,4c4.36,1.76,7.49,4.86,10.19,8.63a63.67,63.67,0,0,0,6.13,7c1.41,1.45,3.2,1.64,5.32,1-4-1.77-6.83-4.78-9.26-8.23-.76-1.08-1.56-2.13-2.34-3.19a18,18,0,0,0-7.65-6.2,9.25,9.25,0,0,1-5.57-5.87c-.17-.49-.41-.95-.58-1.44-2.43-6.8-7.11-12-12.21-16.83a3,3,0,0,1-1.19-2.8c.18-1.22.3-2.47.6-3.66a41.45,41.45,0,0,1,6.77-14.2c2.34-3.24,4.7-6.47,7.2-9.58a25,25,0,0,1,3.71-3.32,1.12,1.12,0,0,1,1-.14,86,86,0,0,1,8.53,3.15c3.58,1.72,7.08,2.63,11.09,1.68a7.65,7.65,0,0,1,6.67,1.56,47.26,47.26,0,0,0,4.94,3.31c2.35,1.42,4.76,2.76,7.15,4.12,1.9,1.08,3.77,2.26,5.75,3.18,2.58,1.18,5.23,2.2,7.89,3.2a24.05,24.05,0,0,1,8,4.93c1.55,1.44,3.07,2.93,4.54,4.45a46.58,46.58,0,0,0,7.46,6.18,89.48,89.48,0,0,1,8.83,6.78c1.32,1.17,2.12,2.95,3.11,4.47a1.06,1.06,0,0,1,0,.87c-1.12,2.28-2.27,4.53-3.46,6.88-1.7-.61-3.63-1.15-5.43-2-4.4-2-8.76-4.11-12.33-7.51-1.85-1.77-3.72-3.53-5.68-5.17-2.69-2.25-5.48-4.41-8.25-6.57-.53-.42-1.31-.6-1.62.17-.14.36.23,1.1.59,1.43.79.72,1.77,1.24,2.59,1.94,3.9,3.37,7.76,6.79,11.68,10.14,1.69,1.44,3.51,2.73,5.27,4.09-1.56,5.66-7.34,10.51-13,11.07-1.3-1.54-2.44-3.1-3.78-4.45a47.31,47.31,0,0,0-4.36-3.75c-.59-.48-1.4-1.4-2.1-.31s.47,1.39,1,1.94c2.2,2.14,4.51,4.18,6.52,6.48,1.59,1.8.7,5.22-1.41,6.48a7,7,0,0,1-7.1.31c-2-1-3.76-2.41-5.64-3.63-.58-.38-1.29-.65-1.63.11a1.61,1.61,0,0,0,.54,1.45c2.9,2,5.52,4.54,9.5,4.76-2.65,2.91-6.22,2.93-9.79,3.93,2.67,0,5,0,7.31,0a1.87,1.87,0,0,0,1.11-.34c1.38-1.14,2.71-2.33,4.06-3.5a1.83,1.83,0,0,1,.64-.45c2.82-.7,4.29-2.69,4.94-5.33a2.46,2.46,0,0,1,2.15-2.13c6.36-1.54,10.43-5.72,12.93-11.73l1,.44c2.94,1.24,5.85,2.53,8.82,3.71a2.74,2.74,0,0,1,1.79,1.69c1,2.64,3,3.23,5.35,1.75l1.18-.72c.21,5.74-2.18,11-1.76,16.56h1.77c.14-1.6.2-3.16.42-4.69.41-2.72,1-5.42,1.34-8.15.21-1.69.07-3.43.13-5.14,0-1,.13-1.88,1.54-1.91a5,5,0,0,0,2.09-.82,16.55,16.55,0,0,0,6.83-7.81,17.1,17.1,0,0,1,5.67-6.62,12.24,12.24,0,0,0,1.46,1.85,11.79,11.79,0,0,0,3.07,2.24,33.36,33.36,0,0,0,6.4,2,12.72,12.72,0,0,0,4-.38,5.75,5.75,0,0,0,1.27-.56,67.13,67.13,0,0,1,1.25,7.91,39.17,39.17,0,0,1-.57,7.39,20.2,20.2,0,0,0,2.7,13.46,2.29,2.29,0,0,0,3.07,1.17,9.74,9.74,0,0,0-.57-1,18,18,0,0,1-3.22-13.85c.48-3.07,1-6.17.35-9.3-.4-1.91-.72-3.85-1-5.77-.17-1,.25-1.37,1.21-1.14.45.1.84.49,1.29.58a7.67,7.67,0,0,0,2.54.29,9.78,9.78,0,0,0,2.45-.93,5.19,5.19,0,0,0,2.58-5.2,1.21,1.21,0,0,1,.48-1,27.58,27.58,0,0,1,3.41-1.09,3.23,3.23,0,0,0,2.74-3.42,11.31,11.31,0,0,0-.36-2.59c-.53-2.26-1.27-4.47-1.62-6.75a35.43,35.43,0,0,1-.26-6.1,6.38,6.38,0,0,0-3.88-6.21c-1.21-.62-2.36-1.34-3.52-2.06-2-1.25-3.72-2.58-4.18-5.29a3.31,3.31,0,0,0-5.28-2.05c-1.14.82-1.73.42-2.53-.31-3.5-3.18-6.95-6.41-11.23-8.55-.05,0-.06-.13-.12-.25.7.12,1.38.18,2,.35a11.11,11.11,0,0,0,9.24-1.47c3.14-2,6.86-3.16,9.93-5.26a102.65,102.65,0,0,1,12.87-7.38c4.69-2.31,9.25-4.89,13.84-7.4a17.63,17.63,0,0,0,2.59-1.91,1.8,1.8,0,0,0,.63-1c.39-2,.66-4.1,1.06-6.14.53-2.69.69-5.58,1.81-8,2.24-4.88,4-9.91,5.83-14.95s3.22-10.47,6.32-15.1c.69-1,.73-2.5,1.08-3.75a4.73,4.73,0,0,1,.52-1.51,11.25,11.25,0,0,0,2.36-8.67c-.39-2.72-.71-5.46-1.17-8.18A56.91,56.91,0,0,0,254,230.08a10.7,10.7,0,0,1-1.21-2.2c-2.53-6.41-5.72-12.57-7.47-19.29-.34-1.28-.8-2.52-1.19-3.77a17.73,17.73,0,0,0-5.08-8.15c-1.46-1.3-3-2.48-4.51-3.75a12.48,12.48,0,0,1-4.2-6.69c-1-4.44-1.47-9-2-13.5-.8-6.38-1.39-12.79-3.16-19-.7-2.51-1-5.09-2.6-7.37a48.32,48.32,0,0,1-6.17-11.89,13.65,13.65,0,0,0-7.28-8.08c-4.33-2-8.79-3.83-13.22-5.65a13,13,0,0,1-5.15-3.39,3.34,3.34,0,0,1-.87-2.76c.87-5.84,2.15-11.54,5.33-16.65a5.25,5.25,0,0,1,4-2.88,2.46,2.46,0,0,0,2.24-2.68c0-.6,0-1.2,0-1.8.28-3.54.8-6.94,3.55-9.65a10.14,10.14,0,0,0,2.09-3.85c1-2.83,1.7-5.74,2.57-8.61a19.16,19.16,0,0,0-.28-13,31.34,31.34,0,0,1-2-11.38,20.64,20.64,0,0,0-2.22-9.23,10.69,10.69,0,0,1-1.1-4.48A32.11,32.11,0,0,0,201.51,19a30.1,30.1,0,0,1-1.87-5.3C198.58,8.59,195.83,4.47,192.74.5ZM76,388.09c.21.23.55.81.74.76a1.94,1.94,0,0,0,1.24-.8c1-2.26,2-4.54,2.86-6.85,1.93-5.06,4.47-9.68,8.65-13.31,2.16-1.88,4.07-4.06,6.07-6.13a9.72,9.72,0,0,0,1.6-1.92c.19-.36-.08-1-.14-1.47-.46.12-1.06.08-1.35.36-3.32,3.34-6.69,6.64-9.84,10.14A27.66,27.66,0,0,0,81.54,375c-2,3.93-3.51,8.05-5.23,12.08C76.2,387.35,76.14,387.62,76,388.09Z"/><path class="cls-1" d="M192.74.5c3.09,4,5.84,8.09,6.9,13.15a30.1,30.1,0,0,0,1.87,5.3,32.11,32.11,0,0,1,2.55,11.39,10.69,10.69,0,0,0,1.1,4.48,20.64,20.64,0,0,1,2.22,9.23,31.34,31.34,0,0,0,2,11.38,19.16,19.16,0,0,1,.28,13c-.87,2.87-1.6,5.78-2.57,8.61A10.14,10.14,0,0,1,205,80.93c-2.75,2.71-3.27,6.11-3.55,9.65-.05.6,0,1.2,0,1.8a2.46,2.46,0,0,1-2.24,2.68,5.25,5.25,0,0,0-4,2.88c-3.18,5.11-4.46,10.81-5.33,16.65a3.34,3.34,0,0,0,.87,2.76,13,13,0,0,0,5.15,3.39c4.43,1.82,8.89,3.6,13.22,5.65a13.65,13.65,0,0,1,7.28,8.08,48.32,48.32,0,0,0,6.17,11.89c1.59,2.28,1.9,4.86,2.6,7.37,1.77,6.21,2.36,12.62,3.16,19,.57,4.52,1.07,9.06,2,13.5a12.48,12.48,0,0,0,4.2,6.69c1.48,1.27,3.05,2.45,4.51,3.75a17.73,17.73,0,0,1,5.08,8.15c.39,1.25.85,2.49,1.19,3.77,1.75,6.72,4.94,12.88,7.47,19.29a10.7,10.7,0,0,0,1.21,2.2,56.91,56.91,0,0,1,9.07,23.12c.46,2.72.78,5.46,1.17,8.18a11.25,11.25,0,0,1-2.36,8.67,4.73,4.73,0,0,0-.52,1.51c-.35,1.25-.39,2.71-1.08,3.75-3.1,4.63-4.47,10-6.32,15.1s-3.59,10.07-5.83,14.95c-1.12,2.43-1.28,5.32-1.81,8-.4,2-.67,4.1-1.06,6.14a1.8,1.8,0,0,1-.63,1A17.63,17.63,0,0,1,242,322.4c-4.59,2.51-9.15,5.09-13.84,7.4a102.65,102.65,0,0,0-12.87,7.38c-3.07,2.1-6.79,3.25-9.93,5.26a11.11,11.11,0,0,1-9.24,1.47c-.65-.17-1.33-.23-2-.35.06.12.07.23.12.25,4.28,2.14,7.73,5.37,11.23,8.55.8.73,1.39,1.13,2.53.31a3.31,3.31,0,0,1,5.28,2.05c.46,2.71,2.16,4,4.18,5.29,1.16.72,2.31,1.44,3.52,2.06a6.38,6.38,0,0,1,3.88,6.21,35.43,35.43,0,0,0,.26,6.1c.35,2.28,1.09,4.49,1.62,6.75a11.31,11.31,0,0,1,.36,2.59,3.23,3.23,0,0,1-2.74,3.42,27.58,27.58,0,0,0-3.41,1.09,1.21,1.21,0,0,0-.48,1,5.19,5.19,0,0,1-2.58,5.2,9.78,9.78,0,0,1-2.45.93,7.67,7.67,0,0,1-2.54-.29c-.45-.09-.84-.48-1.29-.58-1-.23-1.38.18-1.21,1.14.33,1.92.65,3.86,1,5.77.66,3.13.13,6.23-.35,9.3a18,18,0,0,0,3.22,13.85,9.74,9.74,0,0,1,.57,1,2.29,2.29,0,0,1-3.07-1.17,20.2,20.2,0,0,1-2.7-13.46,39.17,39.17,0,0,0,.57-7.39,67.13,67.13,0,0,0-1.25-7.91,5.75,5.75,0,0,1-1.27.56,12.72,12.72,0,0,1-4,.38,33.36,33.36,0,0,1-6.4-2,11.79,11.79,0,0,1-3.07-2.24,12.24,12.24,0,0,1-1.46-1.85,17.1,17.1,0,0,0-5.67,6.62,16.55,16.55,0,0,1-6.83,7.81,5,5,0,0,1-2.09.82c-1.41,0-1.51.92-1.54,1.91-.06,1.71.08,3.45-.13,5.14-.33,2.73-.93,5.43-1.34,8.15-.22,1.53-.28,3.09-.42,4.69h-1.77c-.42-5.57,2-10.82,1.76-16.56l-1.18.72c-2.4,1.48-4.34.89-5.35-1.75a2.74,2.74,0,0,0-1.79-1.69c-3-1.18-5.88-2.47-8.82-3.71l-1-.44c-2.5,6-6.57,10.19-12.93,11.73a2.46,2.46,0,0,0-2.15,2.13c-.65,2.64-2.12,4.63-4.94,5.33a1.83,1.83,0,0,0-.64.45c-1.35,1.17-2.68,2.36-4.06,3.5a1.87,1.87,0,0,1-1.11.34c-2.32,0-4.64,0-7.31,0,3.57-1,7.14-1,9.79-3.93-4-.22-6.6-2.77-9.5-4.76a1.61,1.61,0,0,1-.54-1.45c.34-.76,1-.49,1.63-.11,1.88,1.22,3.67,2.59,5.64,3.63a7,7,0,0,0,7.1-.31c2.11-1.26,3-4.68,1.41-6.48-2-2.3-4.32-4.34-6.52-6.48-.58-.55-1.71-.94-1-1.94s1.51-.17,2.1.31a47.31,47.31,0,0,1,4.36,3.75c1.34,1.35,2.48,2.91,3.78,4.45,5.67-.56,11.45-5.41,13-11.07-1.76-1.36-3.58-2.65-5.27-4.09-3.92-3.35-7.78-6.77-11.68-10.14-.82-.7-1.8-1.22-2.59-1.94-.36-.33-.73-1.07-.59-1.43.31-.77,1.09-.59,1.62-.17,2.77,2.16,5.56,4.32,8.25,6.57,2,1.64,3.83,3.4,5.68,5.17,3.57,3.4,7.93,5.5,12.33,7.51,1.8.83,3.73,1.37,5.43,2,1.19-2.35,2.34-4.6,3.46-6.88a1.06,1.06,0,0,0,0-.87c-1-1.52-1.79-3.3-3.11-4.47a89.48,89.48,0,0,0-8.83-6.78,46.58,46.58,0,0,1-7.46-6.18c-1.47-1.52-3-3-4.54-4.45a24.05,24.05,0,0,0-8-4.93c-2.66-1-5.31-2-7.89-3.2-2-.92-3.85-2.1-5.75-3.18-2.39-1.36-4.8-2.7-7.15-4.12a47.26,47.26,0,0,1-4.94-3.31,7.65,7.65,0,0,0-6.67-1.56c-4,.95-7.51,0-11.09-1.68a86,86,0,0,0-8.53-3.15,1.12,1.12,0,0,0-1,.14,25,25,0,0,0-3.71,3.32c-2.5,3.11-4.86,6.34-7.2,9.58a41.45,41.45,0,0,0-6.77,14.2c-.3,1.19-.42,2.44-.6,3.66a3,3,0,0,0,1.19,2.8c5.1,4.85,9.78,10,12.21,16.83.17.49.41.95.58,1.44a9.25,9.25,0,0,0,5.57,5.87,18,18,0,0,1,7.65,6.2c.78,1.06,1.58,2.11,2.34,3.19,2.43,3.45,5.24,6.46,9.26,8.23-2.12.63-3.91.44-5.32-1a63.67,63.67,0,0,1-6.13-7c-2.7-3.77-5.83-6.87-10.19-8.63a7.46,7.46,0,0,1-4-4c-.91-2-1.67-4.07-2.63-6-.86-1.77-1.9-3.45-3-5.45a6.61,6.61,0,0,0-.58,5.12c1,4.39,2.14,8.76,2.94,13.2s1.31,9.24,2,13.94H77.55c-.48-2.76-1.14-5.56-1.42-8.4a84.89,84.89,0,0,0-3.3-17.39,9.27,9.27,0,0,1,.41-7.44,1.25,1.25,0,0,0-.13-1.13c-1.44-1.71-3-3.37-4.49-5.1a28.73,28.73,0,0,0-4,9.25A35.86,35.86,0,0,1,63,400.36a8.15,8.15,0,0,1-6.47,4.77A4.29,4.29,0,0,1,52,403.4a14,14,0,0,0-3.82-3.58,4,4,0,0,1-1.72-4.9c.14-.46.3-.91.45-1.39-5.76-2.64-10.92-6.38-16.87-8.74-3.48-1.37-6.45-4.08-9.62-6.22-1.29-.87-2.51-1.82-4-2.88-.35,2.06-.78,3.92-.94,5.8A90.12,90.12,0,0,0,15,392.37a48.06,48.06,0,0,0,1.46,9.19c1.5,6.29,3.26,12.51,4.79,18.8a40.63,40.63,0,0,1,.58,5.33H20a62.73,62.73,0,0,0-.91-6.72c-1.31-5.39-2.68-10.78-4.29-16.09a43.91,43.91,0,0,1-1.44-18.26c.33-2.73.72-5.45,1.1-8.18a4.37,4.37,0,0,0-1.07-3.67c-.73-.85-1.38-1.77-2.15-2.58-.26-.27-.91-.55-1.15-.42-2.3,1.26-4.68.74-7,.5-.83-.09-1.67-.12-2.5-.17v-1.92c1.51.12,3,.22,4.52.38,1.85.2,3.73.23,5-1.29a24,24,0,0,0,3.29-4.91c2.71-5.72,5.11-11.6,9.35-16.72-1.16-.33-2.27-.74-3.42-.95a11.64,11.64,0,0,1-5.7-2.6c-4.33-3.72-8.7-7.41-13-11.11v-4.32c1.35-1.82,2.62-3.7,4.06-5.45,1.8-2.19,3.7-4.3,5.62-6.38a17.06,17.06,0,0,1,3.26-3c3.55-2.21,7.21-4.25,10.84-6.35.57-.33,1.16-.62,1.77-.94a13.11,13.11,0,0,1-.73-1.67c-1.18-4.13-2.73-8.22-3.4-12.44-1-5.93,1.7-11.15,4.36-16.25a3.68,3.68,0,0,0,.49-1.39,42.88,42.88,0,0,1,.33-5.58c.6-2.89,1.73-5.66,2.33-8.54A90.87,90.87,0,0,1,36.37,237a5.38,5.38,0,0,0,.25-4,87.43,87.43,0,0,0-7.78-19.16c-3-5.42-6.32-10.65-9.42-16-1.61-2.79-3-5.7-4.56-8.53a3.23,3.23,0,0,0-1.07-1c-.67-.43-1.45-.69-2.1-1.14-2.67-1.84-5.28-3.74-7.95-5.57-1-.72-2.16-1.3-3.24-2v-2.4c1.77,1.15,3.55,2.29,5.32,3.45,3.4,2.24,6.81,4.46,10.19,6.73a77.26,77.26,0,0,1,6.57,4.6C27.46,196,32.21,200.2,37,204.34a29,29,0,0,0,7.9,5c0-2.8,1.74-4.7,3.21-6.73q1.48-2,2.83-4.17a2.32,2.32,0,0,0,.37-1.32c-.19-2.26-.36-4.53-.69-6.77-.64-4.3-1.21-8.62-2.11-12.87-2.13-9.95-4.66-19.82-6.59-29.81-1.48-7.65-3.23-15.14-6.61-22.2-.87-1.82-1.5-3.75-2.3-5.8-.72.42-1.43.76-2.07,1.21-3.12,2.16-6.26,4.31-9.32,6.54a25.38,25.38,0,0,0-3.81,3.27c-4.37,4.78-8.64,9.64-13,14.46Q2.7,147.59.5,150V146.9a.68.68,0,0,0,.21-.1c4.78-5.27,9.5-10.59,14.34-15.8a58,58,0,0,1,5.86-5.44c1.82-1.49,3.92-2.62,5.77-4.08a30.69,30.69,0,0,1,10.8-5.56c5.57-1.55,11.17-3,16.76-4.52a13.57,13.57,0,0,0,5.81-3,34.88,34.88,0,0,1,11-6.91,21,21,0,0,0,9.43-6.67,11.6,11.6,0,0,0,2.88-7.18c0-5.26-.4-10.54,1-16.09-4.17,2.43-8.19,4.49-11.91,7A65.34,65.34,0,0,1,61,85.26a12.53,12.53,0,0,0-2.39,1.35C52.49,90.83,46.31,95,40.3,99.35a262.28,262.28,0,0,1-25.92,16.83c-4.25,2.38-8.74,4.36-12.57,7.45a4.42,4.42,0,0,1-1.31.47v-1.92c2.1-1.39,4.13-2.89,6.31-4.14,4.7-2.73,9.65-5.06,14.19-8,9.13-6,18-12.25,27.06-18.4C51.89,89,55.53,86,59.61,83.89a97.71,97.71,0,0,0,12.72-7.62A27.78,27.78,0,0,1,75,74.63c3-1.72,6.08-3.38,9.06-5.16a3.36,3.36,0,0,0,1.33-1.72c.5-1.51.73-3.1,1.17-4.63a33,33,0,0,0,1.07-13.4c-.32-2.61-.67-5.23-.73-7.85a6.77,6.77,0,0,1,3.93-6.38c.8-.43,1.57-.9,2.55-1.45-1.4-.93-2.64-1.66-3.77-2.53a26.91,26.91,0,0,1-3.79-3.26,3.57,3.57,0,0,1-.73-2.52,19.69,19.69,0,0,1,1.08-3.59c.59-1.81,2.11-2.75,3.54-3.78a22.46,22.46,0,0,0,3.61-2.75C94.81,13.93,96,12,97.44,10.2s2.86-3.32,4.31-5c1.15-1.3,2.33-2.58,3.48-3.89a3.8,3.8,0,0,0,.39-.84H109a24.05,24.05,0,0,1-.65,4.09c-.61,1.85-1.59,3.57-2.29,5.4a24.16,24.16,0,0,0-1.16,8.53l.82-.15c2.83-.67,4.49-.1,6.09,2.32a29.43,29.43,0,0,1,2,3.83c1.07,2.32,2,4.72,3.13,7a16.79,16.79,0,0,1,1.91,6.74c.16,3.16-.91,5-3.86,6.15a9.11,9.11,0,0,1,.14,1.17c0,1.3.54,1.87,2,2.07A5.81,5.81,0,0,1,121.92,52c.27.86.52,1.73.79,2.66a11.14,11.14,0,0,1,6.55.77c8.1,2.94,16.16,6,24.79,7.25,2.63.37,5.13,1.64,7.75,2,3.74.56,7.55.72,11.33,1,4.06.29,8.13.51,12.2.76a65.17,65.17,0,0,0,6.68.37c2.87-.11,5.72-.61,8.59-.84a5.58,5.58,0,0,0,5.15-3.82c.59-1.48,1.32-2.9,1.92-4.37a2,2,0,0,0,0-1.24,38.34,38.34,0,0,1-1.49-4.79c-.42-2.76-.51-5.56-.78-8.34a18.52,18.52,0,0,0-2-7.59A13.51,13.51,0,0,1,202,30.12a36.71,36.71,0,0,0-1.13-6.93c-1-3.53-2.41-6.94-3.5-10.44A23.05,23.05,0,0,0,194,5.53c-1.27-1.69-2.57-3.35-3.86-5ZM137.63,192.84l-1.27.5a7.8,7.8,0,0,1-5.75.29c-2.84-1.14-5.62-2.45-8.37-3.8-2.15-1.06-4.19-2.33-6.31-3.44a2.25,2.25,0,0,0-1.45-.1,23.23,23.23,0,0,1-11.14.57c-4.18-.88-7.43-3.41-10.61-6.05a28.56,28.56,0,0,1-10-15.94,9,9,0,0,1,1-7.25c1-1.49.93-3.14.6-5-1,.78-1.85,1.41-2.66,2.1-2.85,2.39-5.64,4.86-8.53,7.2s-3,2.35-2.37,6.12c.5,2.87,1.37,5.68,1.71,8.57.69,5.9,1.07,11.85,1.71,17.76.86,7.86,1.69,15.73,2.85,23.55,1.09,7.39,2.48,14.73,2.54,22.24,0,2.63.29,5.26.49,7.89.36,4.66.8,9.32,1.1,14,.18,2.71.11,5.44.28,8.15.06,1,.17,2.32.81,2.86a46.42,46.42,0,0,1,8.22,9.8,10.6,10.6,0,0,0,.85,1c.74-.56,1.4-1,2-1.52a21.7,21.7,0,0,1,9.73-4.66,95.15,95.15,0,0,0,13.84-3.32,22.91,22.91,0,0,1,11-.68c1.56.22,3,.93,4.61,1.18,4,.66,7.85-.78,11.82-1.46-.42-.66-.81-1.3-1.23-1.92-2.62-3.85-2.67-7.75-.61-11.9,1.56-3.14,2.83-6.43,4.1-9.7,2.37-6.15,4.31-12.49,7.77-18.16a13.18,13.18,0,0,0,1.77-7.46c-.1-3.9-.5-7.8-.79-11.71a15.26,15.26,0,0,0-.32-2.61c-.47-1.9-1.61-2.61-3.53-2.29a4.49,4.49,0,0,1-3.66-.74,20.38,20.38,0,0,1-3.85-3.55c-1.79-2.44-3.31-5.08-4.91-7.66C138.58,194.77,138.15,193.82,137.63,192.84Zm-28.37-77.15c.22-.24.27-.26.28-.3,0-.55,0-1.11.13-1.66.68-3.87,2.53-6.92,6.31-8.42a9.24,9.24,0,0,1,10,1.84c4.05,3.54,5.56,8.33,6,13.45a22.55,22.55,0,0,1-.66,9.34,14.5,14.5,0,0,1,8.52,1.42,8.15,8.15,0,0,0,4.08.43c2.37-.28,4.71-.87,7.06-1.36a48.52,48.52,0,0,1,20.57-.11c2.3.51,4.6,1,6.87,1.58a3.46,3.46,0,0,1,1.61.94c1.13,1.2,1.56,1.4,2.56.11a79.87,79.87,0,0,0,4.74-7,5.33,5.33,0,0,0,.5-2.51c.06-2.23,0-4.47,0-6.71a40.3,40.3,0,0,1,5.71-19.92c1.13-1.87,2.47-3.33,4.81-3.52.68,0,1-.44,1-1.2a28.81,28.81,0,0,1,.22-3.34c.34-2.88.8-5.7,2.93-8a1.64,1.64,0,0,0-.65-2.66,7.1,7.1,0,0,0-5.15-.26,17.16,17.16,0,0,1-8.49.89c-1.25-.23-2.46-.7-3.72-.92-2.63-.44-5.27-.91-7.93-1.15a60.11,60.11,0,0,1-9.61-1.92c-3.71-1-7.52-1.49-11.26-2.34-4.63-1.06-9.21-2.34-13.84-3.35a27.55,27.55,0,0,0-12.12-.4c-1.67.38-1.65.42-1.54,2.12a5.56,5.56,0,0,1-2.76,5.59c-2.1,1.24-4.35,1.75-6.61.56a18.1,18.1,0,0,1-6.27-4.71A8.55,8.55,0,0,0,111,71a6.12,6.12,0,0,0-.4.59,4.65,4.65,0,0,0-.28.79c-1,4.64-2.1,9.27-2,14.07.11,9.2.16,18.39.28,27.59A5.15,5.15,0,0,0,109.26,115.69Zm46.16,162a8.48,8.48,0,0,0,2.62-.86c1.24-1.08,2.19-2.49,3.43-3.57,3.46-3,7.69-4.5,11.9-6.05,2.74-1,5.44-2.09,8.15-3.17a6.49,6.49,0,0,0,3.83-4c4.74-12.47,9.66-24.87,14.32-37.37,2.71-7.26,4.94-14.68,7.58-22a179.67,179.67,0,0,0,6.51-22,4.74,4.74,0,0,0-1.07-4.76c-2.7-3.1-5.13-6.44-7.65-9.69-3.69-4.75-8.61-8.08-13.36-11.6-1.07-.79-2.15-1.56-3.23-2.35a.74.74,0,0,0,.14.64A10.64,10.64,0,0,1,190.92,161a3.88,3.88,0,0,0,.88,3.47,9.92,9.92,0,0,1,1.67,3,9.24,9.24,0,0,1-1.14,7.14,26.18,26.18,0,0,1-8.23,9.5,3.75,3.75,0,0,0-1.22,1.65c-1.74,4.5-3.16,9.16-5.2,13.51-3.51,7.49-7.53,14.73-11.09,22.19-3.34,7-6.32,14.24-9.54,21.34a13.05,13.05,0,0,0-.91,6.78,54,54,0,0,1,.31,7.29c-.2,3.87-.78,7.71-1,11.57C155.28,271.33,155.42,274.29,155.42,277.67Zm18.41,99.55a6.84,6.84,0,0,1-.71-.46L161.7,366.37c-.15-.14-.31-.32-.48-.34-1.57-.22-2.29-1.48-3.22-2.52a2.49,2.49,0,0,0-1.34-.85c-2.34-.36-3.17-1.21-3.54-3.61a5.7,5.7,0,0,0-.74-2.24c-2.46-3.69-4.84-7.46-8.61-10-.56-.38-1.08-.83-1.61-1.25-3-2.37-6-4.72-9-7.13-2.51-2-4.95-4.14-7.43-6.21-1.07-.9-2.09-1.88-3.23-2.67-6.31-4.36-12.91-8.29-18.83-13.23a55.78,55.78,0,0,0-6.87-4.35c-1.73-1.07-3.58-2-5.2-3.18a26.47,26.47,0,0,0-7.28-3.84c-4.12-1.4-8.25-2.8-12.39-4.14a36,36,0,0,0-12.61-1.93c-2.43.09-4.88-.15-7.31-.06a39.58,39.58,0,0,0-7.48.69c-10.6,2.5-20,7.68-29.17,13.38a20,20,0,0,0-3.82,3.43c-2.24,2.38-4.44,4.82-6.53,7.34a49.32,49.32,0,0,0-2.83,4.27c-.67,1-.26,1.77.57,2.46C5,332.22,7.21,334.1,9.45,336l4.35,3.64a2.68,2.68,0,0,0,.23-.3c.3-.47.62-.93.88-1.43a36.31,36.31,0,0,1,7.71-10c4-3.7,8.29-6.88,13.84-8,4.78-.93,9.53-2,14.27-3.13a56.43,56.43,0,0,1,10.67-1.42,15.46,15.46,0,0,1,9,2.49c5.08,3.1,10.28,6,15.37,9.09,3.15,1.89,6.22,3.91,9.28,5.94,2.39,1.59,4.67,3.37,7.08,4.93,6,3.88,12,7.61,17.93,11.55s11.57,8,17.38,11.95a12,12,0,0,0,3.81,1.91,5.77,5.77,0,0,1,3,1.7,7.21,7.21,0,0,0,2.65,1.91,8.21,8.21,0,0,1,4.42,3.3c.8,1.17,1.51,2.46,3.11,2.78a1.43,1.43,0,0,1,.74.58,7.08,7.08,0,0,0,3.5,2.18,12.64,12.64,0,0,1,5.19,3.11A28.86,28.86,0,0,0,167.7,382a1.37,1.37,0,0,0,1.3-.07C170.59,380.45,172.09,378.92,173.83,377.22ZM102.32,312.9c.14-.07.23-.09.28-.15,7.68-7.62,17.38-12,26.86-16.69.61-.29,1.28-.51,1.68.25s-.2,1.16-.79,1.47c-1.77.93-3.49,2-5.32,2.75a71.62,71.62,0,0,0-20.24,12.89,5.17,5.17,0,0,1-1.06.58c4,3,7.68,5.62,11.31,8.3a1.14,1.14,0,0,0,1.65-.06c5.54-4.54,11.15-9,17.5-12.37a25.69,25.69,0,0,0,2.75-1.93c.13-.09.24-.21.37-.3.56-.44,1.19-.9,1.76-.15s0,1.25-.57,1.69a5.92,5.92,0,0,1-.57.45c-2.11,1.37-4.15,2.87-6.35,4.07-5.06,2.76-9.24,6.68-13.82,10.23,2.29,1.56,4.57,3,6.68,4.6a2,2,0,0,0,2.74.05A52.92,52.92,0,0,1,132,325.5c4.09-2.09,8.35-3.86,12.36-6.08,6.77-3.76,14-6.41,21.12-9.41a13.49,13.49,0,0,0,6.21-5.33A8.38,8.38,0,0,1,173,302.8c1.16-1,1-2.08.54-3.32a44.08,44.08,0,0,0-14.2-19.82,2.57,2.57,0,0,0-1.72-.46,10.76,10.76,0,0,1-6.26-1.19,31,31,0,0,0-3.84-1.67c-1.85-.62-3.68-1.23-5.72-.58-4.19,1.34-8.43,1.71-12.67.09a6.21,6.21,0,0,0-1.29-.3,27.45,27.45,0,0,0-13.54,1.53,51,51,0,0,1-6.86,1.61c-4,.76-8,1.52-11.42,4-1.6,1.19-3.18,2.43-4.76,3.65-2.16,1.68-4.26,3.44-6.48,5.05-3.24,2.35-4.76,5.86-6.61,9.25,3,1.06,5.82,2,8.58,3.13,1.42.59,2.43.82,3.8-.27,2.33-1.86,5-3.27,7.36-5.12,5.92-4.67,12.56-8.07,19.28-11.36.34-.17.91.13,1.37.21-.14.48-.16,1.09-.47,1.41a5.71,5.71,0,0,1-1.66.93,90.33,90.33,0,0,0-15.33,8.88c-3.23,2.42-6.27,5.11-9.94,6.89-.11.06-.17.23-.27.36C94.24,309,98.65,310.38,102.32,312.9ZM240,287c.62-.9,1.2-1.65,1.68-2.46a19.83,19.83,0,0,1,8.88-8.28,28.32,28.32,0,0,0,8.65-6.16c2.16-2.25,3.51-4.84,3.07-8.11-.27-1.94-.47-3.88-.73-5.82a57.5,57.5,0,0,0-5.35-18.2c-1.38-2.78-3.33-5.28-4.62-8.09-2.43-5.32-4.77-10.71-6.74-16.21A5.11,5.11,0,0,0,241,210c-2.77-.78-3.68-.4-5.3,2a36.6,36.6,0,0,1-3.26,4.28c-3.05,3.38-6.2,6.67-9.29,10-2,2.17-4,4.33-6,6.56-3.83,4.4-7.57,8.88-11.44,13.24a7,7,0,0,1-2.8,1.71c-3.27,1.2-6.69,1-10.08.81a1,1,0,0,0-1.22.79c-1.62,4.09-3.28,8.15-4.93,12.23a7.18,7.18,0,0,0-.19.72,8.36,8.36,0,0,0,1.36.29q6.17.29,12.32.52a58.85,58.85,0,0,1,6.1.18,20.11,20.11,0,0,1,5.26,1.48c4.5,2,8.94,4.06,13.37,6.18a11.75,11.75,0,0,1,3.16,2.12c1.86,1.86,3.59,3.86,5.3,5.86C235.62,281.6,237.76,284.23,240,287ZM28.52,270.66a75,75,0,0,1,6.72-4.59c6.31-3.38,13-5.23,20.27-4.47,6.58.68,12.79,2.32,18.35,6.06,1.74,1.17,3.63,2.11,5.7,3.29-.15-3.8-.21-7.38-.44-10.95q-.63-9.69-1.42-19.36c-.38-4.89-.69-9.81-1.33-14.67-.91-6.89-2.32-13.71-3.1-20.61-1-8.53-1.36-17.12-2.3-25.65-.51-4.56-1.65-9.05-2.53-13.7-1.23,1.4-1.52,3.05-1.94,4.67A32.52,32.52,0,0,1,65,175.44c-1.17,2.75-2.65,5.38-3.73,8.16A54.53,54.53,0,0,1,55,195.85c-2.35,3.28-4.57,6.66-6.86,10-.81,1.17-1.58,2.43-1.23,3.88.71,2.92-.14,5.37-1.69,7.81a21.71,21.71,0,0,0-2.5,5.4c-1.78,6-3.24,12-5.77,17.75a73.38,73.38,0,0,0-3.37,9.2c-1.62,5.56-3,11.18-4.45,16.78C28.83,268,28.73,269.32,28.52,270.66ZM87.5,145l-.37-.21-3.66.61c-5,.83-7.8-1.4-8.43-6.45-.49-4-1.26-7.88-2-11.79-.87-4.41-1.66-8.83-.72-13.31.48-2.3,1.29-4.53,1.94-6.79a7.65,7.65,0,0,0,0-4.8C70,104.07,66,105.86,62.6,108.88a16.88,16.88,0,0,1-7.73,4.38c-1.68.36-3.34.81-5,1.27-4.61,1.3-9.21,2.65-13.82,3.93-1,.28-1.14.72-.75,1.63.7,1.61,1.22,3.3,2,4.89a77.78,77.78,0,0,1,5.54,16.68c2.11,10.17,4.31,20.31,6.46,30.47.75,3.55,1.53,7.1,2.18,10.67.7,3.87,1.28,7.75,1.93,11.82.27-.28.4-.37.46-.5,1.58-3,3.25-6,4.71-9s2.85-6.41,4.21-9.65a28.75,28.75,0,0,0,1.8-5c.61-2.87,1.65-5.41,4-7.3s4.34-3.66,6.57-5.41c3.23-2.54,6-5.72,9.74-7.53a1.41,1.41,0,0,0,.57-.59C86.13,148.07,86.81,146.52,87.5,145ZM17.93,357.61a17.63,17.63,0,0,0,3.17,1.54c3.26.92,6.57,1.7,9.88,2.44a23.4,23.4,0,0,1,10.35,5,7.69,7.69,0,0,0,3.32,1.47,36.25,36.25,0,0,0,5,.56,4.44,4.44,0,0,1,3.55,1.71,41.44,41.44,0,0,1,3.63,5.87c1.45,3.12,3.07,6,5.77,8.27,1.81,1.49,2.1,1.5,3.55,0a17.21,17.21,0,0,1-.57-3.26,18.9,18.9,0,0,1,.56-4,43.11,43.11,0,0,1,7.22-15.29c2.34-3.23,4.69-6.47,7.19-9.59a18.36,18.36,0,0,1,3.74-3.46c1.94-1.36,2.37-2,1.36-4.23-1.55-3.4-3.26-6.71-7.31-7.85a23.28,23.28,0,0,1-3.4-1.5,3.57,3.57,0,0,0-3.33.07c-1.67.84-3.37,1.65-5.1,2.37-3.47,1.45-9-.75-9.89-4.41-.31-1.33-1.69-1.69-3.15-1.17-1.73.61-3.47,1.21-5.22,1.75a65.7,65.7,0,0,0-13.67,5.43C27.15,343.57,21,348.94,17.93,357.61ZM214.06,134.1l-.16,0a34.14,34.14,0,0,1,.91,4.43c.33,4.82.52,9.65.77,14.47.18,3.35.3,6.71.59,10.05.56,6.45.55,12.81-1.18,19.13s-3.79,12.62-5.78,18.9c-4,12.42-8.52,24.61-13.34,36.71-1.15,2.88-2.06,5.86-3.22,9.19,2.84-.18,5.42-.27,8-.54a6.63,6.63,0,0,0,4.53-2.39c2.52-3,5.15-5.91,7.69-8.89,2-2.4,4-4.87,6.09-7.26,2.51-2.9,5.11-5.72,7.61-8.62a3.44,3.44,0,0,0,.74-1.73c.21-1.66.34-3.34.43-5,.27-4.74.57-9.49.75-14.24a66.81,66.81,0,0,0,.06-9.8c-.77-7.18-1.83-14.33-2.92-21.48-.64-4.22-1.48-8.41-2.36-12.58a19.73,19.73,0,0,0-2.54-7.28,52.67,52.67,0,0,1-6.39-12.58A3.56,3.56,0,0,0,214.06,134.1ZM199.65,300.81c.82-.23,1.62-.48,2.43-.68,3-.77,6.07-2,9.17-2.18a66.72,66.72,0,0,0,19.27-4.54c2.31-.9,4.63-1.76,6.94-2.64.51-.2,1.45.16,1.26-.95-.1-.6,0-1.36-.37-1.78-3.52-4.24-7.07-8.46-10.7-12.6a10.67,10.67,0,0,0-3.21-2.45c-4.29-2.11-8.71-4-13-6.12-3.4-1.72-7-1.78-10.62-1.82-3,0-5.91.07-8.85-.1-2.13-.12-4.24-.6-6.37-.88a1.34,1.34,0,0,0-.73.21,48.45,48.45,0,0,1-4.33,2.28c-3.74,1.51-7.55,2.86-11.31,4.31a24,24,0,0,0-7.7,4.95,1.87,1.87,0,0,0,.79-.09,16.64,16.64,0,0,1,9.2-.6c5.48,1.33,11.18,1.75,16.79,2.52a1.92,1.92,0,0,1,1.66,1.13c2.39,4.74,4.43,9.67,7.58,14a3.49,3.49,0,0,1,.42,1.57C198.29,296.54,198.33,298.8,199.65,300.81Zm2,41.23c2.21-1.1,4-2,5.83-2.91a52.92,52.92,0,0,0,6.87-3.65A81.44,81.44,0,0,1,227,328.19c3.63-1.74,7.08-3.86,10.61-5.79,1.58-.86,3.18-1.67,4.77-2.51a1.89,1.89,0,0,0,1-2.18c-.57-4.47-1.07-9-1.57-13.44-.29-2.66-.36-5.35-.82-8-.72-4.11-1.39-4.43-5.29-2.85a90.55,90.55,0,0,1-15.66,5.23,74.29,74.29,0,0,1-8.42,1.1c-4,.34-7.64,2-11.45,3-.06,0-.09.12-.2.28.23.68.52,1.42.75,2.18.86,2.9,2.11,5.76,2.47,8.72.86,7.07-.16,14.12-.81,21.15C202.23,337.31,202,339.52,201.7,342Zm-36.82-18.55c-3.1,4-6,7.88-9.12,11.61s-6.49,7.3-9.81,11c2.77,2,4.52,4.56,6.38,7.08a12.84,12.84,0,0,1,2.87,6.18c.09.82.6,1.21,1.53,1.38a5.45,5.45,0,0,1,2.56,1.28c.93.81,1.46,2.08,2.92,2.28.34.05.63.47.92.74,2.2,2.14,4.38,4.31,6.61,6.43.77.74,1.64,1.36,2.63,2.17,1.14-1.77,2.34-3.33,3.24-5a48.12,48.12,0,0,1,10.28-13.75,40.3,40.3,0,0,0,4.14-4.33c1.2-1.51,2.15-3.22,3.29-5-.87-.37-1.46-.59-2-.87-.38-.2-.92-.4-1-.73-.66-1.76-2.18-2.64-3.59-3.56a130.2,130.2,0,0,1-19.76-15.14C166.36,324.74,165.77,324.27,164.88,323.49ZM96.6,40.83c-.18.14-.27.17-.3.24-2,3.28-3.7,6.73-6.52,9.43-.15.14-.15.52-.11.77.81,5.64-1,10.93-2.13,16.3C87,70,86,72.31,85.77,74.73c-.4,4-.35,8-.49,12a20.38,20.38,0,0,1-.2,3.23c-1,4.83-4.45,7.88-7.91,10.91-.5.44-.82.74-.78,1.43a14.23,14.23,0,0,1,0,3.45c-.42,2.11-1.06,4.17-1.65,6.24a17.93,17.93,0,0,0-.83,7.92c.45,2.84,1,5.66,1.45,8.49.59,3.7,1.18,7.41,1.69,11.12.37,2.72,2,4.23,4.65,4.07a35.9,35.9,0,0,0,4.61-.71,1.13,1.13,0,0,0,.73-.82c-.16-4.18-.19-8.39-.63-12.55-.42-4-.93-7.91-.38-11.93a78.59,78.59,0,0,1,3.79-15,41.82,41.82,0,0,0,1.82-6.45c1.28-7.32,2.43-14.66,3.59-22C96,69.34,97,64.56,96.72,59.63c-.19-3.51-.1-7-.12-10.54C96.59,46.38,96.6,43.67,96.6,40.83Zm4.52-4c-.85.59-1.58,1.07-2.26,1.61a1,1,0,0,0-.27.7c0,4.16-.1,8.31-.12,12.47,0,2.28-.11,4.57.07,6.83A43.46,43.46,0,0,1,98,69.07c-1,6-2,12-3,18-.75,4.37-1.56,8.72-2.33,13.08a2.45,2.45,0,0,0,.08,1,25.26,25.26,0,0,0,4.25,9.18,5.26,5.26,0,0,1,1,4,14.94,14.94,0,0,0,0,3.78c.17,1.13,1,1.29,1.79.45a10.16,10.16,0,0,0,.94-1.38,1.49,1.49,0,0,1,2.59-.25,8.51,8.51,0,0,1,1.26,2c1.75,3.55,3.42,7.14,5.19,10.67a11.05,11.05,0,0,0,1.86,2.64c4.27,4.51,9.65,7.54,14.77,11.2a10.36,10.36,0,0,0,1.26-1.77c1-2.4,2.49-3.59,5.11-3.49a32.58,32.58,0,0,1,5.53.85,6.18,6.18,0,0,0,3.51-.19,79.66,79.66,0,0,1,8.1-2.49,53.31,53.31,0,0,1,7.48-1,42.2,42.2,0,0,1,18.1,2.76,6.06,6.06,0,0,1,3.41,2.86c.22.4.5.77.75,1.15l.46-.09a34.27,34.27,0,0,0-.1-6,4.13,4.13,0,0,0-2.32-2.32,33.27,33.27,0,0,0-4.41-1,41.41,41.41,0,0,0-9.2-1.51,57.44,57.44,0,0,0-16.37,1.82c-3.61.9-7.08,1.12-10.6-.67a7.31,7.31,0,0,0-7.84.64,7.06,7.06,0,0,1-6.12,1.34c-5.43-1.55-9.57-4.54-11.42-10.12a22.27,22.27,0,0,0-5.29-9,8.38,8.38,0,0,1-2.4-4.47,47.87,47.87,0,0,0-1.35-5.83,40.89,40.89,0,0,1-1.56-17.17,65,65,0,0,0,.43-10.53,24,24,0,0,1,4.7-15.73,3.24,3.24,0,0,0,.4-2,33.07,33.07,0,0,1-.56-4.37,4.34,4.34,0,0,0-1-2.93,22.46,22.46,0,0,1-3.69-9A49.8,49.8,0,0,1,101.12,36.83Zm75.7,294.34,7.54,5.41c2.14,1.53,4.28,3.07,6.44,4.58a1.81,1.81,0,0,0,.84.3c1.46.17,2.94.27,4.4.45,1.28.15,2.55.38,3.91.59,0-1.12-.07-2,0-2.94.49-5.65,1.15-11.29,1.47-16.95a44.14,44.14,0,0,0-.39-10c-.65-3.65-2.07-7.17-3.13-10.75-.56-1.9-1.14-3.79-1.61-5.72-.36-1.49-.75-2-2.27-1.79-2.6.38-5.17,1-7.74,1.49-.33.06-.86.29-.9.5-.18,1.21-1.23,1.36-2,1.8-1.55.83-3.13,1.61-4.66,2.47a13.32,13.32,0,0,0-5,4.55c-.52.85-.34,1.27.4,1.73,1.83,1.15,3.7,2.23,5.44,3.5,3.3,2.39,6.54,4.86,9.76,7.36,1,.79,1,1.39.12,2.18-2.12,1.94-4.28,3.83-6.43,5.75Zm37.53-158.3.25-.08c0-.79,0-1.59,0-2.38q-.53-11.85-1.06-23.7a43.56,43.56,0,0,0-.35-5.61c-.58-3.22-1.58-6.36-2.05-9.58a4,4,0,0,0-2.36-3.12c-.8-.44-1.63-.83-2.46-1.22-5.48-2.54-11.43-4.06-16.57-7.71,0,1.25,0,2.43,0,3.6-.09,4.27,0,8.55-.35,12.8-.28,3.48-1.1,6.92-1.62,10.39a1.93,1.93,0,0,0,.42,1.53c1.52,1.17,3.14,2.2,4.71,3.28,6.61,4.53,12.59,9.69,17.16,16.37C211.36,169.34,212.91,171.06,214.35,172.87ZM113.42,184.56c1.46-.95,2.69-.3,3.86.28,1.57.78,3.11,1.64,4.63,2.5,1.36.77,2.63,1.72,4,2.37a44.27,44.27,0,0,0,5.58,2.14c.67.21,1.92.19,2.18-.21a65.56,65.56,0,0,0,3.91-6.81,2.77,2.77,0,0,0-.54-3.14c-1.13-1.23-2.22-2.51-3.37-3.72-2.7-2.84-5.45-5.62-8.12-8.48-3.84-4.12-7.57-8.35-11.45-12.43-4.87-5.11-11.12-8-17.57-10.46-2.29-.88-4.69-1.48-7.12-2.23-.62,2.72-1.31,5.17-3,7.17a.52.52,0,0,0-.12.33c.09,1.1.19,2.2.3,3.4H88a16.88,16.88,0,0,1,10.86,3.45c1.46,1.18,3,2.3,4.55,3.33a24.51,24.51,0,0,1,10.17,13.36C114.62,178.51,115.51,181.47,113.42,184.56Zm23.28,6.33a4.85,4.85,0,0,0,3.16-2.82,8.11,8.11,0,0,1,1.52-2.55,10.39,10.39,0,0,0,2.92-5.38,7.32,7.32,0,0,1,.62-1.94c1.5-2.86,1.25-5.83.87-8.89a9.27,9.27,0,0,0-2.66-5.35c-1.53-1.63-3-3.29-4.44-5a10.78,10.78,0,0,0-5.46-3.71,23.74,23.74,0,0,1-9.42-5.73c-2.62-2.38-5.26-4.93-8.33-6.59A125.82,125.82,0,0,0,101.6,137a3.27,3.27,0,0,0-2.69.25C96.41,139,94.06,141,91.59,143c.44.13.82.23,1.18.35,7.66,2.44,15.11,5.3,21.11,10.91,2.59,2.42,5.07,5,7.48,7.59,3.42,3.7,6.69,7.53,10.09,11.24,2.24,2.44,4.62,4.75,6.94,7.11a4.8,4.8,0,0,1,1.18,4.89,23.86,23.86,0,0,1-1.64,3.83A22.08,22.08,0,0,1,136.7,190.89ZM37,278.38c.33.3.62.62,1,.87A45.49,45.49,0,0,1,48.31,289.7c1.51,2.16,3.08,4.3,5.52,5.56a2.43,2.43,0,0,1,.89.79c.48.82,1.19.87,2,.88,4.12,0,8.25-.16,12.27,1,1.9.55,3.81,1.09,5.89,1.67-.31-.72-.52-1.31-.8-1.86a4.38,4.38,0,0,1,.39-4.87,9.49,9.49,0,0,1,2.81-2.32c1.53-.91,3.18-1.62,4.78-2.42a3.9,3.9,0,0,0-.11-.42,6.58,6.58,0,0,0-.29-.66c-1.55-3.26-4.26-5.39-7.27-7.08a106.48,106.48,0,0,0-10-4.94,29.35,29.35,0,0,0-8-2.48,32.24,32.24,0,0,0-12.1,1.13A12.54,12.54,0,0,0,37,278.38Zm10.59,113.3c.25-.73.43-1.25.6-1.78,1.25-4.12,2.52-8.24,3.73-12.38a19.85,19.85,0,0,0,.65-3.52,3,3,0,0,0-2.8-3.38c-.91-.1-1.82-.23-2.74-.26A13.39,13.39,0,0,1,38.46,367a15.24,15.24,0,0,0-5-2.64c-3.22-1.06-6.53-1.85-9.82-2.66-2.33-.58-4.82-.68-6.51-2.42-1.58,2.9-3.11,5.69-4.58,8.52a1.41,1.41,0,0,0,.19,1.23A26.31,26.31,0,0,0,20,375.84a29.58,29.58,0,0,1,3.16,2.37,39.1,39.1,0,0,0,11.07,6.35,33.77,33.77,0,0,1,8.49,4.6A34.67,34.67,0,0,0,47.63,391.68ZM89.65,285c-.85-1.21-1.74-2.39-2.53-3.63a31.45,31.45,0,0,0-9.86-9.49c-1.82-1.16-3.75-2.14-5.6-3.26a31.55,31.55,0,0,0-10.48-4.24c-4.63-.87-9.29-1.58-13.91-.56a70.4,70.4,0,0,0-9.86,3.29,17.31,17.31,0,0,0-4.24,2.41c-5.17,3.94-7.65,9.52-9.13,15.62a10.89,10.89,0,0,0-.24,4.74c.84,3.93,2,7.79,3.09,11.67a14.42,14.42,0,0,0,.92,2.07l5.12-2.53A22.78,22.78,0,0,1,31.59,299a9.08,9.08,0,0,1-.88-2.34c-1.28-7-.28-13.4,4.33-19.08a15.71,15.71,0,0,1,9.22-5.86c3.19-.64,6.47-.91,9.72-1.25a15.56,15.56,0,0,1,6.25.89A80.36,80.36,0,0,1,74.84,278c3.84,2.09,7.21,4.75,9,9a1.09,1.09,0,0,0,.87.53A6.47,6.47,0,0,0,89.65,285Zm65.45,91.13c-.64-.59-1.11-1.38-1.76-1.55a5.2,5.2,0,0,1-3-2.55,6.94,6.94,0,0,0-4.61-3.53,1.67,1.67,0,0,1-.95-.48c-1.83-2.28-4.54-3-7-4.18l-.1-.07c-3.6-2.38-7.22-4.72-10.79-7.15-4-2.73-7.92-5.56-11.92-8.27-2.27-1.55-4.65-3-7-4.45-3.86-2.5-7.74-5-11.55-7.53-2.71-1.83-5.23-4-8-5.68-6.42-3.91-12.92-7.67-19.44-11.4a12.78,12.78,0,0,0-4.86-1.87,27.72,27.72,0,0,0-7.88.25c-7.29,1.42-14.52,3.12-21.76,4.78a8.47,8.47,0,0,0-3.08,1.28,96.06,96.06,0,0,0-8.3,6.46,28.32,28.32,0,0,0-6.83,9.61,9.34,9.34,0,0,0,2-1.13c3.2-2.45,6.45-4.85,9.55-7.42a22.09,22.09,0,0,1,7.78-4.11,21.44,21.44,0,0,0,7.07-3.45,5.18,5.18,0,0,1,3.81-1.16c1.27.12,2.56.16,3.81.39a84.43,84.43,0,0,0,17.37,1.78,24.81,24.81,0,0,1,3.8.47,29.6,29.6,0,0,1,17.25,8.41,30.84,30.84,0,0,0,4.4,3.69c3.94,2.6,8,5.05,12,7.55,2.34,1.46,4.75,2.82,7,4.38,1.7,1.18,3.38,2.46,4.1,4.57.29.85,1,.78,1.69.64,2-.42,3,.55,2.48,2.58a1.83,1.83,0,0,0,1,2.19c1.65,1,3.22,2.08,4.88,3.05,2,1.14,3.93,2.3,6,3.24,2.54,1.17,5.16,2.16,7.78,3.16a25.53,25.53,0,0,1,8.95,5.88c1.27,1.26,2.45,2.62,3.72,4ZM123.44,56.25l5.47,10.59c5.09-1.18,10.33-.48,15.53.78,2.79.68,5.52,1.63,8.33,2.24,4.52,1,9.1,1.72,13.63,2.66,2.62.54,5.17,1.41,7.79,1.88,3.81.68,7.74.82,11.47,1.77a19.41,19.41,0,0,0,10.82-.2,7.79,7.79,0,0,1,8.41,2c1.25-4.63,2.51-9.12,3.66-13.64a16.46,16.46,0,0,0,.21-3.16l-.39-.08a12.21,12.21,0,0,0-.57,1.22c-1.23,3.55-3.63,5.53-7.47,5.66-1.27.05-2.54.3-3.81.35-3.19.15-6.37.29-9.55.32-1.23,0-2.45-.38-3.69-.45-4.86-.29-9.74-.45-14.6-.79a72,72,0,0,1-8.55-1c-3.79-.74-7.51-1.86-11.3-2.64-7.47-1.54-14.48-4.51-21.67-6.9A24.42,24.42,0,0,0,123.44,56.25ZM153.5,276.72c0-.11,0-.23,0-.34.17-5.27.18-10.55.55-15.8.24-3.35.82-6.68.21-10a16.26,16.26,0,0,1,2-11,34.18,34.18,0,0,0,1.6-3.48c4.43-10.94,9.84-21.41,15.08-32,2.53-5.09,5.17-10.1,6.85-15.55l.46-1.51A26.88,26.88,0,0,1,169,191.35a2.06,2.06,0,0,0-1.37.93,21.32,21.32,0,0,0-1.69,4.7c-.84,4.8-1.44,9.63-2.19,14.44-.81,5.14-1.91,10.21-4.33,14.89-2,3.87-4.23,7.64-6,11.62-2.23,5.12-4.07,10.41-6.06,15.64a3.43,3.43,0,0,0-.16,1.16c-.07,3.83-.13,7.65-.19,11.48,0,2.27-.12,4.54-.09,6.82a1.65,1.65,0,0,0,.71,1.23C149.53,275.13,151.49,275.89,153.5,276.72ZM88.93,142a13,13,0,0,0,1.49-.8c2-1.53,4.2-3,6.1-4.66a5.77,5.77,0,0,1,6.73-1.07c3.42,1.46,6.92,2.72,10.28,4.31a49.18,49.18,0,0,1,6.77,4c1.69,1.17,3.16,2.66,4.72,4,0-.89,0-1.75,0-2.61a1.12,1.12,0,0,0-.49-.7c-3.53-2.49-7.09-4.93-10.59-7.45a18.86,18.86,0,0,1-6-6.89c-1.73-3.47-3.36-7-5-10.47-.15-.3-.34-.58-.56-.94-.33.42-.55.75-.81,1A3.29,3.29,0,0,1,98.17,121a2.59,2.59,0,0,1-2-2.43,22.21,22.21,0,0,1,0-4.39,3.68,3.68,0,0,0-.58-2.59,21.68,21.68,0,0,1-3.71-7.07,1.81,1.81,0,0,0-.27-.43h-.34c-.85,3.14-1.82,6.27-2.52,9.45a35,35,0,0,0-.82,12.37c.42,3,.78,6.1,1,9.16C89.05,137.28,88.93,139.52,88.93,142Zm59.72,47.09c1.21-.26,2.44-.52,3.67-.8,4.36-1,8.13-3.29,12-5.43a42.22,42.22,0,0,0,4.58-2.85,32.8,32.8,0,0,0,8.38-9.91c2-3.37,4.09-6.69,6.28-9.93,1.81-2.68,2.63-5.47,1.63-8.61a4.65,4.65,0,0,0-1.28-1.86,13.93,13.93,0,0,0-2.19-1.38c-.2.32-.46.67-.66,1.06a92.48,92.48,0,0,1-10.41,16.34c-3.44,4.31-7.2,8.24-12.37,10.56-1.49.67-2.79,1.73-4.23,2.49-2.54,1.35-5.12,2.6-7.69,3.88-.29.15-.6.28-.79.36Zm-2.39-8.73.24.27c1.76-.9,3.55-1.74,5.26-2.71,2.4-1.35,4.7-2.88,7.12-4.2a21.18,21.18,0,0,0,6.66-5.21c3.19-4,6.32-8,9.43-12.07a19.31,19.31,0,0,0,1.43-2.56,3.15,3.15,0,0,0-.94,1,14.68,14.68,0,0,1-5.93,5.1,25.21,25.21,0,0,1-18.93.43c-4.08-1.52-6.06-4.66-6.71-8.75-.46-2.9-.37-2.92-3.28-3.4a.53.53,0,0,1-.12,0c-1.85-.13-3.73-.22-5.27,1-1.22,1-2.31,2.17-3.49,3.29a2.87,2.87,0,0,0,.39.25c.41.15.82.31,1.24.43a13.45,13.45,0,0,1,7.33,5.11,29.1,29.1,0,0,0,3.16,3.59,11.88,11.88,0,0,1,4,7.92c.23,3,.48,5.9-1,8.68A12.84,12.84,0,0,0,146.26,180.37Zm-57-132.6.38.17a59.68,59.68,0,0,0,3.28-5.1,18.14,18.14,0,0,1,7-7.56c.55-.32,1-.74,1.57-1.1a5.23,5.23,0,0,0,2.44-4.91c-.12-2-.36-4.05-.6-6.07-.7-5.89-.63-11.65,2.3-17A21.21,21.21,0,0,0,106.7,3.5a7.6,7.6,0,0,0,.21-.94c-1.69,1.78-3.28,3.38-4.8,5.05-1,1.15-2,2.35-3,3.58-1.32,1.7-2.42,3.59-3.88,5.15A30.55,30.55,0,0,1,90.7,20c-1.54,1.1-3,2.16-2.91,4.34a1.93,1.93,0,0,1-.19.68c-.71,1.84-.69,2,.84,3.24.71.58,1.47,1.11,2.23,1.63,1.12.77,2.28,1.47,3.38,2.27,1.66,1.21,1.64,2.61-.06,3.73-.8.53-1.67,1-2.5,1.43A5.17,5.17,0,0,0,88.86,41,17.65,17.65,0,0,0,89.28,47.77Zm69,175.88.17.07a19.86,19.86,0,0,0,.89-2.4c1-4.15,2-8.29,2.84-12.48.65-3.44.87-7,1.45-10.42.37-2.2,1.05-4.34,1.63-6.62-.78.43-1.63.83-2.42,1.34a18.69,18.69,0,0,1-7.68,2.86c-4,.55-6.58-1-8-4.66-.62-1.64-1.3-3.26-2-4.87a11.29,11.29,0,0,0-1-1.5l-4.83,7.39c1.83,2.92,3.73,6.15,5.83,9.25a20.74,20.74,0,0,0,3.25,3.31,3,3,0,0,0,2.92.72c3-.79,5.31,1.67,5.65,4,.22,1.54.32,3.09.46,4.64ZM38.37,231.51c.53-2,1-3.84,1.47-5.65,1-3.72,2-7.39,4.43-10.54a9.29,9.29,0,0,0,.95-2.56c.24-.69,0-1-.68-1.38a72.21,72.21,0,0,1-8.38-5.29c-4.87-3.9-9.48-8.11-14.21-12.17-1.16-1-2.36-1.92-3.55-2.86a10.56,10.56,0,0,0-1-.59c3.16,5.41,6.08,10.69,9.26,15.81a98,98,0,0,1,9.52,19.05C36.86,227.32,37.58,229.31,38.37,231.51ZM61,326.61c-4-.64-8.38-1.4-12.79-2-1.47-.2-3.06-.39-4.38.68a25.6,25.6,0,0,1-7.92,3.87,20.84,20.84,0,0,0-5.26,2.5C26,335,21.48,338.49,16.88,342c.43.15.86.33,1.31.47,1.86.57,3.72,1.17,5.6,1.67A1.6,1.6,0,0,0,25,343.7a48.49,48.49,0,0,1,15.32-9.2c3.79-1.38,7.7-2.41,11.48-3.81,1.91-.7,3.67-1,5.54.05ZM138,339.42c1.92-2.25,3.74-4.37,5.53-6.51,1.08-1.28,2.18-2.55,3.13-3.93,1.71-2.5,3.26-5.13,5-7.62a12.42,12.42,0,0,1,2.67-2.88c2.13-1.59,4.43-2.46,6.85-.41.24.21.51.38.77.57l4.27,3.22c.61-3.33-1.53-6.16-1.06-9.32-5.76,1.36-31.06,13.63-37.86,18.33C130.2,334.5,134.31,336.66,138,339.42ZM180.4,146.64c-1-1.45-2-2.82-2.91-4.3a5.9,5.9,0,0,0-3.41-2.63,40.79,40.79,0,0,0-18.52-2.13c-4.12.51-8.28.88-12.07,2.82a8,8,0,0,1-6,.48,26.78,26.78,0,0,0-4-.77,3.72,3.72,0,0,0-3.85,1.83,9.62,9.62,0,0,1-1.65,2.55c-1.48,1.56-1.57,1.81-.44,3.69a9.63,9.63,0,0,0,.68,1c1.53,2,1.3,2.92,3.8.27,1.57-1.65,3.28-3.12,5.71-3.16a22.53,22.53,0,0,1,5,.31,5.25,5.25,0,0,0,3.75-.71,67.58,67.58,0,0,1,11-4.88c5.08-1.51,10.3-.53,15.18,1.26,3.37,1.23,4.61,3.15,4.36,6.49-.08,1.15-.13,2.3-.21,3.74C178.18,150.37,179.28,148.53,180.4,146.64Zm-8.22,161.11c-1.36,1.15-2.5,2.14-3.67,3.1a3.86,3.86,0,0,0-1.35,4.38c.44,1.57,1.2,3.31.88,4.77-.77,3.56,1.56,5.18,3.65,7.05,1.21,1.07,2.5,2.05,3.58,2.94,2.17-2,4.16-3.81,6.19-5.61s4.14-3.57,6.49-5.6C182.48,315,177.31,311.35,172.18,307.75ZM114.38,355l.29-.29a11.71,11.71,0,0,0-2.07-2.52q-4.92-3.37-10-6.49c-5.14-3.15-10.35-6.18-14.83-10.3a56.63,56.63,0,0,0-5.9-4.68,38.68,38.68,0,0,0-4.39-2.31c.94,3.17.89,3.58-.46,5.59,1.57.72,3.17,1.36,4.66,2.19a9.12,9.12,0,0,1,2.69,2.11,23.57,23.57,0,0,1,2.28,3.78c1,1.77,1.78,3.58,1.33,5.71,0,.24.37.74.68.86,3.15,1.25,6.36,2.35,9.46,3.69a11.19,11.19,0,0,0,6.87.79C108.3,352.5,111.57,352.7,114.38,355ZM54.43,375.55c-.27,1.13-.44,2.08-.73,3-1.75,5.59-3.53,11.18-5.29,16.77a2.38,2.38,0,0,0,1,3,42.54,42.54,0,0,1,4,3.71,3,3,0,0,0,3.07,1.11c2.2-.54,4.06-1.63,4.84-3.87,1.37-3.89,2.61-7.83,3.91-11.78-1.38.3-2.52-.42-3.59-1.3A19.84,19.84,0,0,1,56,378.89C55.47,377.84,55,376.79,54.43,375.55Zm48.72-191.93c3.15.07,4.26-1.1,3.83-3.72a14.33,14.33,0,0,0-4.45-8.69c-1.22-1.1-2.37-2.26-3.61-3.33a17.06,17.06,0,0,0-9.24-4.49c-1.8-.21-2.6.44-2.59,2.24a29.88,29.88,0,0,0,.38,4.53,7.27,7.27,0,0,0,1.81,4.34c2.26,2.14,4.47,4.33,6.77,6.42A11.65,11.65,0,0,0,103.15,183.62Zm70.47,204.91c.53-4.36,2.38-6.33,5.31-5.76,2.31.45,3.5,2.52,2.85,5a4.76,4.76,0,0,1-2.34,3.18c-1.6.85-3.14.51-4.82-.51.9,2.72-.15,4.85-1.27,6.95-.71,1.34-1.54,2.61-2.2,4a22.73,22.73,0,0,0-1.52,3.89,5.72,5.72,0,0,0,0,2.47c.14.73.72,1.27,1.51.92,1.33-.58,2.63-1.29,2.86-2.94.16-1.13.83-1.5,1.87-1.6a6.89,6.89,0,0,0,2.54-.58,12.4,12.4,0,0,0,5.45-5.39,23.52,23.52,0,0,1,6.32-8.49s0-.14.08-.42c-4-1.68-6.43-5.57-10.54-7.26a22.93,22.93,0,0,1-4.26-2.79l-5.31,4.72C171.23,385.28,172.4,386.86,173.62,388.53ZM130.16,124a21.41,21.41,0,0,0-2.89-12.3,12.39,12.39,0,0,0-3.56-3.79,7.38,7.38,0,0,0-11.12,3.24c-.86,2-1,4.37-1.5,6.56,0,.13.09.3.15.45,1,2.23,1.9,4.47,2.87,6.71,2,4.52,5.7,6.72,10.25,7.8a5.39,5.39,0,0,0,4.26-1.67A12.31,12.31,0,0,0,130.16,124ZM244.43,310.13l.23,0c.42-1.58.74-3.19,1.28-4.73s1.37-3,2-4.48c.86-2.06,1.65-4.14,2.46-6.22,2.62-6.71,4.07-13.89,8.08-20.05a5.05,5.05,0,0,0,.48-1.18c-2.85,1.71-5.62,3.53-8.54,5.08a17.47,17.47,0,0,0-6.33,5.89c-1,1.45-2,2.84-3.11,4.23a2.61,2.61,0,0,0,0,2.77,8.51,8.51,0,0,1,1.59,3c.5,2.82.72,5.69,1,8.55Q244,306.52,244.43,310.13Zm-208.65-30c-4.55,4.86-4.92,17.12-.9,20.19,2.9-.89,5.68-1.94,8.56-2.56s5.86-.81,8.72-1.18c-2.29-1.29-3.88-3.5-5.44-5.71A43.63,43.63,0,0,0,35.78,280.09ZM160.7,278.2a47.28,47.28,0,0,1,15.09,21.74c2.24-1.19,4.36-2.39,6.54-3.46.81-.39,1-.83.68-1.58-.12-.3-.18-.62-.31-.91-3.1-7.25-7.28-13.6-14.55-17.35a1.6,1.6,0,0,0-1-.16C165.1,277,163.07,277.56,160.7,278.2Zm-11.49-87.47a3.56,3.56,0,0,0,3.22,3.2c3.24.61,6.06-.53,8.78-2.07,2.47-1.39,4.9-2.84,7.34-4.26a22.38,22.38,0,0,0,9.61-10.06,59.16,59.16,0,0,1,9.53-15,7,7,0,0,0,1.66-5.51,7.85,7.85,0,0,0-1.76-4.12c-.33,4.43-.66,5.58-2,7.74-2.51,3.95-5,7.91-7.48,11.87a35.86,35.86,0,0,1-6.94,8.21c-3.26,2.8-7.16,4.5-10.84,6.56A26,26,0,0,1,149.21,190.73Zm81.55,1.4c-.46,8-.93,16.05-1.4,24.13l.34.08a7.85,7.85,0,0,0,.84-.79c1.34-1.72,2.72-3.43,4-5.22,1.67-2.35,3.64-3.14,6.42-2.37.71.2,1.41.42,2.16.64-.51-4.41-3.31-9-7.2-12.15C234.18,195.06,232.51,193.6,230.76,192.13Zm-124.28-6.95c3,.65,4.18.12,5.57-2.37a5.22,5.22,0,0,0,.48-4.39c-.57-1.66-1.18-3.31-1.8-4.95A16.66,16.66,0,0,0,105.3,166c-2.65-2.06-5.39-4-8.06-6-3.15-2.42-6.79-2.83-10.57-2.67a1.29,1.29,0,0,0-.81.52c-1.93,2.64-1.89,5.47-.66,8.58v-.86c0-2.72,1.29-4,4-4.05a13.86,13.86,0,0,1,6.08,1.63c3.22,1.5,5.62,4.05,8.22,6.36a16.5,16.5,0,0,1,5.14,8.87C109.49,181.83,109,183.39,106.48,185.18ZM173.4,277.5a24.25,24.25,0,0,1,6.72,7.59c1.74,2.94,3.33,6,5,9,1.43-.37,3-.86,4.59-1.16s3.3-.44,4.9-.64c-2-3.89-4-7.75-5.87-11.64a1.92,1.92,0,0,0-1.85-1.18c-1.48-.09-3-.2-4.41-.42C179.43,278.55,176.42,278,173.4,277.5Zm1.08-124.93c-5.73-1.92-20.55-1.37-26,4.21C153.42,161.52,170.09,161.88,174.48,152.57ZM107.6,63.14a22.15,22.15,0,0,0-4.09,11.91c-.14,4.35-.09,8.71-.38,13-.25,3.64-.59,7.27.16,10.86.7,3.35,1.67,6.65,2.51,10,.21.85.37,1.71.55,2.57.14-5.91.3-11.79.1-17.65-.22-6.46-.18-12.86,1.35-19.18.48-2,.49-4.17,2.34-5.56C109.3,67.15,108.49,65.25,107.6,63.14ZM170.16,189a19.56,19.56,0,0,0,10-4.28,33.75,33.75,0,0,1,2.9-2.31,24.21,24.21,0,0,0,7.58-8.78c2-3.67,1.47-6.74-1.59-9.56-4,4.29-6.73,9.37-9.26,14.59a21.07,21.07,0,0,1-7.41,8.76C171.61,187.89,170.9,188.45,170.16,189Zm36.41,178.14,10,6.15c.64.39,1.05.22,1.47-.38,1.37-1.92,2.73-3.83,4.19-5.68a1.15,1.15,0,0,0,0-1.68,4.77,4.77,0,0,0-1-1c-2.66-1.68-5.34-3.31-8.28-5.13ZM203.66,395c1.05-.26,2.13-.45,3.16-.79.7-.23,1.32-.88,2-1,2.32-.32,3.07-2,4.26-3.74a90.48,90.48,0,0,1,8.45-10.21c1.34-1.43,2.33-2.47,1.68-4.59a23.83,23.83,0,0,1-.43-4.9c-.4.51-.64.82-.87,1.13-2.81,3.73-5.29,7.78-8.51,11.11C209.67,385.93,206.76,390.37,203.66,395ZM116,72.64c-.68-4.74-.37-6.56,1.67-8.06,3.12-2.28,5.86-.85,8.51,1.15-1.38-2.74-2.85-5.34-4.2-8-.37-.74-.76-.92-1.47-.75-2.1.48-4.25.81-6.28,1.47a24.64,24.64,0,0,0-4.45,2.22,1.29,1.29,0,0,0-.43,1.18C110.71,65.93,112.15,70,116,72.64ZM76.16,331.13a1.41,1.41,0,0,0-.12-.59c-.81-1.38-1.39-3-3.4-3.13-1.19-.1-2.35-.54-3.53-.63-1.42-.1-3.13-.47-4.22.15a28.24,28.24,0,0,0-5.44,4.42c-1.23,1.17-1.13,2.09.21,3.21a6.21,6.21,0,0,0,6.82,1.11c1.54-.67,3-1.55,4.55-2.14a8.7,8.7,0,0,1,3.12-.52A1.91,1.91,0,0,0,76.16,331.13ZM103.34,41.7c.59-.55,1-.94,1.45-1.35,1.65-1.56,3.23-3.21,5-4.67a2.37,2.37,0,0,0,.84-2.35c-.28-3.69-.44-7.39-.7-11.09a2.45,2.45,0,0,0-.59-1.44c-1.32-1.35-2.78-.62-4.34-.17.27,2.22.52,4.39.78,6.57.36,3.05.11,5.92-2.5,8.06a.87.87,0,0,0-.33.57C103,37.69,103.18,39.55,103.34,41.7Zm94.38,339.49,8.23,6.38,5.16-6L201.62,375ZM146.3,152.12A24.15,24.15,0,0,1,160,146.21c5-.61,10-1.32,15.18.85a7.46,7.46,0,0,0-.65-1.2,6.79,6.79,0,0,0-4.09-2.3c-1.06-.21-2.11-.44-3.17-.64a18,18,0,0,0-9.13.21,105.54,105.54,0,0,0-10,4.2C145.72,148.43,145.45,149.33,146.3,152.12Zm50,230.47-5.15,4.86a39.92,39.92,0,0,1,3.48,3.25c1.64,1.92,3.84,2.65,6.12,3.25a.83.83,0,0,0,.73-.15c1.21-1.46,2.39-2.95,3.56-4.41Zm-7.09-27.86,6.15,4.16,6.45-7.32-6.59-5.09C193.16,349.37,191.24,352,189.26,354.73Zm15.92,11a76.58,76.58,0,0,1,5.61-6.57c1.34-1.27,1.21-2.4.73-3.78a1.63,1.63,0,0,0-2.81-.82,2.57,2.57,0,0,1-3.48.13c-.64-.46-1.23-1-2-1.66l-6.23,7ZM194.8,381.38l-8.6-6-4.73,4.84,7.95,6.19Zm-4.24-13L187,373.56l9.19,6.39,3.52-5.62Zm-69-292.78c3.59,0,5.69-2.77,4.6-6.08A6.29,6.29,0,0,0,122.91,66a3.57,3.57,0,0,0-5.43,3.65,24,24,0,0,0,1.19,4.23A2.67,2.67,0,0,0,121.52,75.6Zm91,304.56,3.4-4.72-10.32-6.77-3,4.59ZM187.84,129.25c-1.53,2.57-3.08,5-5.53,6.4-.14,2.53-.22,4.88-.41,7.22-.22,2.58.75,4.21,3.3,5.2C187.17,141.94,187.66,135.62,187.84,129.25Zm16.25,238.09-8.4-5.8c-1.35,1.83-2.61,3.55-3.91,5.3l8.86,5.76C201.86,370.75,203,369.09,204.09,367.34Zm-15.91-11-5.63,4.8,7.5,4.76c1.38-1.89,2.68-3.64,4-5.49Zm-21,27.87a30,30,0,0,1-4.09-3.38,11.65,11.65,0,0,0-5.58-3.51,1.11,1.11,0,0,0-.92.12c-.77.73-1.47,1.54-2.26,2.39,2.85,3.16,6.85,4.87,10.28,7.61C165.5,386.27,166.33,385.22,167.15,384.2Zm6.7-9.34,5.44,4.78,5.3-5.38-7-4.81Zm15-7.42-7.48-4.79-2.94,5,7,4.77Zm-76.09-324c-2.18,2-4.31,3.86-6.4,5.81a1.09,1.09,0,0,0-.15,1,35.17,35.17,0,0,0,2.52,3.64,1.83,1.83,0,0,0,1.51.62c1.44-.62,2.75-1.46,3.11-3.21C113.86,48.61,113.19,46,112.72,43.42Zm36.7,296.08,4.53-4.88-5.68-4.25-4.31,5Zm74.86,40a6.85,6.85,0,0,0-.83.66c-2.82,3.25-5.65,6.49-8.4,9.79a9.57,9.57,0,0,0-1.24,2.45c-.12.28-.16.89,0,.95a1.89,1.89,0,0,0,1.21.17,13.58,13.58,0,0,0,2-.76,3,3,0,0,0,1.48-2.94,2.22,2.22,0,0,1,1.18-3.09,26.91,26.91,0,0,1,3.93-1.38c1.42-.42,1.85-.94,1.57-2.42C224.94,381.79,224.61,380.72,224.28,379.46Zm-65.69-51.28-6-4.74-3.39,5.17,5.72,4.24Zm5-5.8c-1.44-1.08-2.78-2.13-4.18-3.09a2.14,2.14,0,0,0-1.55-.43,7,7,0,0,0-4.19,2.95l6,4.8Zm-43-267.47c-.67-4-2.56-6-5.11-5.21-.2,1.91-.43,3.83-2.11,5.14-1.52,1.17-3,2.46-5.3,1.22l.56,2.87C112.31,56.23,116.58,55.94,120.6,54.91Zm-6-12.62a2.25,2.25,0,0,0,2.06-2,10.56,10.56,0,0,0-1-6.85c-1.08-2.31-2.13-4.64-3.2-6.95-.12-.26-.28-.5-.52-.94A60.11,60.11,0,0,0,114.58,42.29ZM105,48c2.45-2.43,4.71-4.65,7-6.9a.84.84,0,0,0,.11-.65c-.24-1.11-.52-2.22-.82-3.43a4.62,4.62,0,0,0-.67.47q-3.34,3.07-6.66,6.17a.88.88,0,0,0-.18.72C104.1,45.48,104.5,46.55,105,48Zm34.62,292.53c1.44,1.32,2.79,2.6,4.2,3.81a1.1,1.1,0,0,0,1.07,0c1-1.12,1.9-2.31,2.94-3.6l-5.28-3.84Zm26.65,47.89,6.22,6.67c.15-1.08.66-2.31.38-3.34-.68-2.53-2.56-4.39-4.07-6.43Zm-89.35-89.7c1.8-3.09,3.27-6.41,6.21-8.72a42,42,0,0,0-5.22,2.4C75.13,293.94,74.79,296.14,76.94,298.73Zm68.7-40.12c-3.21,4.15-3.45,9.44-.79,11.34Q145.24,264.28,145.64,258.61Zm30.06,128.8c0,1.27.69,2.07,1.81,2.06a2.9,2.9,0,0,0,2.5-3,1.66,1.66,0,0,0-1.87-1.7A2.38,2.38,0,0,0,175.7,387.41ZM161.77,149.84,161.3,148l-3.66.55.41,1.84Zm5.19-.11c-.15-2.22-1.3-2.74-3.79-1.66.36.57.61,1.44,1.08,1.59A9.39,9.39,0,0,0,167,149.73Zm-13.57,1.81,2.72-.76-.4-1.74C153.17,149.37,152.71,149.85,153.39,151.54Zm15.4-3.74c.09,2,.46,2.26,2.28,1.78C170.86,147.54,170.74,147.45,168.79,147.8Zm6.35,2.66c0-1.41-1.32-1.46-2.09-2.19C173.05,150.31,173.17,150.44,175.14,150.46Zm-25.23,2.8c1.8-.82,1.8-.82,1.05-2.06C149.31,152,149.27,152.07,149.91,153.26ZM118.38,356.43l-2.09.09,0,.24,1.93.94Z"/><path class="cls-1" d="M105.62.5a3.8,3.8,0,0,1-.39.84c-1.15,1.31-2.33,2.59-3.48,3.89-1.45,1.65-2.94,3.26-4.31,5s-2.63,3.73-4.14,5.41a22.46,22.46,0,0,1-3.61,2.75c-1.43,1-3,2-3.54,3.78a19.69,19.69,0,0,0-1.08,3.59,3.57,3.57,0,0,0,.73,2.52,26.91,26.91,0,0,0,3.79,3.26c1.13.87,2.37,1.6,3.77,2.53-1,.55-1.75,1-2.55,1.45a6.77,6.77,0,0,0-3.93,6.38c.06,2.62.41,5.24.73,7.85a33,33,0,0,1-1.07,13.4c-.44,1.53-.67,3.12-1.17,4.63A3.36,3.36,0,0,1,84,69.47c-3,1.78-6,3.44-9.06,5.16a27.78,27.78,0,0,0-2.65,1.64,97.71,97.71,0,0,1-12.72,7.62C55.53,86,51.89,89,48.06,91.61c-9,6.15-17.93,12.44-27.06,18.4-4.54,3-9.49,5.3-14.19,8-2.18,1.25-4.21,2.75-6.31,4.14V.5Z"/><path class="cls-1" d="M190.1.5c1.29,1.68,2.59,3.34,3.86,5a23.05,23.05,0,0,1,3.42,7.22c1.09,3.5,2.5,6.91,3.5,10.44A36.71,36.71,0,0,1,202,30.12a13.51,13.51,0,0,0,1.45,5.75,18.52,18.52,0,0,1,2,7.59c.27,2.78.36,5.58.78,8.34a38.34,38.34,0,0,0,1.49,4.79,2,2,0,0,1,0,1.24c-.6,1.47-1.33,2.89-1.92,4.37A5.58,5.58,0,0,1,200.6,66c-2.87.23-5.72.73-8.59.84a65.17,65.17,0,0,1-6.68-.37c-4.07-.25-8.14-.47-12.2-.76-3.78-.27-7.59-.43-11.33-1-2.62-.39-5.12-1.66-7.75-2-8.63-1.21-16.69-4.31-24.79-7.25a11.14,11.14,0,0,0-6.55-.77c-.27-.93-.52-1.8-.79-2.66A5.81,5.81,0,0,0,117,47.65c-1.41-.2-1.93-.77-2-2.07a9.11,9.11,0,0,0-.14-1.17c3-1.2,4-3,3.86-6.15a16.79,16.79,0,0,0-1.91-6.74c-1.15-2.28-2.06-4.68-3.13-7a29.43,29.43,0,0,0-2-3.83c-1.6-2.42-3.26-3-6.09-2.32l-.82.15A24.16,24.16,0,0,1,106,10c.7-1.83,1.68-3.55,2.29-5.4A24.05,24.05,0,0,0,109,.5Z"/><path class="cls-1" d="M.5,179.54c1.08.65,2.21,1.23,3.24,2,2.67,1.83,5.28,3.73,8,5.57.65.45,1.43.71,2.1,1.14a3.23,3.23,0,0,1,1.07,1c1.54,2.83,2.95,5.74,4.56,8.53,3.1,5.36,6.43,10.59,9.42,16a87.43,87.43,0,0,1,7.78,19.16,5.38,5.38,0,0,1-.25,4,90.87,90.87,0,0,0-6.94,21.73c-.6,2.88-1.73,5.65-2.33,8.54a42.88,42.88,0,0,0-.33,5.58,3.68,3.68,0,0,1-.49,1.39c-2.66,5.1-5.31,10.32-4.36,16.25.67,4.22,2.22,8.31,3.4,12.44a13.11,13.11,0,0,0,.73,1.67c-.61.32-1.2.61-1.77.94-3.63,2.1-7.29,4.14-10.84,6.35a17.06,17.06,0,0,0-3.26,3c-1.92,2.08-3.82,4.19-5.62,6.38C3.12,323,1.85,324.84.5,326.66Z"/><path class="cls-1" d="M.5,150q2.19-2.43,4.37-4.88c4.32-4.82,8.59-9.68,13-14.46a25.38,25.38,0,0,1,3.81-3.27c3.06-2.23,6.2-4.38,9.32-6.54.64-.45,1.35-.79,2.07-1.21.8,2,1.43,4,2.3,5.8,3.38,7.06,5.13,14.55,6.61,22.2,1.93,10,4.46,19.86,6.59,29.81.9,4.25,1.47,8.57,2.11,12.87.33,2.24.5,4.51.69,6.77a2.32,2.32,0,0,1-.37,1.32q-1.35,2.13-2.83,4.17c-1.47,2-3.19,3.93-3.21,6.73a29,29,0,0,1-7.9-5c-4.81-4.14-9.56-8.36-14.44-12.42a77.26,77.26,0,0,0-6.57-4.6c-3.38-2.27-6.79-4.49-10.19-6.73-1.77-1.16-3.55-2.3-5.32-3.45Z"/><path class="cls-1" d="M.5,124.1a4.42,4.42,0,0,0,1.31-.47c3.83-3.09,8.32-5.07,12.57-7.45A262.28,262.28,0,0,0,40.3,99.35c6-4.38,12.19-8.52,18.31-12.74A12.53,12.53,0,0,1,61,85.26a65.34,65.34,0,0,0,11.47-6.67c3.72-2.51,7.74-4.57,11.91-7-1.41,5.55-1,10.83-1,16.09a11.6,11.6,0,0,1-2.88,7.18,21,21,0,0,1-9.43,6.67,34.88,34.88,0,0,0-11,6.91,13.57,13.57,0,0,1-5.81,3c-5.59,1.47-11.19,3-16.76,4.52a30.69,30.69,0,0,0-10.8,5.56c-1.85,1.46-3.95,2.59-5.77,4.08A58,58,0,0,0,15.05,131c-4.84,5.21-9.56,10.53-14.34,15.8a.68.68,0,0,1-.21.1Z"/><path class="cls-1" d="M.5,331c4.35,3.7,8.72,7.39,13.05,11.11a11.64,11.64,0,0,0,5.7,2.6c1.15.21,2.26.62,3.42.95-4.24,5.12-6.64,11-9.35,16.72A24,24,0,0,1,10,367.27c-1.28,1.52-3.16,1.49-5,1.29-1.5-.16-3-.26-4.52-.38Z"/><path class="cls-1" d="M76,388.09c.14-.47.2-.74.31-1,1.72-4,3.28-8.15,5.23-12.08a27.66,27.66,0,0,1,4.29-6.14c3.15-3.5,6.52-6.8,9.84-10.14.29-.28.89-.24,1.35-.36.06.5.33,1.11.14,1.47a9.72,9.72,0,0,1-1.6,1.92c-2,2.07-3.91,4.25-6.07,6.13-4.18,3.63-6.72,8.25-8.65,13.31C80,383.51,79,385.79,78,388.05a1.94,1.94,0,0,1-1.24.8C76.55,388.9,76.21,388.32,76,388.09Z"/><path class="cls-1" d="M137.63,192.84c.52,1,1,1.93,1.49,2.81,1.6,2.58,3.12,5.22,4.91,7.66a20.38,20.38,0,0,0,3.85,3.55,4.49,4.49,0,0,0,3.66.74c1.92-.32,3.06.39,3.53,2.29a15.26,15.26,0,0,1,.32,2.61c.29,3.91.69,7.81.79,11.71a13.18,13.18,0,0,1-1.77,7.46c-3.46,5.67-5.4,12-7.77,18.16-1.27,3.27-2.54,6.56-4.1,9.7-2.06,4.15-2,8.05.61,11.9.42.62.81,1.26,1.23,1.92-4,.68-7.78,2.12-11.82,1.46-1.56-.25-3.05-1-4.61-1.18a22.91,22.91,0,0,0-11,.68,95.15,95.15,0,0,1-13.84,3.32,21.7,21.7,0,0,0-9.73,4.66c-.62.51-1.28,1-2,1.52a10.6,10.6,0,0,1-.85-1,46.42,46.42,0,0,0-8.22-9.8c-.64-.54-.75-1.87-.81-2.86-.17-2.71-.1-5.44-.28-8.15-.3-4.66-.74-9.32-1.1-14-.2-2.63-.47-5.26-.49-7.89-.06-7.51-1.45-14.85-2.54-22.24-1.16-7.82-2-15.69-2.85-23.55-.64-5.91-1-11.86-1.71-17.76-.34-2.89-1.21-5.7-1.71-8.57-.66-3.77-.57-3.73,2.37-6.12s5.68-4.81,8.53-7.2c.81-.69,1.67-1.32,2.66-2.1.33,1.9.36,3.55-.6,5a9,9,0,0,0-1,7.25,28.56,28.56,0,0,0,10,15.94c3.18,2.64,6.43,5.17,10.61,6.05a23.23,23.23,0,0,0,11.14-.57,2.25,2.25,0,0,1,1.45.1c2.12,1.11,4.16,2.38,6.31,3.44,2.75,1.35,5.53,2.66,8.37,3.8a7.8,7.8,0,0,0,5.75-.29Z"/><path class="cls-1" d="M109.26,115.69a5.15,5.15,0,0,1-.7-1.68c-.12-9.2-.17-18.39-.28-27.59,0-4.8,1-9.43,2-14.07a4.65,4.65,0,0,1,.28-.79A6.12,6.12,0,0,1,111,71a8.55,8.55,0,0,1,1.65,1.26,18.1,18.1,0,0,0,6.27,4.71c2.26,1.19,4.51.68,6.61-.56a5.56,5.56,0,0,0,2.76-5.59c-.11-1.7-.13-1.74,1.54-2.12a27.55,27.55,0,0,1,12.12.4c4.63,1,9.21,2.29,13.84,3.35,3.74.85,7.55,1.37,11.26,2.34a60.11,60.11,0,0,0,9.61,1.92c2.66.24,5.3.71,7.93,1.15,1.26.22,2.47.69,3.72.92a17.16,17.16,0,0,0,8.49-.89,7.1,7.1,0,0,1,5.15.26,1.64,1.64,0,0,1,.65,2.66c-2.13,2.25-2.59,5.07-2.93,8a28.81,28.81,0,0,0-.22,3.34c0,.76-.36,1.15-1,1.2-2.34.19-3.68,1.65-4.81,3.52a40.3,40.3,0,0,0-5.71,19.92c-.07,2.24,0,4.48,0,6.71a5.33,5.33,0,0,1-.5,2.51,79.87,79.87,0,0,1-4.74,7c-1,1.29-1.43,1.09-2.56-.11a3.46,3.46,0,0,0-1.61-.94c-2.27-.58-4.57-1.07-6.87-1.58a48.52,48.52,0,0,0-20.57.11c-2.35.49-4.69,1.08-7.06,1.36a8.15,8.15,0,0,1-4.08-.43,14.5,14.5,0,0,0-8.52-1.42,22.55,22.55,0,0,0,.66-9.34c-.42-5.12-1.93-9.91-6-13.45a9.24,9.24,0,0,0-10-1.84c-3.78,1.5-5.63,4.55-6.31,8.42-.09.55-.09,1.11-.13,1.66C109.53,115.43,109.48,115.45,109.26,115.69Z"/><path class="cls-1" d="M155.42,277.67c0-3.38-.14-6.34,0-9.28.22-3.86.8-7.7,1-11.57a54,54,0,0,0-.31-7.29,13.05,13.05,0,0,1,.91-6.78c3.22-7.1,6.2-14.3,9.54-21.34,3.56-7.46,7.58-14.7,11.09-22.19,2-4.35,3.46-9,5.2-13.51a3.75,3.75,0,0,1,1.22-1.65,26.18,26.18,0,0,0,8.23-9.5,9.24,9.24,0,0,0,1.14-7.14,9.92,9.92,0,0,0-1.67-3,3.88,3.88,0,0,1-.88-3.47,10.64,10.64,0,0,0-2.33-10.08.74.74,0,0,1-.14-.64c1.08.79,2.16,1.56,3.23,2.35,4.75,3.52,9.67,6.85,13.36,11.6,2.52,3.25,5,6.59,7.65,9.69a4.74,4.74,0,0,1,1.07,4.76,179.67,179.67,0,0,1-6.51,22c-2.64,7.29-4.87,14.71-7.58,22-4.66,12.5-9.58,24.9-14.32,37.37a6.49,6.49,0,0,1-3.83,4c-2.71,1.08-5.41,2.17-8.15,3.17-4.21,1.55-8.44,3.06-11.9,6.05-1.24,1.08-2.19,2.49-3.43,3.57A8.48,8.48,0,0,1,155.42,277.67Z"/><path class="cls-1" d="M173.83,377.22c-1.74,1.7-3.24,3.23-4.83,4.67a1.37,1.37,0,0,1-1.3.07,28.86,28.86,0,0,1-3.85-3.19,12.64,12.64,0,0,0-5.19-3.11,7.08,7.08,0,0,1-3.5-2.18,1.43,1.43,0,0,0-.74-.58c-1.6-.32-2.31-1.61-3.11-2.78a8.21,8.21,0,0,0-4.42-3.3,7.21,7.21,0,0,1-2.65-1.91,5.77,5.77,0,0,0-3-1.7,12,12,0,0,1-3.81-1.91c-5.81-3.95-11.53-8.05-17.38-11.95s-12-7.67-17.93-11.55c-2.41-1.56-4.69-3.34-7.08-4.93-3.06-2-6.13-4.05-9.28-5.94-5.09-3.08-10.29-6-15.37-9.09a15.46,15.46,0,0,0-9-2.49,56.43,56.43,0,0,0-10.67,1.42c-4.74,1.11-9.49,2.2-14.27,3.13-5.55,1.07-9.85,4.25-13.84,8a36.31,36.31,0,0,0-7.71,10c-.26.5-.58,1-.88,1.43a2.68,2.68,0,0,1-.23.3L9.45,336c-2.24-1.87-4.47-3.75-6.72-5.61-.83-.69-1.24-1.43-.57-2.46A49.32,49.32,0,0,1,5,323.63c2.09-2.52,4.29-5,6.53-7.34a20,20,0,0,1,3.82-3.43c9.15-5.7,18.57-10.88,29.17-13.38a39.58,39.58,0,0,1,7.48-.69c2.43-.09,4.88.15,7.31.06a36,36,0,0,1,12.61,1.93c4.14,1.34,8.27,2.74,12.39,4.14a26.47,26.47,0,0,1,7.28,3.84c1.62,1.2,3.47,2.11,5.2,3.18a55.78,55.78,0,0,1,6.87,4.35c5.92,4.94,12.52,8.87,18.83,13.23,1.14.79,2.16,1.77,3.23,2.67,2.48,2.07,4.92,4.18,7.43,6.21,3,2.41,6,4.76,9,7.13.53.42,1.05.87,1.61,1.25,3.77,2.57,6.15,6.34,8.61,10a5.7,5.7,0,0,1,.74,2.24c.37,2.4,1.2,3.25,3.54,3.61a2.49,2.49,0,0,1,1.34.85c.93,1,1.65,2.3,3.22,2.52.17,0,.33.2.48.34l11.42,10.39A6.84,6.84,0,0,0,173.83,377.22Z"/><path class="cls-1" d="M102.32,312.9c-3.67-2.52-8.08-3.93-11.43-7.17.1-.13.16-.3.27-.36,3.67-1.78,6.71-4.47,9.94-6.89a90.33,90.33,0,0,1,15.33-8.88,5.71,5.71,0,0,0,1.66-.93c.31-.32.33-.93.47-1.41-.46-.08-1-.38-1.37-.21-6.72,3.29-13.36,6.69-19.28,11.36-2.34,1.85-5,3.26-7.36,5.12-1.37,1.09-2.38.86-3.8.27-2.76-1.16-5.62-2.07-8.58-3.13,1.85-3.39,3.37-6.9,6.61-9.25,2.22-1.61,4.32-3.37,6.48-5.05,1.58-1.22,3.16-2.46,4.76-3.65,3.39-2.51,7.4-3.27,11.42-4a51,51,0,0,0,6.86-1.61,27.45,27.45,0,0,1,13.54-1.53,6.21,6.21,0,0,1,1.29.3c4.24,1.62,8.48,1.25,12.67-.09,2-.65,3.87,0,5.72.58a31,31,0,0,1,3.84,1.67,10.76,10.76,0,0,0,6.26,1.19,2.57,2.57,0,0,1,1.72.46,44.08,44.08,0,0,1,14.2,19.82c.46,1.24.62,2.31-.54,3.32a8.38,8.38,0,0,0-1.27,1.88,13.49,13.49,0,0,1-6.21,5.33c-7.1,3-14.35,5.65-21.12,9.41-4,2.22-8.27,4-12.36,6.08a52.92,52.92,0,0,0-4.86,3.08,2,2,0,0,1-2.74-.05c-2.11-1.63-4.39-3-6.68-4.6,4.58-3.55,8.76-7.47,13.82-10.23,2.2-1.2,4.24-2.7,6.35-4.07a5.92,5.92,0,0,0,.57-.45c.55-.44,1.12-1,.57-1.69s-1.2-.29-1.76.15c-.13.09-.24.21-.37.3a25.69,25.69,0,0,1-2.75,1.93c-6.35,3.39-12,7.83-17.5,12.37a1.14,1.14,0,0,1-1.65.06c-3.63-2.68-7.27-5.34-11.31-8.3a5.17,5.17,0,0,0,1.06-.58A71.62,71.62,0,0,1,125,300.53c1.83-.78,3.55-1.82,5.32-2.75.59-.31,1.2-.69.79-1.47s-1.07-.54-1.68-.25c-9.48,4.71-19.18,9.07-26.86,16.69C102.55,312.81,102.46,312.83,102.32,312.9Z"/><path class="cls-1" d="M240,287c-2.28-2.74-4.42-5.37-6.62-7.94-1.71-2-3.44-4-5.3-5.86a11.75,11.75,0,0,0-3.16-2.12c-4.43-2.12-8.87-4.22-13.37-6.18a20.11,20.11,0,0,0-5.26-1.48,58.85,58.85,0,0,0-6.1-.18q-6.15-.22-12.32-.52a8.36,8.36,0,0,1-1.36-.29,7.18,7.18,0,0,1,.19-.72c1.65-4.08,3.31-8.14,4.93-12.23a1,1,0,0,1,1.22-.79c3.39.17,6.81.39,10.08-.81a7,7,0,0,0,2.8-1.71c3.87-4.36,7.61-8.84,11.44-13.24,1.94-2.23,4-4.39,6-6.56,3.09-3.34,6.24-6.63,9.29-10a36.6,36.6,0,0,0,3.26-4.28c1.62-2.43,2.53-2.81,5.3-2a5.11,5.11,0,0,1,3.85,3.62c2,5.5,4.31,10.89,6.74,16.21,1.29,2.81,3.24,5.31,4.62,8.09a57.5,57.5,0,0,1,5.35,18.2c.26,1.94.46,3.88.73,5.82.44,3.27-.91,5.86-3.07,8.11a28.32,28.32,0,0,1-8.65,6.16,19.83,19.83,0,0,0-8.88,8.28C241.24,285.32,240.66,286.07,240,287Z"/><path class="cls-1" d="M28.52,270.66c.21-1.34.31-2.7.65-4,1.43-5.6,2.83-11.22,4.45-16.78a73.38,73.38,0,0,1,3.37-9.2c2.53-5.73,4-11.79,5.77-17.75a21.71,21.71,0,0,1,2.5-5.4c1.55-2.44,2.4-4.89,1.69-7.81-.35-1.45.42-2.71,1.23-3.88,2.29-3.32,4.51-6.7,6.86-10a54.53,54.53,0,0,0,6.22-12.25c1.08-2.78,2.56-5.41,3.73-8.16a32.52,32.52,0,0,0,1.51-4.76c.42-1.62.71-3.27,1.94-4.67.88,4.65,2,9.14,2.53,13.7.94,8.53,1.33,17.12,2.3,25.65.78,6.9,2.19,13.72,3.1,20.61.64,4.86.95,9.78,1.33,14.67q.78,9.68,1.42,19.36c.23,3.57.29,7.15.44,10.95-2.07-1.18-4-2.12-5.7-3.29-5.56-3.74-11.77-5.38-18.35-6.06-7.27-.76-14,1.09-20.27,4.47A75,75,0,0,0,28.52,270.66Z"/><path class="cls-1" d="M87.5,145c-.69,1.54-1.37,3.09-2.09,4.62a1.41,1.41,0,0,1-.57.59c-3.79,1.81-6.51,5-9.74,7.53-2.23,1.75-4.37,3.62-6.57,5.41s-3.38,4.43-4,7.3a28.75,28.75,0,0,1-1.8,5c-1.36,3.24-2.7,6.49-4.21,9.65s-3.13,6-4.71,9c-.06.13-.19.22-.46.5-.65-4.07-1.23-8-1.93-11.82-.65-3.57-1.43-7.12-2.18-10.67-2.15-10.16-4.35-20.3-6.46-30.47A77.78,77.78,0,0,0,37.25,125c-.73-1.59-1.25-3.28-2-4.89-.39-.91-.25-1.35.75-1.63,4.61-1.28,9.21-2.63,13.82-3.93,1.66-.46,3.32-.91,5-1.27a16.88,16.88,0,0,0,7.73-4.38c3.37-3,7.42-4.81,11.59-6.64a7.65,7.65,0,0,1,0,4.8c-.65,2.26-1.46,4.49-1.94,6.79-.94,4.48-.15,8.9.72,13.31.77,3.91,1.54,7.83,2,11.79.63,5,3.4,7.28,8.43,6.45l3.66-.61Z"/><path class="cls-1" d="M17.93,357.61c3-8.67,9.22-14,16.65-18.29a65.7,65.7,0,0,1,13.67-5.43c1.75-.54,3.49-1.14,5.22-1.75,1.46-.52,2.84-.16,3.15,1.17.87,3.66,6.42,5.86,9.89,4.41,1.73-.72,3.43-1.53,5.1-2.37a3.57,3.57,0,0,1,3.33-.07,23.28,23.28,0,0,0,3.4,1.5c4,1.14,5.76,4.45,7.31,7.85,1,2.21.58,2.87-1.36,4.23a18.36,18.36,0,0,0-3.74,3.46c-2.5,3.12-4.85,6.36-7.19,9.59a43.11,43.11,0,0,0-7.22,15.29,18.9,18.9,0,0,0-.56,4,17.21,17.21,0,0,0,.57,3.26c-1.45,1.51-1.74,1.5-3.55,0-2.7-2.22-4.32-5.15-5.77-8.27a41.44,41.44,0,0,0-3.63-5.87,4.44,4.44,0,0,0-3.55-1.71,36.25,36.25,0,0,1-5-.56,7.69,7.69,0,0,1-3.32-1.47,23.4,23.4,0,0,0-10.35-5c-3.31-.74-6.62-1.52-9.88-2.44A17.63,17.63,0,0,1,17.93,357.61Z"/><path class="cls-1" d="M214.06,134.1a3.56,3.56,0,0,1,.27.51,52.67,52.67,0,0,0,6.39,12.58,19.73,19.73,0,0,1,2.54,7.28c.88,4.17,1.72,8.36,2.36,12.58,1.09,7.15,2.15,14.3,2.92,21.48a66.81,66.81,0,0,1-.06,9.8c-.18,4.75-.48,9.5-.75,14.24-.09,1.67-.22,3.35-.43,5a3.44,3.44,0,0,1-.74,1.73c-2.5,2.9-5.1,5.72-7.61,8.62-2.07,2.39-4,4.86-6.09,7.26-2.54,3-5.17,5.89-7.69,8.89a6.63,6.63,0,0,1-4.53,2.39c-2.57.27-5.15.36-8,.54,1.16-3.33,2.07-6.31,3.22-9.19,4.82-12.1,9.38-24.29,13.34-36.71,2-6.28,4-12.53,5.78-18.9s1.74-12.68,1.18-19.13c-.29-3.34-.41-6.7-.59-10.05-.25-4.82-.44-9.65-.77-14.47a34.14,34.14,0,0,0-.91-4.43Z"/><path class="cls-1" d="M199.65,300.81c-1.32-2-1.36-4.27-1.67-6.46a3.49,3.49,0,0,0-.42-1.57c-3.15-4.33-5.19-9.26-7.58-14a1.92,1.92,0,0,0-1.66-1.13c-5.61-.77-11.31-1.19-16.79-2.52a16.64,16.64,0,0,0-9.2.6,1.87,1.87,0,0,1-.79.09,24,24,0,0,1,7.7-4.95c3.76-1.45,7.57-2.8,11.31-4.31a48.45,48.45,0,0,0,4.33-2.28,1.34,1.34,0,0,1,.73-.21c2.13.28,4.24.76,6.37.88,2.94.17,5.89.07,8.85.1,3.63,0,7.22.1,10.62,1.82,4.28,2.15,8.7,4,13,6.12a10.67,10.67,0,0,1,3.21,2.45c3.63,4.14,7.18,8.36,10.7,12.6.34.42.27,1.18.37,1.78.19,1.11-.75.75-1.26.95-2.31.88-4.63,1.74-6.94,2.64A66.72,66.72,0,0,1,211.25,298c-3.1.22-6.12,1.41-9.17,2.18C201.27,300.33,200.47,300.58,199.65,300.81Z"/><path class="cls-1" d="M201.7,342c.27-2.52.53-4.73.73-7,.65-7,1.67-14.08.81-21.15-.36-3-1.61-5.82-2.47-8.72-.23-.76-.52-1.5-.75-2.18.11-.16.14-.27.2-.28,3.81-1,7.45-2.65,11.45-3a74.29,74.29,0,0,0,8.42-1.1,90.55,90.55,0,0,0,15.66-5.23c3.9-1.58,4.57-1.26,5.29,2.85.46,2.63.53,5.32.82,8,.5,4.48,1,9,1.57,13.44a1.89,1.89,0,0,1-1,2.18c-1.59.84-3.19,1.65-4.77,2.51-3.53,1.93-7,4.05-10.61,5.79a81.44,81.44,0,0,0-12.64,7.29,52.92,52.92,0,0,1-6.87,3.65C205.73,340.05,203.91,340.94,201.7,342Z"/><path class="cls-1" d="M164.88,323.49c.89.78,1.48,1.25,2,1.77a130.2,130.2,0,0,0,19.76,15.14c1.41.92,2.93,1.8,3.59,3.56.12.33.66.53,1,.73.57.28,1.16.5,2,.87-1.14,1.74-2.09,3.45-3.29,5a40.3,40.3,0,0,1-4.14,4.33,48.12,48.12,0,0,0-10.28,13.75c-.9,1.72-2.1,3.28-3.24,5-1-.81-1.86-1.43-2.63-2.17-2.23-2.12-4.41-4.29-6.61-6.43-.29-.27-.58-.69-.92-.74-1.46-.2-2-1.47-2.92-2.28a5.45,5.45,0,0,0-2.56-1.28c-.93-.17-1.44-.56-1.53-1.38a12.84,12.84,0,0,0-2.87-6.18c-1.86-2.52-3.61-5.08-6.38-7.08,3.32-3.71,6.68-7.27,9.81-11S161.78,327.46,164.88,323.49Z"/><path class="cls-1" d="M96.6,40.83c0,2.84,0,5.55,0,8.26,0,3.51-.07,7,.12,10.54.27,4.93-.72,9.71-1.48,14.52-1.16,7.33-2.31,14.67-3.59,22a41.82,41.82,0,0,1-1.82,6.45,78.59,78.59,0,0,0-3.79,15c-.55,4,0,7.95.38,11.93.44,4.16.47,8.37.63,12.55a1.13,1.13,0,0,1-.73.82,35.9,35.9,0,0,1-4.61.71c-2.7.16-4.28-1.35-4.65-4.07-.51-3.71-1.1-7.42-1.69-11.12-.45-2.83-1-5.65-1.45-8.49a17.93,17.93,0,0,1,.83-7.92c.59-2.07,1.23-4.13,1.65-6.24a14.23,14.23,0,0,0,0-3.45c0-.69.28-1,.78-1.43,3.46-3,7-6.08,7.91-10.91a20.38,20.38,0,0,0,.2-3.23c.14-4,.09-8,.49-12C86,72.31,87,70,87.54,67.57c1.15-5.37,2.94-10.66,2.13-16.3,0-.25,0-.63.11-.77,2.82-2.7,4.54-6.15,6.52-9.43C96.33,41,96.42,41,96.6,40.83Z"/><path class="cls-1" d="M101.12,36.83a49.8,49.8,0,0,0,.41,6.46,22.46,22.46,0,0,0,3.69,9,4.34,4.34,0,0,1,1,2.93,33.07,33.07,0,0,0,.56,4.37,3.24,3.24,0,0,1-.4,2,24,24,0,0,0-4.7,15.73,65,65,0,0,1-.43,10.53A40.89,40.89,0,0,0,102.77,105a47.87,47.87,0,0,1,1.35,5.83,8.38,8.38,0,0,0,2.4,4.47,22.27,22.27,0,0,1,5.29,9c1.85,5.58,6,8.57,11.42,10.12a7.06,7.06,0,0,0,6.12-1.34,7.31,7.31,0,0,1,7.84-.64c3.52,1.79,7,1.57,10.6.67a57.44,57.44,0,0,1,16.37-1.82,41.41,41.41,0,0,1,9.2,1.51,33.27,33.27,0,0,1,4.41,1,4.13,4.13,0,0,1,2.32,2.32,34.27,34.27,0,0,1,.1,6l-.46.09c-.25-.38-.53-.75-.75-1.15a6.06,6.06,0,0,0-3.41-2.86,42.2,42.2,0,0,0-18.1-2.76,53.31,53.31,0,0,0-7.48,1,79.66,79.66,0,0,0-8.1,2.49,6.18,6.18,0,0,1-3.51.19,32.58,32.58,0,0,0-5.53-.85c-2.62-.1-4.12,1.09-5.11,3.49a10.36,10.36,0,0,1-1.26,1.77c-5.12-3.66-10.5-6.69-14.77-11.2a11.05,11.05,0,0,1-1.86-2.64c-1.77-3.53-3.44-7.12-5.19-10.67a8.51,8.51,0,0,0-1.26-2,1.49,1.49,0,0,0-2.59.25,10.16,10.16,0,0,1-.94,1.38c-.81.84-1.62.68-1.79-.45a14.94,14.94,0,0,1,0-3.78,5.26,5.26,0,0,0-1-4,25.26,25.26,0,0,1-4.25-9.18,2.45,2.45,0,0,1-.08-1c.77-4.36,1.58-8.71,2.33-13.08,1-6,2-12,3-18a43.46,43.46,0,0,0,.5-10.63c-.18-2.26-.08-4.55-.07-6.83,0-4.16.07-8.31.12-12.47a1,1,0,0,1,.27-.7C99.54,37.9,100.27,37.42,101.12,36.83Z"/><path class="cls-1" d="M176.82,331.17l6.16-5.51c2.15-1.92,4.31-3.81,6.43-5.75.87-.79.89-1.39-.12-2.18-3.22-2.5-6.46-5-9.76-7.36-1.74-1.27-3.61-2.35-5.44-3.5-.74-.46-.92-.88-.4-1.73a13.32,13.32,0,0,1,5-4.55c1.53-.86,3.11-1.64,4.66-2.47.81-.44,1.86-.59,2-1.8,0-.21.57-.44.9-.5,2.57-.53,5.14-1.11,7.74-1.49,1.52-.23,1.91.3,2.27,1.79.47,1.93,1,3.82,1.61,5.72,1.06,3.58,2.48,7.1,3.13,10.75a44.14,44.14,0,0,1,.39,10c-.32,5.66-1,11.3-1.47,16.95-.08.9,0,1.82,0,2.94-1.36-.21-2.63-.44-3.91-.59-1.46-.18-2.94-.28-4.4-.45a1.81,1.81,0,0,1-.84-.3c-2.16-1.51-4.3-3.05-6.44-4.58Z"/><path class="cls-1" d="M214.35,172.87c-1.44-1.81-3-3.53-4.29-5.43-4.57-6.68-10.55-11.84-17.16-16.37-1.57-1.08-3.19-2.11-4.71-3.28a1.93,1.93,0,0,1-.42-1.53c.52-3.47,1.34-6.91,1.62-10.39.35-4.25.26-8.53.35-12.8,0-1.17,0-2.35,0-3.6,5.14,3.65,11.09,5.17,16.57,7.71.83.39,1.66.78,2.46,1.22a4,4,0,0,1,2.36,3.12c.47,3.22,1.47,6.36,2.05,9.58a43.56,43.56,0,0,1,.35,5.61q.54,11.85,1.06,23.7c0,.79,0,1.59,0,2.38Z"/><path class="cls-1" d="M113.42,184.56c2.09-3.09,1.2-6.05.2-9.15a24.51,24.51,0,0,0-10.17-13.36c-1.57-1-3.09-2.15-4.55-3.33A16.88,16.88,0,0,0,88,155.27H86.58c-.11-1.2-.21-2.3-.3-3.4a.52.52,0,0,1,.12-.33c1.73-2,2.42-4.45,3-7.17,2.43.75,4.83,1.35,7.12,2.23,6.45,2.47,12.7,5.35,17.57,10.46,3.88,4.08,7.61,8.31,11.45,12.43,2.67,2.86,5.42,5.64,8.12,8.48,1.15,1.21,2.24,2.49,3.37,3.72a2.77,2.77,0,0,1,.54,3.14,65.56,65.56,0,0,1-3.91,6.81c-.26.4-1.51.42-2.18.21a44.27,44.27,0,0,1-5.58-2.14c-1.4-.65-2.67-1.6-4-2.37-1.52-.86-3.06-1.72-4.63-2.5C116.11,184.26,114.88,183.61,113.42,184.56Z"/><path class="cls-1" d="M136.7,190.89a22.08,22.08,0,0,0,1.23-2,23.86,23.86,0,0,0,1.64-3.83,4.8,4.8,0,0,0-1.18-4.89c-2.32-2.36-4.7-4.67-6.94-7.11-3.4-3.71-6.67-7.54-10.09-11.24-2.41-2.61-4.89-5.17-7.48-7.59-6-5.61-13.45-8.47-21.11-10.91-.36-.12-.74-.22-1.18-.35,2.47-2,4.82-3.93,7.32-5.69a3.27,3.27,0,0,1,2.69-.25,125.82,125.82,0,0,1,13.88,5.88c3.07,1.66,5.71,4.21,8.33,6.59a23.74,23.74,0,0,0,9.42,5.73,10.78,10.78,0,0,1,5.46,3.71c1.41,1.74,2.91,3.4,4.44,5a9.27,9.27,0,0,1,2.66,5.35c.38,3.06.63,6-.87,8.89a7.32,7.32,0,0,0-.62,1.94,10.39,10.39,0,0,1-2.92,5.38,8.11,8.11,0,0,0-1.52,2.55A4.85,4.85,0,0,1,136.7,190.89Z"/><path class="cls-1" d="M37,278.38a12.54,12.54,0,0,1,7.31-4.7,32.24,32.24,0,0,1,12.1-1.13,29.35,29.35,0,0,1,8,2.48,106.48,106.48,0,0,1,10,4.94c3,1.69,5.72,3.82,7.27,7.08a6.58,6.58,0,0,1,.29.66,3.9,3.9,0,0,1,.11.42c-1.6.8-3.25,1.51-4.78,2.42a9.49,9.49,0,0,0-2.81,2.32,4.38,4.38,0,0,0-.39,4.87c.28.55.49,1.14.8,1.86-2.08-.58-4-1.12-5.89-1.67-4-1.16-8.15-1-12.27-1-.83,0-1.54-.06-2-.88a2.43,2.43,0,0,0-.89-.79c-2.44-1.26-4-3.4-5.52-5.56A45.49,45.49,0,0,0,38,279.25C37.66,279,37.37,278.68,37,278.38Z"/><path class="cls-1" d="M47.63,391.68a34.67,34.67,0,0,1-4.91-2.52,33.77,33.77,0,0,0-8.49-4.6,39.1,39.1,0,0,1-11.07-6.35A29.58,29.58,0,0,0,20,375.84,26.31,26.31,0,0,1,12.71,369a1.41,1.41,0,0,1-.19-1.23c1.47-2.83,3-5.62,4.58-8.52,1.69,1.74,4.18,1.84,6.51,2.42,3.29.81,6.6,1.6,9.82,2.66a15.24,15.24,0,0,1,5,2.64,13.39,13.39,0,0,0,8.61,3.36c.92,0,1.83.16,2.74.26a3,3,0,0,1,2.8,3.38,19.85,19.85,0,0,1-.65,3.52c-1.21,4.14-2.48,8.26-3.73,12.38C48.06,390.43,47.88,391,47.63,391.68Z"/><path class="cls-1" d="M89.65,285a6.47,6.47,0,0,1-5,2.47,1.09,1.09,0,0,1-.87-.53c-1.76-4.24-5.13-6.9-9-9a80.36,80.36,0,0,0-14.61-6.61,15.56,15.56,0,0,0-6.25-.89c-3.25.34-6.53.61-9.72,1.25A15.71,15.71,0,0,0,35,277.59c-4.61,5.68-5.61,12.11-4.33,19.08a9.08,9.08,0,0,0,.88,2.34,22.78,22.78,0,0,0,1.34,2.11l-5.12,2.53a14.42,14.42,0,0,1-.92-2.07c-1.08-3.88-2.25-7.74-3.09-11.67a10.89,10.89,0,0,1,.24-4.74c1.48-6.1,4-11.68,9.13-15.62a17.31,17.31,0,0,1,4.24-2.41,70.4,70.4,0,0,1,9.86-3.29c4.62-1,9.28-.31,13.91.56a31.55,31.55,0,0,1,10.48,4.24c1.85,1.12,3.78,2.1,5.6,3.26a31.45,31.45,0,0,1,9.86,9.49C87.91,282.64,88.8,283.82,89.65,285Z"/><path class="cls-1" d="M155.1,376.16l-2.49,2.36c-1.27-1.36-2.45-2.72-3.72-4a25.53,25.53,0,0,0-8.95-5.88c-2.62-1-5.24-2-7.78-3.16-2-.94-4-2.1-6-3.24-1.66-1-3.23-2.07-4.88-3.05a1.83,1.83,0,0,1-1-2.19c.47-2-.44-3-2.48-2.58-.72.14-1.4.21-1.69-.64-.72-2.11-2.4-3.39-4.1-4.57-2.26-1.56-4.67-2.92-7-4.38-4-2.5-8-5-12-7.55a30.84,30.84,0,0,1-4.4-3.69,29.6,29.6,0,0,0-17.25-8.41,24.81,24.81,0,0,0-3.8-.47A84.43,84.43,0,0,1,50.28,323c-1.25-.23-2.54-.27-3.81-.39a5.18,5.18,0,0,0-3.81,1.16,21.44,21.44,0,0,1-7.07,3.45,22.09,22.09,0,0,0-7.78,4.11c-3.1,2.57-6.35,5-9.55,7.42a9.34,9.34,0,0,1-2,1.13,28.32,28.32,0,0,1,6.83-9.61,96.06,96.06,0,0,1,8.3-6.46,8.47,8.47,0,0,1,3.08-1.28c7.24-1.66,14.47-3.36,21.76-4.78a27.72,27.72,0,0,1,7.88-.25,12.78,12.78,0,0,1,4.86,1.87c6.52,3.73,13,7.49,19.44,11.4,2.78,1.7,5.3,3.85,8,5.68,3.81,2.56,7.69,5,11.55,7.53,2.31,1.49,4.69,2.9,7,4.45,4,2.71,7.92,5.54,11.92,8.27,3.57,2.43,7.19,4.77,10.79,7.15l.1.07c2.5,1.14,5.21,1.9,7,4.18a1.67,1.67,0,0,0,.95.48,6.94,6.94,0,0,1,4.61,3.53,5.2,5.2,0,0,0,3,2.55C154,374.78,154.46,375.57,155.1,376.16Z"/><path class="cls-1" d="M123.44,56.25a24.42,24.42,0,0,1,3.72.59c7.19,2.39,14.2,5.36,21.67,6.9,3.79.78,7.51,1.9,11.3,2.64a72,72,0,0,0,8.55,1c4.86.34,9.74.5,14.6.79,1.24.07,2.46.46,3.69.45,3.18,0,6.36-.17,9.55-.32,1.27,0,2.54-.3,3.81-.35,3.84-.13,6.24-2.11,7.47-5.66a12.21,12.21,0,0,1,.57-1.22l.39.08a16.46,16.46,0,0,1-.21,3.16c-1.15,4.52-2.41,9-3.66,13.64a7.79,7.79,0,0,0-8.41-2,19.41,19.41,0,0,1-10.82.2c-3.73-1-7.66-1.09-11.47-1.77-2.62-.47-5.17-1.34-7.79-1.88-4.53-.94-9.11-1.69-13.63-2.66-2.81-.61-5.54-1.56-8.33-2.24-5.2-1.26-10.44-2-15.53-.78Z"/><path class="cls-1" d="M153.5,276.72c-2-.83-4-1.59-5.87-2.46a1.65,1.65,0,0,1-.71-1.23c0-2.28.05-4.55.09-6.82.06-3.83.12-7.65.19-11.48a3.43,3.43,0,0,1,.16-1.16c2-5.23,3.83-10.52,6.06-15.64,1.73-4,4-7.75,6-11.62,2.42-4.68,3.52-9.75,4.33-14.89.75-4.81,1.35-9.64,2.19-14.44a21.32,21.32,0,0,1,1.69-4.7,2.06,2.06,0,0,1,1.37-.93,26.88,26.88,0,0,0,11.38-4.25l-.46,1.51c-1.68,5.45-4.32,10.46-6.85,15.55-5.24,10.55-10.65,21-15.08,32a34.18,34.18,0,0,1-1.6,3.48,16.26,16.26,0,0,0-2,11c.61,3.34,0,6.67-.21,10-.37,5.25-.38,10.53-.55,15.8C153.54,276.49,153.51,276.61,153.5,276.72Z"/><path class="cls-1" d="M88.93,142c0-2.49.12-4.73,0-6.95-.22-3.06-.58-6.12-1-9.16a35,35,0,0,1,.82-12.37c.7-3.18,1.67-6.31,2.52-9.45h.34a1.81,1.81,0,0,1,.27.43,21.68,21.68,0,0,0,3.71,7.07,3.68,3.68,0,0,1,.58,2.59,22.21,22.21,0,0,0,0,4.39,2.59,2.59,0,0,0,2,2.43,3.29,3.29,0,0,0,3.31-1.23c.26-.29.48-.62.81-1,.22.36.41.64.56.94,1.68,3.49,3.31,7,5,10.47a18.86,18.86,0,0,0,6,6.89c3.5,2.52,7.06,5,10.59,7.45a1.12,1.12,0,0,1,.49.7c.06.86,0,1.72,0,2.61-1.56-1.33-3-2.82-4.72-4a49.18,49.18,0,0,0-6.77-4c-3.36-1.59-6.86-2.85-10.28-4.31a5.77,5.77,0,0,0-6.73,1.07c-1.9,1.7-4,3.13-6.1,4.66A13,13,0,0,1,88.93,142Z"/><path class="cls-1" d="M148.65,189.1,145.53,183c.19-.08.5-.21.79-.36,2.57-1.28,5.15-2.53,7.69-3.88,1.44-.76,2.74-1.82,4.23-2.49,5.17-2.32,8.93-6.25,12.37-10.56A92.48,92.48,0,0,0,181,149.39c.2-.39.46-.74.66-1.06a13.93,13.93,0,0,1,2.19,1.38,4.65,4.65,0,0,1,1.28,1.86c1,3.14.18,5.93-1.63,8.61-2.19,3.24-4.29,6.56-6.28,9.93a32.8,32.8,0,0,1-8.38,9.91,42.22,42.22,0,0,1-4.58,2.85c-3.83,2.14-7.6,4.45-12,5.43C151.09,188.58,149.86,188.84,148.65,189.1Z"/><path class="cls-1" d="M146.26,180.37a12.84,12.84,0,0,1,.63-1.87c1.43-2.78,1.18-5.7,1-8.68a11.88,11.88,0,0,0-4-7.92,29.1,29.1,0,0,1-3.16-3.59,13.45,13.45,0,0,0-7.33-5.11c-.42-.12-.83-.28-1.24-.43a2.87,2.87,0,0,1-.39-.25c1.18-1.12,2.27-2.28,3.49-3.29,1.54-1.26,3.42-1.17,5.27-1a.53.53,0,0,0,.12,0c2.91.48,2.82.5,3.28,3.4.65,4.09,2.63,7.23,6.71,8.75a25.21,25.21,0,0,0,18.93-.43,14.68,14.68,0,0,0,5.93-5.1,3.15,3.15,0,0,1,.94-1,19.31,19.31,0,0,1-1.43,2.56c-3.11,4.05-6.24,8.08-9.43,12.07a21.18,21.18,0,0,1-6.66,5.21c-2.42,1.32-4.72,2.85-7.12,4.2-1.71,1-3.5,1.81-5.26,2.71Z"/><path class="cls-1" d="M89.28,47.77A17.65,17.65,0,0,1,88.86,41a5.17,5.17,0,0,1,2.63-3.68c.83-.48,1.7-.9,2.5-1.43,1.7-1.12,1.72-2.52.06-3.73-1.1-.8-2.26-1.5-3.38-2.27-.76-.52-1.52-1.05-2.23-1.63C86.91,27,86.89,26.88,87.6,25a1.93,1.93,0,0,0,.19-.68c-.1-2.18,1.37-3.24,2.91-4.34a30.55,30.55,0,0,0,4.54-3.68c1.46-1.56,2.56-3.45,3.88-5.15.95-1.23,1.95-2.43,3-3.58,1.52-1.67,3.11-3.27,4.8-5.05a7.6,7.6,0,0,1-.21.94,21.21,21.21,0,0,1-1.09,2.66c-2.93,5.39-3,11.15-2.3,17,.24,2,.48,4,.6,6.07a5.23,5.23,0,0,1-2.44,4.91c-.53.36-1,.78-1.57,1.1a18.14,18.14,0,0,0-7,7.56,59.68,59.68,0,0,1-3.28,5.1Z"/><path class="cls-1" d="M158.31,223.65l-.84-9.37c-.14-1.55-.24-3.1-.46-4.64-.34-2.33-2.68-4.79-5.65-4a3,3,0,0,1-2.92-.72,20.74,20.74,0,0,1-3.25-3.31c-2.1-3.1-4-6.33-5.83-9.25l4.83-7.39a11.29,11.29,0,0,1,1,1.5c.7,1.61,1.38,3.23,2,4.87,1.42,3.7,4,5.21,8,4.66a18.69,18.69,0,0,0,7.68-2.86c.79-.51,1.64-.91,2.42-1.34-.58,2.28-1.26,4.42-1.63,6.62-.58,3.46-.8,7-1.45,10.42-.79,4.19-1.85,8.33-2.84,12.48a19.86,19.86,0,0,1-.89,2.4Z"/><path class="cls-1" d="M38.37,231.51c-.79-2.2-1.51-4.19-2.21-6.18a98,98,0,0,0-9.52-19.05c-3.18-5.12-6.1-10.4-9.26-15.81a10.56,10.56,0,0,1,1,.59c1.19.94,2.39,1.87,3.55,2.86,4.73,4.06,9.34,8.27,14.21,12.17a72.21,72.21,0,0,0,8.38,5.29c.64.38.92.69.68,1.38a9.29,9.29,0,0,1-.95,2.56c-2.38,3.15-3.45,6.82-4.43,10.54C39.36,227.67,38.9,229.48,38.37,231.51Z"/><path class="cls-1" d="M61,326.61l-3.66,4.13c-1.87-1-3.63-.75-5.54-.05-3.78,1.4-7.69,2.43-11.48,3.81A48.49,48.49,0,0,0,25,343.7a1.6,1.6,0,0,1-1.21.42c-1.88-.5-3.74-1.1-5.6-1.67-.45-.14-.88-.32-1.31-.47,4.6-3.49,9.11-7,13.77-10.34a20.84,20.84,0,0,1,5.26-2.5,25.6,25.6,0,0,0,7.92-3.87c1.32-1.07,2.91-.88,4.38-.68C52.62,325.21,57,326,61,326.61Z"/><path class="cls-1" d="M138,339.42c-3.64-2.76-7.75-4.92-10.72-8.55,6.8-4.7,32.1-17,37.86-18.33-.47,3.16,1.67,6,1.06,9.32l-4.27-3.22c-.26-.19-.53-.36-.77-.57-2.42-2.05-4.72-1.18-6.85.41a12.42,12.42,0,0,0-2.67,2.88c-1.72,2.49-3.27,5.12-5,7.62-1,1.38-2.05,2.65-3.13,3.93C141.69,335.05,139.87,337.17,138,339.42Z"/><path class="cls-1" d="M180.4,146.64c-1.12,1.89-2.22,3.73-3.49,5.85.08-1.44.13-2.59.21-3.74.25-3.34-1-5.26-4.36-6.49-4.88-1.79-10.1-2.77-15.18-1.26a67.58,67.58,0,0,0-11,4.88,5.25,5.25,0,0,1-3.75.71,22.53,22.53,0,0,0-5-.31c-2.43,0-4.14,1.51-5.71,3.16-2.5,2.65-2.27,1.68-3.8-.27a9.63,9.63,0,0,1-.68-1c-1.13-1.88-1-2.13.44-3.69a9.62,9.62,0,0,0,1.65-2.55,3.72,3.72,0,0,1,3.85-1.83,26.78,26.78,0,0,1,4,.77,8,8,0,0,0,6-.48c3.79-1.94,7.95-2.31,12.07-2.82a40.79,40.79,0,0,1,18.52,2.13,5.9,5.9,0,0,1,3.41,2.63C178.36,143.82,179.41,145.19,180.4,146.64Z"/><path class="cls-1" d="M172.18,307.75c5.13,3.6,10.3,7.2,15.77,11-2.35,2-4.44,3.8-6.49,5.6s-4,3.64-6.19,5.61c-1.08-.89-2.37-1.87-3.58-2.94-2.09-1.87-4.42-3.49-3.65-7.05.32-1.46-.44-3.2-.88-4.77a3.86,3.86,0,0,1,1.35-4.38C169.68,309.89,170.82,308.9,172.18,307.75Z"/><path class="cls-1" d="M114.38,355c-2.81-2.33-6.08-2.53-9.42-1.87a11.19,11.19,0,0,1-6.87-.79c-3.1-1.34-6.31-2.44-9.46-3.69-.31-.12-.73-.62-.68-.86.45-2.13-.37-3.94-1.33-5.71a23.57,23.57,0,0,0-2.28-3.78,9.12,9.12,0,0,0-2.69-2.11c-1.49-.83-3.09-1.47-4.66-2.19,1.35-2,1.4-2.42.46-5.59a38.68,38.68,0,0,1,4.39,2.31,56.63,56.63,0,0,1,5.9,4.68c4.48,4.12,9.69,7.15,14.83,10.3q5.1,3.12,10,6.49a11.71,11.71,0,0,1,2.07,2.52Z"/><path class="cls-1" d="M54.43,375.55c.57,1.24,1,2.29,1.52,3.34a19.84,19.84,0,0,0,5.67,7.32c1.07.88,2.21,1.6,3.59,1.3-1.3,3.95-2.54,7.89-3.91,11.78-.78,2.24-2.64,3.33-4.84,3.87a3,3,0,0,1-3.07-1.11,42.54,42.54,0,0,0-4-3.71,2.38,2.38,0,0,1-1-3c1.76-5.59,3.54-11.18,5.29-16.77C54,377.63,54.16,376.68,54.43,375.55Z"/><path class="cls-1" d="M103.15,183.62a11.65,11.65,0,0,1-7.1-2.7c-2.3-2.09-4.51-4.28-6.77-6.42a7.27,7.27,0,0,1-1.81-4.34,29.88,29.88,0,0,1-.38-4.53c0-1.8.79-2.45,2.59-2.24a17.06,17.06,0,0,1,9.24,4.49c1.24,1.07,2.39,2.23,3.61,3.33A14.33,14.33,0,0,1,107,179.9C107.41,182.52,106.3,183.69,103.15,183.62Z"/><path class="cls-1" d="M173.62,388.53c-1.22-1.67-2.39-3.25-3.44-4.68l5.31-4.72a22.93,22.93,0,0,0,4.26,2.79c4.11,1.69,6.58,5.58,10.54,7.26,0,.28,0,.39-.08.42a23.52,23.52,0,0,0-6.32,8.49,12.4,12.4,0,0,1-5.45,5.39,6.89,6.89,0,0,1-2.54.58c-1,.1-1.71.47-1.87,1.6-.23,1.65-1.53,2.36-2.86,2.94-.79.35-1.37-.19-1.51-.92a5.72,5.72,0,0,1,0-2.47,22.73,22.73,0,0,1,1.52-3.89c.66-1.37,1.49-2.64,2.2-4,1.12-2.1,2.17-4.23,1.27-6.95,1.68,1,3.22,1.36,4.82.51a4.76,4.76,0,0,0,2.34-3.18c.65-2.43-.54-4.5-2.85-5C176,382.2,174.15,384.17,173.62,388.53Z"/><path class="cls-1" d="M130.16,124a12.31,12.31,0,0,1-1.54,7,5.39,5.39,0,0,1-4.26,1.67c-4.55-1.08-8.3-3.28-10.25-7.8-1-2.24-1.91-4.48-2.87-6.71-.06-.15-.18-.32-.15-.45.47-2.19.64-4.52,1.5-6.56a7.38,7.38,0,0,1,11.12-3.24,12.39,12.39,0,0,1,3.56,3.79A21.41,21.41,0,0,1,130.16,124Zm-16.3-6.08a15.05,15.05,0,0,0,4.35,9.5,3.76,3.76,0,0,0,6.24-1.47c1.22-3.68-.77-10.67-3.75-13.12a3.66,3.66,0,0,0-6.09,1.6A23.94,23.94,0,0,0,113.86,117.9Z"/><path class="cls-1" d="M244.43,310.13q-.39-3.6-.79-7.19c-.32-2.86-.54-5.73-1-8.55a8.51,8.51,0,0,0-1.59-3,2.61,2.61,0,0,1,0-2.77c1.07-1.39,2.13-2.78,3.11-4.23a17.47,17.47,0,0,1,6.33-5.89c2.92-1.55,5.69-3.37,8.54-5.08a5.05,5.05,0,0,1-.48,1.18c-4,6.16-5.46,13.34-8.08,20.05-.81,2.08-1.6,4.16-2.46,6.22-.63,1.51-1.45,2.95-2,4.48s-.86,3.15-1.28,4.73Z"/><path class="cls-1" d="M35.78,280.09a43.63,43.63,0,0,1,10.94,10.74c1.56,2.21,3.15,4.42,5.44,5.71-2.86.37-5.84.56-8.72,1.18s-5.66,1.67-8.56,2.56C30.86,297.21,31.23,285,35.78,280.09Z"/><path class="cls-1" d="M160.7,278.2c2.37-.64,4.4-1.2,6.45-1.72a1.6,1.6,0,0,1,1,.16c7.27,3.75,11.45,10.1,14.55,17.35.13.29.19.61.31.91.28.75.13,1.19-.68,1.58-2.18,1.07-4.3,2.27-6.54,3.46A47.28,47.28,0,0,0,160.7,278.2Z"/><path class="cls-1" d="M149.21,190.73a26,26,0,0,0,11.09-3.47c3.68-2.06,7.58-3.76,10.84-6.56a35.86,35.86,0,0,0,6.94-8.21c2.49-4,5-7.92,7.48-11.87,1.37-2.16,1.7-3.31,2-7.74a7.85,7.85,0,0,1,1.76,4.12,7,7,0,0,1-1.66,5.51,59.16,59.16,0,0,0-9.53,15,22.38,22.38,0,0,1-9.61,10.06c-2.44,1.42-4.87,2.87-7.34,4.26-2.72,1.54-5.54,2.68-8.78,2.07A3.56,3.56,0,0,1,149.21,190.73Z"/><path class="cls-1" d="M230.76,192.13c1.75,1.47,3.42,2.93,5.15,4.32,3.89,3.1,6.69,7.74,7.2,12.15-.75-.22-1.45-.44-2.16-.64-2.78-.77-4.75,0-6.42,2.37-1.27,1.79-2.65,3.5-4,5.22a7.85,7.85,0,0,1-.84.79l-.34-.08C229.83,208.18,230.3,200.1,230.76,192.13Z"/><path class="cls-1" d="M106.48,185.18c2.51-1.79,3-3.35,2.19-6.85a16.5,16.5,0,0,0-5.14-8.87c-2.6-2.31-5-4.86-8.22-6.36a13.86,13.86,0,0,0-6.08-1.63c-2.74,0-4,1.33-4,4.05v.86c-1.23-3.11-1.27-5.94.66-8.58a1.29,1.29,0,0,1,.81-.52c3.78-.16,7.42.25,10.57,2.67,2.67,2,5.41,4,8.06,6a16.66,16.66,0,0,1,5.43,7.48c.62,1.64,1.23,3.29,1.8,4.95a5.22,5.22,0,0,1-.48,4.39C110.66,185.3,109.47,185.83,106.48,185.18Z"/><path class="cls-1" d="M173.4,277.5c3,.51,6,1.05,9.06,1.51,1.46.22,2.93.33,4.41.42a1.92,1.92,0,0,1,1.85,1.18c1.91,3.89,3.89,7.75,5.87,11.64-1.6.2-3.27.33-4.9.64s-3.16.79-4.59,1.16c-1.65-3-3.24-6-5-9A24.25,24.25,0,0,0,173.4,277.5Z"/><path class="cls-1" d="M174.48,152.57c-4.39,9.31-21.06,9-26,4.21C153.93,151.2,168.75,150.65,174.48,152.57Z"/><path class="cls-1" d="M107.6,63.14c.89,2.11,1.7,4,2.54,6-1.85,1.39-1.86,3.58-2.34,5.56-1.53,6.32-1.57,12.72-1.35,19.18.2,5.86,0,11.74-.1,17.65-.18-.86-.34-1.72-.55-2.57-.84-3.33-1.81-6.63-2.51-10-.75-3.59-.41-7.22-.16-10.86.29-4.34.24-8.7.38-13A22.15,22.15,0,0,1,107.6,63.14Z"/><path class="cls-1" d="M170.16,189c.74-.53,1.45-1.09,2.21-1.58a21.07,21.07,0,0,0,7.41-8.76c2.53-5.22,5.27-10.3,9.26-14.59,3.06,2.82,3.57,5.89,1.59,9.56a24.21,24.21,0,0,1-7.58,8.78,33.75,33.75,0,0,0-2.9,2.31A19.56,19.56,0,0,1,170.16,189Z"/><path class="cls-1" d="M206.57,367.12l6.36-7.7c2.94,1.82,5.62,3.45,8.28,5.13a4.77,4.77,0,0,1,1,1,1.15,1.15,0,0,1,0,1.68c-1.46,1.85-2.82,3.76-4.19,5.68-.42.6-.83.77-1.47.38Z"/><path class="cls-1" d="M203.66,395c3.1-4.66,6-9.1,9.76-13,3.22-3.33,5.7-7.38,8.51-11.11.23-.31.47-.62.87-1.13a23.83,23.83,0,0,0,.43,4.9c.65,2.12-.34,3.16-1.68,4.59a90.48,90.48,0,0,0-8.45,10.21c-1.19,1.7-1.94,3.42-4.26,3.74-.7.1-1.32.75-2,1C205.79,394.58,204.71,394.77,203.66,395Z"/><path class="cls-1" d="M116,72.64c-3.84-2.64-5.28-6.71-6.65-10.8a1.29,1.29,0,0,1,.43-1.18,24.64,24.64,0,0,1,4.45-2.22c2-.66,4.18-1,6.28-1.47.71-.17,1.1,0,1.47.75,1.35,2.67,2.82,5.27,4.2,8-2.65-2-5.39-3.43-8.51-1.15C115.62,66.08,115.31,67.9,116,72.64Z"/><path class="cls-1" d="M76.16,331.13a1.91,1.91,0,0,1-2,1.88,8.7,8.7,0,0,0-3.12.52c-1.56.59-3,1.47-4.55,2.14a6.21,6.21,0,0,1-6.82-1.11c-1.34-1.12-1.44-2-.21-3.21a28.24,28.24,0,0,1,5.44-4.42c1.09-.62,2.8-.25,4.22-.15,1.18.09,2.34.53,3.53.63,2,.15,2.59,1.75,3.4,3.13A1.41,1.41,0,0,1,76.16,331.13Z"/><path class="cls-1" d="M103.34,41.7c-.16-2.15-.3-4-.41-5.87a.87.87,0,0,1,.33-.57c2.61-2.14,2.86-5,2.5-8.06-.26-2.18-.51-4.35-.78-6.57,1.56-.45,3-1.18,4.34.17a2.45,2.45,0,0,1,.59,1.44c.26,3.7.42,7.4.7,11.09a2.37,2.37,0,0,1-.84,2.35c-1.75,1.46-3.33,3.11-5,4.67C104.37,40.76,103.93,41.15,103.34,41.7Z"/><path class="cls-1" d="M197.72,381.19l3.9-6.19,9.49,6.56-5.16,6Z"/><path class="cls-1" d="M146.3,152.12c-.85-2.79-.58-3.69,1.81-4.79a105.54,105.54,0,0,1,10-4.2,18,18,0,0,1,9.13-.21c1.06.2,2.11.43,3.17.64a6.79,6.79,0,0,1,4.09,2.3,7.46,7.46,0,0,1,.65,1.2C170,144.89,165,145.6,160,146.21A24.15,24.15,0,0,0,146.3,152.12Z"/><path class="cls-1" d="M196.35,382.59l8.74,6.8c-1.17,1.46-2.35,2.95-3.56,4.41a.83.83,0,0,1-.73.15c-2.28-.6-4.48-1.33-6.12-3.25a39.92,39.92,0,0,0-3.48-3.25Z"/><path class="cls-1" d="M189.26,354.73c2-2.73,3.9-5.36,6-8.25l6.59,5.09-6.45,7.32Z"/><path class="cls-1" d="M205.18,365.71,197,360.05l6.23-7c.78.65,1.37,1.2,2,1.66a2.57,2.57,0,0,0,3.48-.13,1.63,1.63,0,0,1,2.81.82c.48,1.38.61,2.51-.73,3.78A76.58,76.58,0,0,0,205.18,365.71Zm-3.9-5.76a2.51,2.51,0,0,0,2.57,2.81,3.1,3.1,0,0,0,3.33-2.89c.08-1.79-1.11-2.91-3.14-3A2.93,2.93,0,0,0,201.28,360Z"/><path class="cls-1" d="M194.8,381.38l-5.38,5.05-7.95-6.19,4.73-4.84Z"/><path class="cls-1" d="M190.56,368.38l9.14,5.95L196.18,380,187,373.56Z"/><path class="cls-1" d="M121.52,75.59a2.65,2.65,0,0,1-2.85-1.74,24,24,0,0,1-1.19-4.23A3.57,3.57,0,0,1,122.91,66a6.29,6.29,0,0,1,3.21,3.55C127.21,72.83,125.11,75.6,121.52,75.59Z"/><path class="cls-1" d="M212.49,380.16l-9.93-6.9,3-4.59,10.32,6.77Z"/><path class="cls-1" d="M187.84,129.25c-.18,6.37-.67,12.69-2.64,18.82-2.55-1-3.52-2.62-3.3-5.2.19-2.34.27-4.69.41-7.22C184.76,134.27,186.31,131.82,187.84,129.25Z"/><path class="cls-1" d="M204.09,367.34c-1.14,1.75-2.23,3.41-3.45,5.26l-8.86-5.76c1.3-1.75,2.56-3.47,3.91-5.3Z"/><path class="cls-1" d="M188.18,356.33l5.91,4.07c-1.36,1.85-2.66,3.6-4,5.49l-7.5-4.76Z"/><path class="cls-1" d="M167.15,384.2c-.82,1-1.65,2.07-2.57,3.23-3.43-2.74-7.43-4.45-10.28-7.61.79-.85,1.49-1.66,2.26-2.39a1.11,1.11,0,0,1,.92-.12,11.65,11.65,0,0,1,5.58,3.51A30,30,0,0,0,167.15,384.2Z"/><path class="cls-1" d="M173.85,374.86l3.7-5.41,7,4.81-5.3,5.38Z"/><path class="cls-1" d="M188.81,367.44l-3.43,5-7-4.77,2.94-5Z"/><path class="cls-1" d="M112.72,43.42c.47,2.61,1.14,5.19.59,7.89-.36,1.75-1.67,2.59-3.11,3.21a1.83,1.83,0,0,1-1.51-.62,35.17,35.17,0,0,1-2.52-3.64,1.09,1.09,0,0,1,.15-1C108.41,47.28,110.54,45.39,112.72,43.42Z"/><path class="cls-1" d="M149.42,339.5,144,335.39l4.31-5,5.68,4.25Z"/><path class="cls-1" d="M224.28,379.46c.33,1.26.66,2.33.87,3.43.28,1.48-.15,2-1.57,2.42a26.91,26.91,0,0,0-3.93,1.38,2.22,2.22,0,0,0-1.18,3.09,3,3,0,0,1-1.48,2.94,13.58,13.58,0,0,1-2,.76,1.89,1.89,0,0,1-1.21-.17c-.12-.06-.08-.67,0-.95a9.57,9.57,0,0,1,1.24-2.45c2.75-3.3,5.58-6.54,8.4-9.79A6.85,6.85,0,0,1,224.28,379.46Z"/><path class="cls-1" d="M158.59,328.18l-3.7,4.67-5.72-4.24,3.39-5.17Z"/><path class="cls-1" d="M163.63,322.38l-3.88,4.23-6-4.8a7,7,0,0,1,4.19-2.95,2.14,2.14,0,0,1,1.55.43C160.85,320.25,162.19,321.3,163.63,322.38Z"/><path class="cls-1" d="M120.6,54.91c-4,1-8.29,1.32-12,4l-.56-2.87c2.29,1.24,3.78-.05,5.3-1.22,1.68-1.31,1.91-3.23,2.11-5.14C118,49,119.93,50.87,120.6,54.91Z"/><path class="cls-1" d="M114.58,42.29A60.11,60.11,0,0,1,112,25.59c.24.44.4.68.52.94,1.07,2.31,2.12,4.64,3.2,6.95a10.56,10.56,0,0,1,1,6.85A2.25,2.25,0,0,1,114.58,42.29Z"/><path class="cls-1" d="M105,48c-.52-1.46-.92-2.53-1.27-3.62a.88.88,0,0,1,.18-.72q3.31-3.11,6.66-6.17a4.62,4.62,0,0,1,.67-.47c.3,1.21.58,2.32.82,3.43a.84.84,0,0,1-.11.65C109.73,43.36,107.47,45.58,105,48Z"/><path class="cls-1" d="M139.64,340.54l2.93-3.66,5.28,3.84c-1,1.29-1.95,2.48-2.94,3.6a1.1,1.1,0,0,1-1.07,0C142.43,343.14,141.08,341.86,139.64,340.54Z"/><path class="cls-1" d="M166.29,388.43l2.53-3.1c1.51,2,3.39,3.9,4.07,6.43.28,1-.23,2.26-.38,3.34Z"/><path class="cls-1" d="M76.94,298.73c-2.15-2.59-1.81-4.79,1-6.32a42,42,0,0,1,5.22-2.4C80.21,292.32,78.74,295.64,76.94,298.73Z"/><path class="cls-1" d="M145.64,258.61q-.39,5.67-.79,11.34C142.19,268.05,142.43,262.76,145.64,258.61Z"/><path class="cls-1" d="M175.7,387.41a2.38,2.38,0,0,1,2.44-2.65,1.66,1.66,0,0,1,1.87,1.7,2.9,2.9,0,0,1-2.5,3C176.39,389.48,175.69,388.68,175.7,387.41Z"/><path class="cls-1" d="M161.77,149.84l-3.72.53-.41-1.84,3.66-.55Z"/><path class="cls-1" d="M167,149.73a9.39,9.39,0,0,1-2.71-.07c-.47-.15-.72-1-1.08-1.59C165.66,147,166.81,147.51,167,149.73Z"/><path class="cls-1" d="M153.39,151.54c-.68-1.69-.22-2.17,2.32-2.5l.4,1.74Z"/><path class="cls-1" d="M168.79,147.8c2-.35,2.07-.26,2.28,1.78C169.25,150.06,168.88,149.78,168.79,147.8Z"/><path class="cls-1" d="M175.14,150.46c-2,0-2.09-.15-2.09-2.19C173.82,149,175.11,149.05,175.14,150.46Z"/><path class="cls-1" d="M149.91,153.26c-.64-1.19-.6-1.28,1.05-2.06C151.71,152.44,151.71,152.44,149.91,153.26Z"/><path class="cls-1" d="M118.38,356.43l-.18,1.27-1.93-.94,0-.24Z"/><path class="cls-1" d="M113.86,117.9a23.94,23.94,0,0,1,.75-3.49,3.66,3.66,0,0,1,6.09-1.6c3,2.45,5,9.44,3.75,13.12a3.76,3.76,0,0,1-6.24,1.47A15.05,15.05,0,0,1,113.86,117.9Zm2-.17a13.15,13.15,0,0,0,3.56,8.14,1.82,1.82,0,0,0,3.25-1c.65-3.89-.61-7.29-3-10.35a.34.34,0,0,0-.09-.08c-1.33-1.2-2.69-.91-3.24.78A18.42,18.42,0,0,0,115.86,117.73Z"/><path class="cls-1" d="M201.28,360A2.93,2.93,0,0,1,204,356.9c2,.06,3.22,1.18,3.14,3a3.1,3.1,0,0,1-3.33,2.89A2.51,2.51,0,0,1,201.28,360Zm3-1.53c-.49.67-.93,1-1,1.48-.05.25.47.62.73.93a5.17,5.17,0,0,0,1.17-1.11C205.26,359.57,204.74,359.06,204.29,358.42Z"/><path class="cls-1" d="M115.86,117.73a18.42,18.42,0,0,1,.52-2.48c.55-1.69,1.91-2,3.24-.78a.34.34,0,0,1,.09.08c2.35,3.06,3.61,6.46,3,10.35a1.82,1.82,0,0,1-3.25,1A13.15,13.15,0,0,1,115.86,117.73Z"/><path class="cls-1" d="M204.29,358.42c.45.64,1,1.15.88,1.3a5.17,5.17,0,0,1-1.17,1.11c-.26-.31-.78-.68-.73-.93C203.36,359.46,203.8,359.09,204.29,358.42Z"/></g></g></svg>