{
  "array":[
  
    {
      "key": 467,
      "name": "Vegetáriánus",
      "value": "2020-10-16",
      "breakfast": [
        {
        "key" : 666,
        "value": "Tehéntej  (2.8%-os)",
        "image": "./animal_orig.jpg",
        "amount": 250,
        "measurement": "ml",
        "kcal": 130,
        "ch" : 20,
        "fat" : 0.5,
        "protein": 8
        }
      ],
      "brunch":[

      ],
      "lunch": [{
        "key" : 975,
"value": "Tyúktojás",
"imge" : "./animal_orig.jpg",
"amount": 100,
"measurement": "g",
"kcal": 60,
        "ch" : 5,
        "fat" : 1,
        "protein": 20
        }
      ],
     "snack":[],
      "dinner":[
        {
          "key" : 56,
          "value": "Alma",
          "image" : "./plant_orig.jpg",
          "amount": 150,
          "measurement": "g",
          "kcal": 90,
        "ch" : 2,
        "fat" : 3,
        "protein": 4
        }
      ],
      "image": "./diet.jpg",
      "sumKcal" : 1500,
      "sumCh" : 80,
      "sumProtein": 120,
      "sumFat" : 15
    }
   
    
  
]
}